{"text_format":"1","workbook":"xlsx","n_sheets":23,"sheets":["Menu","Dados Cadastrais","Produto","Informações","Descrição do Projeto","Orçamento","Dimensionamento de tratores","Informações do Imóvel","Garantias","Atividades não financiadas","Agricultura","Piscicultura-Apicultura","Pecuária","Despesas Fixas","Análise","Mem Atividades não financiadas","Mem agricultura","Mem piscicultura-apicultura","Enquadramento","Suporte forrageiro","Evolução rebanho","Mem pecuaria","Mem despesas fixas"],"not_rendered":{"charts":0,"images":25,"macros":1,"external_links":3,"defined_names":75,"comments":5,"pivot_tables":0},"unopened":[],"bounds":{"document_bytes":16777216,"sheet_cells":100000,"rows_first":2000,"rows_last":500,"rows_between":2000,"halvings":0,"cell_chars":16384,"cell_head_chars":4096},"cells_cut":0,"cells_raw":0,"read":"whole","date_system":"1900"}

{"sheet":"Menu","index":0,"n_rows":0,"n_cols":0,"rows_kept":0,"cut":false,"hidden":false,"merged":[]}

{"sheet":"Dados Cadastrais","index":1,"n_rows":96,"n_cols":18,"rows_kept":96,"cut":false,"hidden":false,"merged":[[5,0,5,9],[66,0,66,9],[3,0,3,9],[13,0,13,9],[15,0,15,9],[72,0,74,3],[72,4,74,9],[75,0,75,9],[48,0,48,3],[48,4,48,9],[33,0,33,3],[33,4,33,9],[34,0,34,3],[34,4,34,9],[35,0,35,3],[35,4,35,9],[41,0,41,3],[41,4,41,9],[42,0,42,3],[42,4,42,9],[43,0,43,3],[43,4,43,9],[20,4,20,9],[21,4,21,9],[2,0,2,3],[2,4,2,9],[24,4,24,9],[25,4,25,9],[31,0,31,9],[32,0,32,3],[4,4,4,9],[19,0,19,9],[4,0,4,3],[14,0,14,3],[16,0,16,3],[14,4,14,9],[16,4,16,9],[6,0,12,3],[6,4,12,9],[23,4,23,9],[26,0,26,3],[27,0,27,3],[28,0,28,3],[29,0,29,3],[32,4,32,9],[20,0,20,3],[21,0,21,3],[22,0,22,3],[95,0,95,3],[94,0,94,3],[94,4,94,9],[95,4,95,9],[93,4,93,9],[93,0,93,3],[36,0,36,3],[36,4,36,9],[37,0,37,3],[37,4,37,9],[38,0,38,9],[39,0,39,3],[39,4,39,9],[40,0,40,3],[40,4,40,9],[91,0,91,3],[44,0,44,3],[44,4,44,9],[45,0,45,3],[45,4,45,9],[46,0,46,3],[46,4,46,9],[86,4,86,9],[83,0,83,3],[22,4,22,9],[92,4,92,9],[92,0,92,3],[90,0,90,3],[47,0,47,3],[47,4,47,9],[63,4,65,9],[63,0,65,3],[67,0,69,3],[67,4,69,9],[76,0,78,3],[76,4,78,9],[90,4,90,9],[91,4,91,9],[85,0,85,3],[87,0,87,3],[81,4,81,9],[82,4,82,9],[83,4,83,9],[84,4,84,9],[85,4,85,9],[87,4,87,9],[86,0,86,3],[82,0,82,3],[84,0,84,3],[23,0,23,3],[24,0,24,3],[25,0,25,3],[81,0,81,3],[29,4,29,9],[26,4,26,9],[27,4,27,9],[28,4,28,9],[51,0,51,3],[52,0,52,3],[53,0,53,3],[30,0,30,3],[30,4,30,9],[60,0,60,3],[60,4,60,9],[56,0,56,3],[56,4,56,5],[56,6,56,7],[56,8,56,9],[57,0,57,3],[57,4,57,5],[57,6,57,7],[57,8,57,9],[51,4,51,5],[51,6,51,7],[51,8,51,9],[52,4,52,5],[53,4,53,5],[52,6,52,7],[52,8,52,9],[53,6,53,7],[53,8,53,9]]}
[]
["1. Produto"]
["Programa:",null,null,null,"PRONAF"]
[]
["Linha de Financiamento:",null,null,null,"PRONAF_INVESTIMENTO_FLORESTA"]
[]
["Finalidade do Crédito:"]
[]
[]
[]
[]
[]
[]
[]
["Data:"]
[]
["Agência:"]
[]
["2. Informações do Proponente"]
["Pessoa Física"]
["Nome Completo:"]
["CPF:"]
["Estado Civil:"]
["Nome Cônjuge:"]
["CPF:"]
["Endereço:"]
["Bairro:"]
["Cidade/UF:"]
["CEP:"]
["Telefone:"]
["CAF-Pronaf:"]
["Pessoa Jurídica"]
["Razão Social:"]
["CNPJ:"]
["Endereço:"]
["Insc. Estadual:"]
["Telefone:"]
["Email:"]
["Representantes Legais"]
["Nome Completo:"]
["CPF:"]
["Estado Civil:"]
["Nome Cônjuge:"]
["CPF:"]
["Nome Completo:"]
["CPF:"]
["Estado Civil:"]
["Nome Cônjuge:"]
["CPF:"]
[]
["3. Renda Bruta Anual nos Últimos 3 Anos (IRPF, IRPJ, CAF,DAP)"]
["Renda Bruta Anual",null,null,null,{"$f":"IF(E15=\"\",YEAR(TODAY()),YEAR(E15))","v":2026},null,{"$f":"E52-1","v":2025},null,{"$f":"G52-1","v":2024}]
["Atividades Agropecuárias:"]
["Atividade não Agropecuárias:"]
[]
["4. Despesas Agropecuária - Últimos 3 Anos"]
["Despesa Anual",null,null,null,{"$f":"IF(E15=\"\",YEAR(TODAY()),YEAR(E15))","v":2026},null,{"$f":"E57-1","v":2025},null,{"$f":"G57-1","v":2024}]
["Atividades Agropecuárias:"]
[]
["5. Porte"]
["Porte do Produtor rural",null,null,null,{"$f":"Enquadramento!B10","v":""}]
[]
["6. Histórico de Contratação de Operação de Crédito Rural"]
["Histórico no Banpará"]
[]
[]
[]
["Histórico em outros Bancos"]
[]
[]
[]
["7. Experiência na Atividade Rural"]
["Experiência na Atividade Financiada"]
[]
[]
[]
["Experiência em outras Atividades Rurais"]
[]
[]
[]
["8. Endividamento referente ao Empreendimento Financiado (Banpará e Outros Bancos)"]
["Período",null,null,null,"Valor Total das Parcelas à Vencer",null,null,null,null,null,null,{"$f":"IF(E15=\"\",TODAY(),E15)","v":"2026-02-02"},{"$f":"EDATE(L82,12)","v":"2027-02-02"},null,"ANO 1",{"$f":"E83","v":0},"ANO 11",{"$f":"$E$88","v":0}]
[{"$f":"CONCATENATE(TEXT(L82,\"mmm/aa\"),\" - \",TEXT(M82,\"mmm/aa\"))","v":"fev/26 - fev/27"},null,null,null,null,null,null,null,null,null,null,{"$f":"M82","v":"2027-02-02"},{"$f":"EDATE(L83,12)","v":"2028-02-02"},null,"ANO 2",{"$f":"E84","v":0},"ANO 12",0]
[{"$f":"CONCATENATE(TEXT(L83,\"mmm/aa\"),\" - \",TEXT(M83,\"mmm/aa\"))","v":"fev/27 - fev/28"},null,null,null,null,null,null,null,null,null,null,{"$f":"M83","v":"2028-02-02"},"2029-02-02",null,"ANO 3",{"$f":"E85","v":0},"ANO 13",0]
["fev/28 - fev/29",null,null,null,null,null,null,null,null,null,null,"2029-02-02","2030-02-02",null,"ANO 4",{"$f":"E86","v":0},"ANO 14",0]
["fev/29 - fev/30",null,null,null,null,null,null,null,null,null,null,"2030-02-02","2031-02-02",null,"ANO 5",{"$f":"E87","v":0},"ANO 15",0]
["fev/30 - fev/31",null,null,null,null,null,null,null,null,null,null,"2031-02-02","2032-02-02",null,"ANO 6",{"$f":"$E$88","v":0},"ANO 16",0]
["Demais anos",null,null,null,null,null,null,null,null,null,null,null,null,null,"ANO 7",{"$f":"$E$88","v":0},"ANO 17",0]
[null,null,null,null,null,null,null,null,null,null,null,null,null,null,"ANO 8",0,"ANO 18",0]
["9. Assistência Técnica",null,null,null,null,null,null,null,null,null,null,null,null,null,"ANO 9",0,"ANO 19",0]
["Nome:",null,null,null,null,null,null,null,null,null,null,null,null,null,"ANO 10",0,"ANO 20",0]
["CPF/CNPJ:"]
["Telefone:"]
["Cidade/UF:"]
["Assistência Técnica Financiada:"]
["N° Parcelas de Assistência Técnica:"]

{"sheet":"Produto","index":2,"n_rows":500,"n_cols":2,"rows_kept":500,"cut":false,"hidden":true,"merged":[]}
["Item","Codigo"]
["Extrativismo De Espécies Nativas - Açaí - Não Se Aplica - Fruticultura / Olericultura",12020160000042]
["Extrativismo De Espécies Nativas - Castanha-Do-Brasil - Não Se Aplica - Ano Civil / Ano De Exploração",12022080000002]
["Extrativismo De Espécies Nativas - Coco - Babaçu - Ano Civil / Ano De Exploração",12022560052002]
["Extrativismo De Espécies Nativas - Coco - Macaúba - Ano Civil / Ano De Exploração",12022560200002]
["Extrativismo De Espécies Nativas - Coco-Da-Baia - Não Se Aplica - Ano Civil / Ano De Exploração",12022620000002]
["Extrativismo De Espécies Nativas - Dendê - Não Se Aplica - Ano Civil / Ano De Exploração",12023140000002]
["Extrativismo De Espécies Nativas - Piaçaba (Piaçava) - Não Se Aplica - Ano Civil / Ano De Exploração",12025900000002]
["Extrativismo De Espécies Nativas - Seringueira - Borracha Natural - Ano Civil / Ano De Exploração",12026640063002]
["Extrativismo De Espécies Nativas - Urucum - Não Se Aplica - Ano Civil / Ano De Exploração",12027240000002]
["Florestamento E Reflorestamento - Colheita, Destoca E Limpeza De Floresta Plantada - Não Se Aplica - Ano Civil / Ano De Exploração",12119500000408]
["Florestamento E Reflorestamento - Florestamento - Tratos Culturais - Não Se Aplica - Ano Civil / Ano De Exploração",12113630000002]
["Florestamento E Reflorestamento - Florestamento - Tratos Culturais - Não Se Aplica - Irrigadas",12113630000052]
["Florestamento E Reflorestamento - Sansão-Do-Campo - Tratos Culturais - Ano Civil / Ano De Exploração",12116550451002]
["Lavoura - Abacate - Não Se Aplica - Fruticultura / Olericultura",12010020000043]
["Lavoura - Abacaxi - Mudas - Fruticultura / Olericultura",12010040213042]
["Lavoura - Abacaxi - Não Se Aplica - Fruticultura / Olericultura",12010040000043]
["Lavoura - Abobrinha - Não Se Aplica - Fruticultura / Olericultura",12010100000043]
["Lavoura - Açaí - Não Se Aplica - Fruticultura / Olericultura",12010160000043]
["Lavoura - Acerola - Não Se Aplica - Fruticultura / Olericultura",12010320000043]
["Lavoura - Alface - Mudas - Fruticultura / Olericultura",12010520213042]
["Lavoura - Alface - Não Se Aplica - Fruticultura / Olericultura",12010520000043]
["Lavoura - Alho - Não Se Aplica - Fruticultura / Olericultura",12010580000043]
["Lavoura - Alho - Nobre - Fruticultura / Olericultura",12010580216043]
["Lavoura - Alho Poró - Não Se Aplica - Fruticultura / Olericultura",12010590000042]
["Lavoura - Amendoim - Não Se Aplica - Safra De Verão (1ª Safra)",12010640000012]
["Lavoura - Andiroba - Não Se Aplica - Fruticultura / Olericultura",12010680000042]
["Lavoura - Aroeira (Pimenta-Rosa) - Não Se Aplica - Fruticultura / Olericultura",12015930000042]
["Lavoura - Arroz - Não Se Aplica - Safra De Verão (1ª Safra)",12010900000013]
["Lavoura - Arroz - Semente - Safra De Verão (1ª Safra)",12010900370011]
["Lavoura - Aveia - Feno - Safra De Inverno (3ª Safra)",12011000414032]
["Lavoura - Aveia - Não Se Aplica - Safra De Inverno (3ª Safra)",12011000000033]
["Lavoura - Banana - Cavendish (Nanica) - Fruticultura / Olericultura",12011160502041]
["Lavoura - Banana - Maçã - Fruticultura / Olericultura",12011160501041]
["Lavoura - Banana - Não Se Aplica - Ano Civil / Ano De Exploração",12011160000001]
["Lavoura - Banana - Não Se Aplica - Fruticultura / Olericultura",12011160000043]
["Lavoura - Banana - Prata - Fruticultura / Olericultura",12011160500041]
["Lavoura - Cacau - Não Se Aplica - Fruticultura / Olericultura",12011420000842]
["Lavoura - Cacau - Saf - Fruticultura / Olericultura",12011420505041]
["Lavoura - Caju - Castanha - Fruticultura / Olericultura",12011780089043]
["Lavoura - Caju - Fruto - Fruticultura / Olericultura",12011780169043]
["Lavoura - Cana-De-Açucar - Açucar E Álcool - Safra De Verão (1ª Safra)",12011840021011]
["Lavoura - Cana-De-Açucar - Álcool Para Fins Carburantes - Safra De Verão (1ª Safra)",12011840026012]
["Lavoura - Cana-De-Açucar - Mudas - Safra De Verão (1ª Safra)",12011840213012]
["Lavoura - Cana-De-Açucar - Não Se Aplica - Safra De Verão (1ª Safra)",12011840000013]
["Lavoura - Castanha-Do-Brasil - Não Se Aplica - Fruticultura / Olericultura",12012080000042]
["Lavoura - Cebolinha Verde - Não Se Aplica - Fruticultura / Olericultura",12012220000042]
["Lavoura - Cevada - Não Se Aplica - Safra De Inverno (3ª Safra)",12012320000032]
["Lavoura - Chicoria - Não Se Aplica - Fruticultura / Olericultura",12012380000042]
["Lavoura - Coco - Não Se Aplica - Fruticultura / Olericultura",12012560000042]
["Lavoura - Coco-Da-Baia - Não Se Aplica - Fruticultura / Olericultura",12012620000042]
["Lavoura - Coentro - Não Se Aplica - Fruticultura / Olericultura",12012660000042]
["Lavoura - Cogumelo - Não Se Aplica - Fruticultura / Olericultura",12012680000043]
["Lavoura - Couve - Não Se Aplica - Fruticultura / Olericultura",12012800000042]
["Lavoura - Couve-Flor - Não Se Aplica - Fruticultura / Olericultura",12012820000043]
["Lavoura - Cupuaçu - Não Se Aplica - Fruticultura / Olericultura",12012980000042]
["Lavoura - Curauá - Não Se Aplica - Fruticultura / Olericultura",12013080000042]
["Lavoura - Dendê - Não Se Aplica - Fruticultura / Olericultura",12013140000042]
["Lavoura - Feijão - Caupi (Macaçar) - Fruticultura / Olericultura",12013560093043]
["Lavoura - Feijão - Não Se Aplica - Safra De Inverno (3ª Safra)",12013560000033]
["Lavoura - Feijão - Não Se Aplica - Safra De Verão (1ª Safra)",12013560000811]
["Lavoura - Feijão - Não Se Aplica - Safrinha (2ª Safra)",12013560000022]
["Lavoura - Feijão - Semente - Safra De Verão (1ª Safra)",12013560370011]
["Lavoura - Flores - Amarilis - Fruticultura / Olericultura",12013600030042]
["Lavoura - Flores - Camomila - Safra De Inverno (3ª Safra)",12013600425433]
["Lavoura - Flores - Flores Diversas - Fruticultura / Olericultura",12013600995042]
["Lavoura - Flores - Gypsophi - Fruticultura / Olericultura",12013600175042]
["Lavoura - Flores - Lavanda - Fruticultura / Olericultura",12013600449042]
["Lavoura - Flores - Lírio - Fruticultura / Olericultura",12013600196042]
["Lavoura - Flores - Lírio Da Paz - Fruticultura / Olericultura",12013600666042]
["Lavoura - Flores - Orquídea - Fruticultura / Olericultura",12013600227043]
["Lavoura - Flores - Rosa - Fruticultura / Olericultura",12013600261042]
["Lavoura - Florestamento E Reflorestamento - Mudas Diversas - Ano Civil / Ano De Exploração",12013620214002]
["Lavoura - Frutas Diversas N. E. - Mudas - Fruticultura / Olericultura",12013660213042]
["Lavoura - Fumo - Não Se Aplica - Safra De Verão (1ª Safra)",12013680000013]
["Lavoura - Gengibre - Não Se Aplica - Fruticultura / Olericultura",12013720000043]
["Lavoura - Girassol - Não Se Aplica - Safra De Verão (1ª Safra)",12013760000011]
["Lavoura - Girassol - Não Se Aplica - Safrinha (2ª Safra)",12013760000021]
["Lavoura - Goiaba - Não Se Aplica - Fruticultura / Olericultura",12013780000043]
["Lavoura - Graviola - Não Se Aplica - Fruticultura / Olericultura",12013860000043]
["Lavoura - Graviola - Não Se Aplica - Irrigadas",12013860000053]
["Lavoura - Hortaliças - Não É Aplicável - Fruticultura / Olericultura",12013920990042]
["Lavoura - Hortaliças - Não É Aplicável - Irrigadas",12013920990052]
["Lavoura - Hortaliças - Não Se Aplica - Fruticultura / Olericultura",12013920000042]
["Lavoura - Hortaliças - Não Se Aplica - Irrigadas",12013920000052]
["Lavoura - Hortelã - Não Se Aplica - Fruticultura / Olericultura",12013940000042]
["Lavoura - Hortelã - Não Se Aplica - Irrigadas",12013940000052]
["Lavoura - Laranja - Kinkan, Xinxam - Fruticultura / Olericultura",12014140355042]
["Lavoura - Laranja - Mudas - Irrigadas",12014140213053]
["Lavoura - Laranja - Não Se Aplica - Fruticultura / Olericultura",12014140000043]
["Lavoura - Laranja - Não Se Aplica - Irrigadas",12014140000051]
["Lavoura - Limão - Não Se Aplica - Fruticultura / Olericultura",12014460000043]
["Lavoura - Limão - Não Se Aplica - Irrigadas",12014460000053]
["Lavoura - Madeira - Ipê - Ano Civil / Ano De Exploração",12014660448002]
["Lavoura - Madeira - Resinas, Essências E Produtos Análogos - Ano Civil / Ano De Exploração",12014660259003]
["Lavoura - Madeira - Resinas, Essências E Produtos Análogos - Irrigadas",12014660259053]
["Lavoura - Mamão - Não Se Aplica - Fruticultura / Olericultura",12014700000842]
["Lavoura - Mamão - Não Se Aplica - Irrigadas",12014700000853]
["Lavoura - Mamona - Não Se Aplica - Irrigadas",12014720000052]
["Lavoura - Mamona - Não Se Aplica - Safra De Verão (1ª Safra)",12014720000011]
["Lavoura - Mandioca (Aipim, Macaxeira) - Álcool Para Fins Carburantes - Safra De Verão (1ª Safra)",12014760026012]
["Lavoura - Mandioca (Aipim, Macaxeira) - De Mesa - Irrigadas",12014760371052]
["Lavoura - Mandioca (Aipim, Macaxeira) - De Mesa - Safra De Verão (1ª Safra)",12014760371011]
["Lavoura - Mandioca (Aipim, Macaxeira) - Não Se Aplica - Irrigadas",12014760000052]
["Lavoura - Mandioca (Aipim, Macaxeira) - Não Se Aplica - Safra De Verão (1ª Safra)",12014760000013]
["Lavoura - Mandioquinha (Batata: Baroa, Salsa, Aipo) - Não Se Aplica - Fruticultura / Olericultura",12014780000043]
["Lavoura - Mandioquinha (Batata: Baroa, Salsa, Aipo) - Não Se Aplica - Irrigadas",12014780000053]
["Lavoura - Manga - Não É Aplicável - Irrigadas",12014800990052]
["Lavoura - Manga - Não Se Aplica - Fruticultura / Olericultura",12014800000043]
["Lavoura - Manga - Não Se Aplica - Irrigadas",12014800000053]
["Lavoura - Mangostão - Não Se Aplica - Fruticultura / Olericultura",12014815000042]
["Lavoura - Mangostão - Não Se Aplica - Irrigadas",12014815000052]
["Lavoura - Manjericão - Não Se Aplica - Fruticultura / Olericultura",12014820000042]
["Lavoura - Manjericão - Não Se Aplica - Irrigadas",12014820000052]
["Lavoura - Maracujá - Mudas - Irrigadas",12014920213052]
["Lavoura - Maracujá - Não Se Aplica - Fruticultura / Olericultura",12014920000043]
["Lavoura - Maracujá - Não Se Aplica - Irrigadas",12014920000053]
["Lavoura - Maxixe - Não Se Aplica - Fruticultura / Olericultura",12014960000042]
["Lavoura - Maxixe - Não Se Aplica - Irrigadas",12014960000053]
["Lavoura - Melancia - Clima Ameno - Fruticultura / Olericultura",12015000485041]
["Lavoura - Melancia - Clima Ameno - Irrigadas",12015000485051]
["Lavoura - Melancia - Clima Quente - Fruticultura / Olericultura",12015000480041]
["Lavoura - Melancia - Clima Quente - Irrigadas",12015000480051]
["Lavoura - Melancia - Não Se Aplica - Fruticultura / Olericultura",12015000000043]
["Lavoura - Melancia - Não Se Aplica - Irrigadas",12015000000053]
["Lavoura - Melão - Não Se Aplica - Fruticultura / Olericultura",12015020000043]
["Lavoura - Melão - Não Se Aplica - Irrigadas",12015020000053]
["Lavoura - Milheto - Não Se Aplica - Safrinha (2ª Safra)",12015060000022]
["Lavoura - Milho - Não É Aplicável - Irrigadas",12015080990051]
["Lavoura - Milho - Não Se Aplica - Irrigadas",12015080000053]
["Lavoura - Milho - Não Se Aplica - Safra De Verão (1ª Safra)",12015080000011]
["Lavoura - Milho - Não Se Aplica - Safrinha (2ª Safra)",12015080000023]
["Lavoura - Milho - Pipoca - Irrigadas",12015080244052]
["Lavoura - Milho - Pipoca - Safra De Verão (1ª Safra)",12015080244012]
["Lavoura - Milho - Semente - Safra De Verão (1ª Safra)",12015080370011]
["Lavoura - Milho Silagem - Não Se Aplica - Safra De Verão (1ª Safra)",12015081000011]
["Lavoura - Murici - Não Se Aplica - Fruticultura / Olericultura",12015200000042]
["Lavoura - Palma - Forrageira - Ano Civil / Ano De Exploração",12015640330408]
["Lavoura - Palma - Não É Aplicável - Irrigadas",12015640990052]
["Lavoura - Palma - Não Se Aplica - Fruticultura / Olericultura",12015640000042]
["Lavoura - Palmeira - Real - Fruticultura / Olericultura",12015660255043]
["Lavoura - Palmeira - Real - Irrigadas",12015660255052]
["Lavoura - Pastagem - Feno E Silagem - Ano Civil / Ano De Exploração",12015760162002]
["Lavoura - Pastagem - Feno E Silagem - Irrigadas",12015760162053]
["Lavoura - Pepino - Não Se Aplica - Fruticultura / Olericultura",12015800000043]
["Lavoura - Pepino - Não Se Aplica - Irrigadas",12015800000053]
["Lavoura - Pimenta - Hortícula - Fruticultura / Olericultura",12015920177043]
["Lavoura - Pimenta - Hortícula - Irrigadas",12015920177053]
["Lavoura - Pimenta-Do-Reino - Não Se Aplica - Fruticultura / Olericultura",12015940000043]
["Lavoura - Pimenta-Do-Reino - Não Se Aplica - Irrigadas",12015940000053]
["Lavoura - Pimentão - Não É Aplicável - Irrigadas",12015960990052]
["Lavoura - Pimentão - Não Se Aplica - Fruticultura / Olericultura",12015960000043]
["Lavoura - Pimentão - Não Se Aplica - Irrigadas",12015960000053]
["Lavoura - Pitaya - Não Se Aplica - Fruticultura / Olericultura",12016010000042]
["Lavoura - Pitaya - Não Se Aplica - Irrigadas",12016010000052]
["Lavoura - Plantas Ornamentais - Mudas - Fruticultura / Olericultura",12016040213042]
["Lavoura - Plantas Ornamentais - Não Se Aplica - Fruticultura / Olericultura",12016040000042]
["Lavoura - Plantas Ornamentais - Não Se Aplica - Irrigadas",12016040000053]
["Lavoura - Plantas Ornamentais - Não Se Aplica - Safra De Verão (1ª Safra)",12016040000013]
["Lavoura - Plantas Ornamentais - Ornamentais, Aromáticas, Essencias Florestais - Fruticultura / Olericultura",12016040464042]
["Lavoura - Plantas Ornamentais - Ornamentais, Aromáticas, Essencias Florestais - Irrigadas",12016040464052]
["Lavoura - Plantas Para Infusão - Não Se Aplica - Fruticultura / Olericultura",12016045000042]
["Lavoura - Plantas Para Infusão - Não Se Aplica - Irrigadas",12016045000052]
["Lavoura - Pupunha - Não Se Aplica - Fruticultura / Olericultura",12016260000043]
["Lavoura - Pupunha - Não Se Aplica - Irrigadas",12016260000051]
["Lavoura - Quiabo - Não Se Aplica - Fruticultura / Olericultura",12016300000043]
["Lavoura - Quiabo - Não Se Aplica - Irrigadas",12016300000052]
["Lavoura - Rúcula - Não Se Aplica - Fruticultura / Olericultura",12016480000042]
["Lavoura - Rúcula - Não Se Aplica - Irrigadas",12016480000052]
["Lavoura - Rúcula - Semente - Fruticultura / Olericultura",12016480370042]
["Lavoura - Rúcula - Semente - Irrigadas",12016480370052]
["Lavoura - Salsa - Não Se Aplica - Fruticultura / Olericultura",12016560000043]
["Lavoura - Salsa - Não Se Aplica - Irrigadas",12016560000053]
["Lavoura - Seringueira - Borracha Natural - Fruticultura / Olericultura",12016640063043]
["Lavoura - Seringueira - Borracha Natural - Irrigadas",12016640063052]
["Lavoura - Seringueira - Mudas - Fruticultura / Olericultura",12016640213043]
["Lavoura - Seringueira - Mudas - Irrigadas",12016640213052]
["Lavoura - Seringueira - Mudas - Safra De Verão (1ª Safra)",12016640213012]
["Lavoura - Soja - Não Se Aplica - Irrigadas",12016720000052]
["Lavoura - Soja - Não Se Aplica - Safra De Verão (1ª Safra)",12016720000013]
["Lavoura - Sorgo - Forrageira - Safra De Verão (1ª Safra)",12016740330011]
["Lavoura - Sorgo - Forrageira - Safrinha (2ª Safra)",12016740330021]
["Lavoura - Sorgo - Granífero - Safra De Verão (1ª Safra)",12016740174011]
["Lavoura - Sorgo - Granífero - Safrinha (2ª Safra)",12016740174021]
["Lavoura - Sorgo - Não Se Aplica - Irrigadas",12016740000052]
["Lavoura - Sorgo - Não Se Aplica - Safra De Verão (1ª Safra)",12016740000013]
["Lavoura - Sorgo - Não Se Aplica - Safrinha (2ª Safra)",12016740000023]
["Lavoura - Tangerina - Mudas - Fruticultura / Olericultura",12016780213043]
["Lavoura - Tangerina - Mudas - Irrigadas",12016780213053]
["Lavoura - Tangerina - Não Se Aplica - Fruticultura / Olericultura",12016780000043]
["Lavoura - Tangerina - Não Se Aplica - Irrigadas",12016780000051]
["Lavoura - Taperebá - Não Se Aplica - Fruticultura / Olericultura",12016900000042]
["Lavoura - Tomate - Cereja - Fruticultura / Olericultura",12016940432042]
["Lavoura - Tomate - Cereja - Irrigadas",12016940432053]
["Lavoura - Tomate - Estaqueado - Fruticultura / Olericultura",12016940148043]
["Lavoura - Tomate - Estaqueado - Irrigadas",12016940148053]
["Lavoura - Tomate - Não É Aplicável - Irrigadas",12016940990052]
["Lavoura - Tomate - Não Se Aplica - Fruticultura / Olericultura",12016940000842]
["Lavoura - Tomate - Não Se Aplica - Irrigadas",12016940000852]
["Lavoura - Tomate - Rasteiro - Fruticultura / Olericultura",12016940254043]
["Lavoura - Tomate - Rasteiro - Irrigadas",12016940254052]
["Lavoura - Trigo - Duplo Propósito - Safra De Inverno (3ª Safra)",12017100453031]
["Pastagem - Pastagem - Não Se Aplica - Ano Civil / Ano De Exploração",12105760000408]
["Apicultura - Abelha - Geléia Real - Ano Civil / Ano De Exploração",22550060460408]
["Apicultura - Abelha - Mel - Ano Civil / Ano De Exploração",22550060205408]
["Aquicultura - Alevinos - Criação De Peixes Em Tanques-Redes E/Ou Sistema Fluxo Continuo (Raceway) - Ano Civil / Ano De Exploração",22607470342408]
["Aquicultura - Armação Para Barco De Pesca - Manutenção/Aquisição - Ano Civil / Ano De Exploração",22607460333002]
["Aquicultura - Camarão E/Ou Lagosta - Não É Aplicável - Ano Civil / Ano De Exploração",22601790990408]
["Aquicultura - Camarão E/Ou Lagosta - Não Se Aplica - Ano Civil / Ano De Exploração",22601790000408]
["Aquicultura - Carcinicultura (Cultivo De Camarão E Lagosta) - Manutenção/Criação - Ano Civil / Ano De Exploração",22607495336002]
["Aquicultura - Carcinicultura (Cultivo De Camarão E Lagosta) - Produção De Larvas E Crias - Ano Civil / Ano De Exploração",22607495340002]
["Aquicultura - Peixe - Alevinos - Ano Civil / Ano De Exploração",22605830028408]
["Aquicultura - Peixe - Alevinoss - Ano Civil / Ano De Exploração",22605830888408]
["Aquicultura - Peixe - Não É Aplicável - Ano Civil / Ano De Exploração",22605830990408]
["Aquicultura - Peixe - Não Se Aplica - Ano Civil / Ano De Exploração",22605830000408]
["Aquicultura - Produtos Aquicolas (Armazenamento, Acondicionamento E Preservação, Inclusive Seguro, Impostos Etc) ",22607480334002]
["Aquicultura - Produtos Aquicolas (Armazenamento, Acondicionamento E Preservação, Inclusive Seguro, Impostos Etc) - Manutenção/Criação ",22607480336002]
["Aquicultura - Ranicultura (Cultivo De Rã) - Manutenção/Criação - Ano Civil / Ano De Exploração",22607520336002]
["Aquisição E Manutenção De Animais - Aves - Não Se Aplica - Ano Civil / Ano De Exploração",22311020000408]
["Aquisição E Manutenção De Animais - Bovinos - Não Se Aplica - Ano Civil / Ano De Exploração",22311300000408]
["Aquisição E Manutenção De Animais - Búfalos (Bubalinos) - Não Se Aplica - Ano Civil / Ano De Exploração",22311400000408]
["Aquisição E Manutenção De Animais - Ovinos - Não Se Aplica - Ano Civil / Ano De Exploração",22315580000408]
["Aquisição E Manutenção De Animais - Suínos - Não Se Aplica - Ano Civil / Ano De Exploração",22316760000408]
["Avicultura - Aves Exceto Galináceos - Carne - Ano Civil / Ano De Exploração",22393835074408]
["Avicultura - Aves Exceto Galináceos - Ovos De Pequeno Porte (Produção De) - Ano Civil / Ano De Exploração",22393835344408]
["Avicultura - Galináceos - Carne - Ano Civil / Ano De Exploração",22393830074408]
["Avicultura - Galináceos - Matrizes De Postura (Produção De) - Ano Civil / Ano De Exploração",22393830347408]
["Avicultura - Galináceos - Ovos - Ano Civil / Ano De Exploração",22393830406408]
["Avicultura - Galináceos - Ovos Férteis (Produção De) - Ano Civil / Ano De Exploração",22393830345408]
["Avicultura - Galináceos - Pintinho - Ano Civil / Ano De Exploração",22393830422408]
["Bovinocultura - Bovinos - Sêmen - Ano Civil / Ano De Exploração",22371300277008]
["Bubalinocultura - Búfalos (Bubalinos) - Carne - Ano Civil / Ano De Exploração",22631400074408]
["Bubalinocultura - Búfalos (Bubalinos) - Carnes - Ano Civil / Ano De Exploração",22631400951408]
["Bubalinocultura - Búfalos (Bubalinos) - Leite - Ano Civil / Ano De Exploração",22631400190408]
["Bubalinocultura - Búfalos (Bubalinos) - Leites - Ano Civil / Ano De Exploração",22631400952408]
["Minhocultura - Minhoca - Não Se Aplica - Ano Civil / Ano De Exploração",22565100000408]
["Ovinocultura - Ovinos - Carne - Ano Civil / Ano De Exploração",22775580074408]
["Ovinocultura - Ovinos - Carne E Lã - Ano Civil / Ano De Exploração",22775580083408]
["Ovinocultura - Ovinos - Carnes - Ano Civil / Ano De Exploração",22775580951408]
["Ovinocultura - Ovinos - Lâ - Ano Civil / Ano De Exploração",22775580455408]
["Ovinocultura - Ovinos - Leite - Ano Civil / Ano De Exploração",22775580190408]
["Ovinocultura - Ovinos - Leites - Ano Civil / Ano De Exploração",22775580952408]
["Pesca - Armação Para Barco De Pesca - Manutenção/Aquisição - Ano Civil / Ano De Exploração",22507460333408]
["Pesca - Pescado - Captura (Aquisição De Cordas, Redes, Anzois, Boias, Mão-De Obra, Seguros, Impostos, Fretes, Carretos, Conservação De Embarcações E Equipamentos ",22505860071408]
["Pesca - Pescado (Armazenamento, Acondicionamento E Preservacao, Inclusive Seguro, Impostos, Fretes Etc) - Beneficiamento E Industrialização - Ano Civil / Ano De Exploração",22505865334002]
["Pesca - Pescado (Armazenamento, Acondicionamento E Preservacao, Inclusive Seguro, Impostos, Fretes Etc) - Manutenção/Criação - Ano Civil / Ano De Exploração",22505865336408]
["Pesca - Petrechos Para Pesca (Anzóis, Iscas, Cordas, Bóias, Combustivel, Redes, Mão-De-Obra Etc) - Aquisição - Ano Civil / Ano De Exploração",22507615332408]
["Serviços Profissionais/Técnicos - Vacinas, Sais Minerais E Medicamentos - Não Se Aplica - Ano Civil / Ano De Exploração",22907300000408]
["Suinocultura - Suínos - Carne - Ano Civil / Ano De Exploração",22386760074408]
["Suinocultura - Suínos - Carnes - Ano Civil / Ano De Exploração",22386760951408]
["Suinocultura - Suínos - Leitão - Ano Civil / Ano De Exploração",22386760189408]
["Suinocultura - Suínos - Sêmen - Ano Civil / Ano De Exploração",22386760277408]
["Aquicultura - Embarcação Pequena (Até 20 A/B) - Aquisição - Ano Civil / Ano De Exploração",13607535332002]
["Aquisição De Ativos Operacionais - Agroindústria - Caseira ",13700440087408]
["Aquisição De Ativos Operacionais - Agroindústria - Instalação Completa Para Beneficiamento ",13700440183408]
["Aquisição De Ativos Operacionais - Armazém, Depósito, Silo, Galpão, Paiol, Estufa E Instalações Congêneres ",13703180110408]
["Aquisição De Ativos Operacionais - Biodigestor, Esterqueira, Tanques De Oxidação Biológica E Tratamento De Água E Esgoto ",13707695000408]
["Aquisição De Veículos - Aquisição De Empilhadeira(S)/Tombadora(S) - Não Se Aplica - Ano Civil / Ano De Exploração",13150855000408]
["Aquisição De Veículos - Caminhões - Não Se Aplica - Ano Civil / Ano De Exploração",13151800000002]
["Aquisição De Veículos - Camionetas - Não Se Aplica - Ano Civil / Ano De Exploração",13151820000002]
["Aquisição De Veículos - Carretas, Carroças E Vagões De Carga, Forrageiros E Demais - Não Se Aplica - Ano Civil / Ano De Exploração",13152040000002]
["Aquisição De Veículos - Motocicletas E Motonetas - Carga, Transporte E Turismo Rural - Ano Civil / Ano De Exploração",13155150356002]
["Aquisição De Veículos - Ônibus, Micro-Ônibus E Vans - Carga, Transporte E Turismo Rural - Ano Civil / Ano De Exploração",13155310356002]
["Aquisição De Veículos - Triciclos E Quadriclos - Carga, Transporte E Turismo Rural - Ano Civil / Ano De Exploração",13157230356002]
["Aquisição De Veículos - Veículo Aéreo Não Tripulado (Drone) - Não Se Aplica - Ano Civil / Ano De Exploração",13157330000408]
["Florestamento E Reflorestamento - Açaí - Não Se Aplica - Ano Civil / Ano De Exploração",13110160000408]
["Florestamento E Reflorestamento - Paricá - Não Se Aplica - Ano Civil / Ano De Exploração",13115720000408]
["Formação De Culturas Perenes - Abacate - Não Se Aplica - Ano Civil / Ano De Exploração",13120020000002]
["Formação De Culturas Perenes - Abacaxi - Não Se Aplica - Ano Civil / Ano De Exploração",13120040000002]
["Formação De Culturas Perenes - Açaí - Não Se Aplica - Ano Civil / Ano De Exploração",13120160000002]
["Formação De Culturas Perenes - Acerola - Não Se Aplica - Ano Civil / Ano De Exploração",13120320000002]
["Formação De Culturas Perenes - Andiroba - Não Se Aplica - Ano Civil / Ano De Exploração",13120680000002]
["Formação De Culturas Perenes - Banana - Cavendish (Nanica) - Fruticultura / Olericultura",13121160502041]
["Formação De Culturas Perenes - Banana - Cavendish (Nanica) - Irrigadas",13121160502051]
["Formação De Culturas Perenes - Banana - Maçã - Fruticultura / Olericultura",13121160501041]
["Formação De Culturas Perenes - Banana - Maçã - Irrigadas",13121160501051]
["Formação De Culturas Perenes - Banana - Não Se Aplica - Ano Civil / Ano De Exploração",13121160000002]
["Formação De Culturas Perenes - Banana - Não Se Aplica - Irrigadas",13121160000051]
["Formação De Culturas Perenes - Banana - Prata - Fruticultura / Olericultura",13121160500041]
["Formação De Culturas Perenes - Banana - Prata - Irrigadas",13121160500051]
["Formação De Culturas Perenes - Cacau - Não Se Aplica - Ano Civil / Ano De Exploração",13121420000002]
["Formação De Culturas Perenes - Cacau - Não Se Aplica - Fruticultura / Olericultura",13121420000041]
["Formação De Culturas Perenes - Cacau - Não Se Aplica - Irrigadas",13121420000051]
["Formação De Culturas Perenes - Cacau - Saf - Fruticultura / Olericultura",13121420505041]
["Formação De Culturas Perenes - Cacau - Saf - Irrigadas",13121420505051]
["Formação De Culturas Perenes - Caju - Não Se Aplica - Ano Civil / Ano De Exploração",13121780000002]
["Formação De Culturas Perenes - Cana-De-Açucar - Álcool Para Fins Carburantes - Ano Civil / Ano De Exploração",13121840026002]
["Formação De Culturas Perenes - Cana-De-Açucar - Fundação - Ano Civil / Ano De Exploração",13121840171002]
["Formação De Culturas Perenes - Cana-De-Açucar - Renovação - Ano Civil / Ano De Exploração",13121840257002]
["Formação De Culturas Perenes - Castanha-Do-Brasil - Não Se Aplica - Ano Civil / Ano De Exploração",13122080000002]
["Formação De Culturas Perenes - Coco - Babaçu - Fruticultura / Olericultura",13122560052042]
["Formação De Culturas Perenes - Coco-Da-Baia - Não Se Aplica - Ano Civil / Ano De Exploração",13122620000002]
["Formação De Culturas Perenes - Cupuaçu - Não Se Aplica - Ano Civil / Ano De Exploração",13122980000002]
["Formação De Culturas Perenes - Curauá - Não Se Aplica - Ano Civil / Ano De Exploração",13123080000002]
["Formação De Culturas Perenes - Dendê - Não Se Aplica - Ano Civil / Ano De Exploração",13123140000002]
["Formação De Culturas Perenes - Flores - Lavanda - Fruticultura / Olericultura",13123600449042]
["Formação De Culturas Perenes - Flores - Não Se Aplica - Ano Civil / Ano De Exploração",13123600000002]
["Formação De Culturas Perenes - Florestamento E Reflorestamento - Eucalipto Grandis - Ano Civil / Ano De Exploração",13123620152002]
["Formação De Culturas Perenes - Florestamento E Reflorestamento - Recuperação Ambiental - Ano Civil / Ano De Exploração",13123620452408]
["Formação De Culturas Perenes - Goiaba - Não Se Aplica - Ano Civil / Ano De Exploração",13123780000002]
["Formação De Culturas Perenes - Graviola - Não Se Aplica - Ano Civil / Ano De Exploração",13123860000002]
["Formação De Culturas Perenes - Laranja - Não Se Aplica - Ano Civil / Ano De Exploração",13124140000002]
["Formação De Culturas Perenes - Laranja - Não Se Aplica - Fruticultura / Olericultura",13124140000842]
["Formação De Culturas Perenes - Limão - Não Se Aplica - Ano Civil / Ano De Exploração",13124460000002]
["Formação De Culturas Perenes - Limão - Não Se Aplica - Fruticultura / Olericultura",13124460000041]
["Formação De Culturas Perenes - Madeira - Acácia Negra - Ano Civil / Ano De Exploração",13124660019002]
["Formação De Culturas Perenes - Madeira - Mogno - Ano Civil / Ano De Exploração",13124660994002]
["Formação De Culturas Perenes - Madeira - Pinus Oocarpa - Ano Civil / Ano De Exploração",13124660242002]
["Formação De Culturas Perenes - Madeira - Teca - Ano Civil / Ano De Exploração",13124660285002]
["Formação De Culturas Perenes - Mamão - Não Se Aplica - Ano Civil / Ano De Exploração",13124700000002]
["Formação De Culturas Perenes - Mamona - Não Se Aplica - Ano Civil / Ano De Exploração",13124720000002]
["Formação De Culturas Perenes - Mamona - Não Se Aplica - Irrigadas",13124720000052]
["Formação De Culturas Perenes - Mandioca (Aipim, Macaxeira) - Álcool Para Fins Carburantes - Ano Civil / Ano De Exploração",13124760026002]
["Formação De Culturas Perenes - Mandioca (Aipim, Macaxeira) - Não Se Aplica - Ano Civil / Ano De Exploração",13124760000002]
["Formação De Culturas Perenes - Manga - Não Se Aplica - Ano Civil / Ano De Exploração",13124800000002]
["Formação De Culturas Perenes - Maracujá - Não Se Aplica - Ano Civil / Ano De Exploração",13124920000002]
["Formação De Culturas Perenes - Murici - Não Se Aplica - Fruticultura / Olericultura",13125200000042]
["Formação De Culturas Perenes - Palma - Forrageira - Ano Civil / Ano De Exploração",13125640330408]
["Formação De Culturas Perenes - Palmeira - Real - Ano Civil / Ano De Exploração",13125660255408]
["Formação De Culturas Perenes - Pastagem - Feno E Silagem - Ano Civil / Ano De Exploração",13125760162408]
["Formação De Culturas Perenes - Pimenta - Hortícula - Ano Civil / Ano De Exploração",13125920177002]
["Formação De Culturas Perenes - Pimenta-Do-Reino - Não Se Aplica - Ano Civil / Ano De Exploração",13125940000002]
["Formação De Culturas Perenes - Pitaya - Não Se Aplica - Ano Civil / Ano De Exploração",13126010000408]
["Formação De Culturas Perenes - Pupunha - Não Se Aplica - Ano Civil / Ano De Exploração",13126260000002]
["Formação De Culturas Perenes - Sansão-Do-Campo - Não Se Aplica - Ano Civil / Ano De Exploração",13126550000408]
["Formação De Culturas Perenes - Seringueira - Borracha Natural - Ano Civil / Ano De Exploração",13126640063002]
["Formação De Culturas Perenes - Tangerina - Não Se Aplica - Ano Civil / Ano De Exploração",13126780000002]
["Formação De Culturas Perenes - Tangerina - Não Se Aplica - Fruticultura / Olericultura",13126780000041]
["Formação De Culturas Perenes - Taperebá - Não Se Aplica - Ano Civil / Ano De Exploração",13126900000002]
["Formação De Culturas Perenes - Toranja - Não Se Aplica - Fruticultura / Olericultura",13126960000041]
["Formação De Culturas Perenes - Urucum - Não Se Aplica - Ano Civil / Ano De Exploração",13127240000002]
["Máquinas, Equipamentos, Materiais E Utensílios - Aquisição De Aquecedores, Geradores, Incineradores, Compressores, Ventiladores E Apar. De Ar Condic. ",13140847000408]
["Máquinas, Equipamentos, Materiais E Utensílios - Aquisição De Caixas D'Água, Lonas, Toldos, Campânulas - Não Se Aplica - Ano Civil / Ano De Exploração",13147715000408]
["Máquinas, Equipamentos, Materiais E Utensílios - Aquisição De Destiladores, Filtros, Depuradores E Dosadores - Não Se Aplica - Ano Civil / Ano De Exploração",13140851000408]
["Máquinas, Equipamentos, Materiais E Utensílios - Aquisição De Equipamentos Para Moldagem, Tornos, Moinhos E Prensa - Não Se Aplica - Ano Civil / Ano De Exploração",13140848000408]
["Máquinas, Equipamentos, Materiais E Utensílios - Aquisição De Ferramenta Portátil Manual Para Tratos Culturais - Não Se Aplica - Ano Civil / Ano De Exploração",13140858000408]
["Máquinas, Equipamentos, Materiais E Utensílios - Aquisição De Ferramentas E Tubos - Não Se Aplica - Ano Civil / Ano De Exploração",13140852000408]
["Máquinas, Equipamentos, Materiais E Utensílios - Aquisição De Maquina(S)/Equipamento(S) Para Extração/Fabricação - Não Se Aplica - Ano Civil / Ano De Exploração",13140854000408]
["Máquinas, Equipamentos, Materiais E Utensílios - Aquisição De Material De Estocagem/Transporte/Sacaria/Caixas - Não Se Aplica - Ano Civil / Ano De Exploração",13140853000408]
["Máquinas, Equipamentos, Materiais E Utensílios - Aquisição De Motores E Elevadores - Não Se Aplica - Ano Civil / Ano De Exploração",13140849000408]
["Máquinas, Equipamentos, Materiais E Utensílios - Base Para Balança - Construção Ou Reforma - Ano Civil / Ano De Exploração",13141175108408]
["Máquinas, Equipamentos, Materiais E Utensílios - Cercas, Aramados, Telhas, Telas Para Sombreamento E Coberturas De Solo - Não É Aplicável - Ano Civil / Ano De Exploração",13140850990408]
["Máquinas, Equipamentos, Materiais E Utensílios - Colheitadeiras, Colhedeiras E Arrancadeiras - Ancinhos  Mecânicos, Ceifeiras-Atadeiras, Segadeiras, Trilhos, Trilhadeiras, Plataforma P/ Colheita ",13142700042002]
["Máquinas, Equipamentos, Materiais E Utensílios - Colheitadeiras, Colhedeiras E Arrancadeiras - Automotriz Importado - Ano Civil / Ano De Exploração",13142700050002]
["Máquinas, Equipamentos, Materiais E Utensílios - Colheitadeiras, Colhedeiras E Arrancadeiras - Automotriz Nacional - Ano Civil / Ano De Exploração",13142700051002]
["Máquinas, Equipamentos, Materiais E Utensílios - Colheitadeiras, Colhedeiras E Arrancadeiras - Importado - Ano Civil / Ano De Exploração",13142700178002]
["Máquinas, Equipamentos, Materiais E Utensílios - Colheitadeiras, Colhedeiras E Arrancadeiras - Nacional - Ano Civil / Ano De Exploração",13142700215002]
["Máquinas, Equipamentos, Materiais E Utensílios - Construção/Recuperação Barragem/Tanque, Sistemas Captação De Água - Não Se Aplica - Ano Civil / Ano De Exploração",13147705000408]
["Máquinas, Equipamentos, Materiais E Utensílios - Cultivador - Motorizado (Micro-Trator) - Ano Civil / Ano De Exploração",13142920212002]
["Máquinas, Equipamentos, Materiais E Utensílios - Despolpador - Não Se Aplica - Ano Civil / Ano De Exploração",13143240000002]
["Máquinas, Equipamentos, Materiais E Utensílios - Eletrificação Rural - Abrange A Instalação De Força E Luz Elétrica Em Benfeitorias - Ano Civil / Ano De Exploração",13143280014408]
["Máquinas, Equipamentos, Materiais E Utensílios - Equipamentos E Utensilios Para Agricultura De Precisão - Não Se Aplica - Ano Civil / Ano De Exploração",13140857000408]
["Máquinas, Equipamentos, Materiais E Utensílios - Estufas/Viveiros (Ilumin. Artificial, Mudas, Sementes, Sacos, Talagarças, Bandejas, Vasos) - Não Se Aplica - Ano Civil / Ano De Exploração",13143490000408]
["Máquinas, Equipamentos, Materiais E Utensílios - Hidroponia/Fazenda Vertical (Alvenaria, Madeira, Aço, Etc) - Não É Aplicável - Ano Civil / Ano De Exploração",13143550990408]
["Máquinas, Equipamentos, Materiais E Utensílios - Implantação De Tecnologias De Energia Renovável, Ambiental E Pequenas Aplicações Hidroenergéticas - Não Se Aplica - Ano Civil / Ano De Exploração",13147694000408]
["Máquinas, Equipamentos, Materiais E Utensílios - Instalação/Montagem/Transporte De Equipamento(S) - Não Se Aplica - Ano Civil / Ano De Exploração",13147730000408]
["Máquinas, Equipamentos, Materiais E Utensílios - Instalações Para Industrialização E Beneficiamento - Abrange A Compra De Maquinaria Necessária Ao Seu Funcionamento,  Balanças, Prensas, ",13144000012408]
["Máquinas, Equipamentos, Materiais E Utensílios - Irrigação - Construção Ou Reforma De Açudes, Abertura De Canais De Irrigação, Compra De Aparelhagem Necessária Aos Serviços De Irrigação ",13144020109408]
["Máquinas, Equipamentos, Materiais E Utensílios - Irrigação/Lixiviação (Gotejador, Aspersor, Nebulizador, Exaustor, Ventilador, Mangueiras, Canais Et) - Cultivo Protegido - Fruticultura / Olericultura",13143330352042]
["Máquinas, Equipamentos, Materiais E Utensílios - Lavador - Não Se Aplica - Ano Civil / Ano De Exploração",13144260000002]
["Máquinas, Equipamentos, Materiais E Utensílios - Máquinas E Implementos - Adaptação Do Solo  (Destocadores, Destorroadores, Niveladores, Terraceadores, Retroescavadeira,Etc) - Ano Civil / Ano De Exploração",13144860022002]
["Máquinas, Equipamentos, Materiais E Utensílios - Máquinas E Implementos - Correção Do Solo E Combate As  Pragas (Distribuidores De Calcarios E De Fertilizantes, Pulverizadores, Vaporizadores, Insufladores, Nebulizadores Etc)",13144860111002]
["Máquinas, Equipamentos, Materiais E Utensílios - Máquinas E Implementos - Cultivação Do Solo (Enxadas Rotativas, Plantadeiras, Semeadeiras Etc) - Ano Civil / Ano De Exploração",13144860116002]
["Máquinas, Equipamentos, Materiais E Utensílios - Máquinas E Implementos - Para Empacotar E Embalar Produtos - Ano Civil / Ano De Exploração",13144860233002]
["Máquinas, Equipamentos, Materiais E Utensílios - Máquinas E Implementos - Preparação Do Solo (Arados De  Tração Animal, Aivecas, Arados De Tração Mecânica, Grades De Disco) - Ano Civil / Ano De Exploração",13144860247002]
["Máquinas, Equipamentos, Materiais E Utensílios - Máquinas, Aparelhos E Instrumentos Para Processamento E Beneficiamento  De  Produtos - Engenhos, Alambiques, Trituradores, Vasilhames, Balanças Etc ",13144900145408]
["Máquinas, Equipamentos, Materiais E Utensílios - Materiais Industrializados - Aquisição De Máquinas E Equipamentos - Ano Civil / Ano De Exploração",13144567765008]
["Máquinas, Equipamentos, Materiais E Utensílios - Perfuração Poço, Cacimba/Cisterna - Não Se Aplica - Ano Civil / Ano De Exploração",13147706000408]
["Máquinas, Equipamentos, Materiais E Utensílios - Reboques, Semireboques, Caçambas E Cabines - Adaptação Em Veículos Agrícolas (Caminhões, Colheitadeiras, Tratores) - Ano Civil / Ano De Exploração",13146410350002]
["Máquinas, Equipamentos, Materiais E Utensílios - Reformas  De  Máquinas, Aparelhos, Equipamentos  E Veículos, Compra De Pecas E Acessrios - Não Se Aplica - Ano Civil / Ano De Exploração",13146420000002]
["Máquinas, Equipamentos, Materiais E Utensílios - Secador - Não Se Aplica - Ano Civil / Ano De Exploração",13146580000002]
["Máquinas, Equipamentos, Materiais E Utensílios - Tenda, Galpão, Túnel Plástico (Abrange Lonas, Filmes, Longarinas, Estacas E Mat. Sustentação) - Não É Aplicável - Ano Civil / Ano De Exploração",13147690990408]
["Máquinas, Equipamentos, Materiais E Utensílios - Terreiros - Não Se Aplica - Ano Civil / Ano De Exploração",13146920000408]
["Máquinas, Equipamentos, Materiais E Utensílios - Trator - Importado - Ano Civil / Ano De Exploração",13147080178002]
["Máquinas, Equipamentos, Materiais E Utensílios - Trator - Nacional - Ano Civil / Ano De Exploração",13147080215002]
["Melhoramento Das Explorações - Câmara Fria Para Armazenamento De Frutas - Construção Ou Reforma, Abrangendo A Compra De Aparelhagem Necessaria A Silagem, Expurgo E Defesa Dos Produtos Guardados ",13133170110002]
["Pastagem - Pastagem - Formação - Ano Civil / Ano De Exploração",13105760168408]
["Pastagem - Pastagem - Recuperação De Pastagem Degradada - Ano Civil / Ano De Exploração",13105760989408]
["Serviços Profissionais/Técnicos - Adubação Intensiva Do Solo - Não Se Aplica - Ano Civil / Ano De Exploração",13900360000408]
["Serviços Profissionais/Técnicos - Adubação Orgânica/Mineral, Calagem, Substratos Inertes(Pedra, Areia, Vermiculita, Silte, Argila Etc) - Não Se Aplica - Ano Civil / Ano De Exploração",13906750000408]
["Serviços Profissionais/Técnicos - Correção Intensiva Do Solo - Não Se Aplica - Ano Civil / Ano De Exploração",13902740000408]
["Serviços Profissionais/Técnicos - Desbravamento De Glebas Rurais - Abrange A Abertura De Estradas Internas, Desmatamento E Destocamento - Ano Civil / Ano De Exploração",13903200006408]
["Serviços Profissionais/Técnicos - Lago Artificial, Tanque, Barreiros, Canais, Reserv.Água Potavel - Não Se Aplica - Ano Civil / Ano De Exploração",13906050000408]
["Serviços Profissionais/Técnicos - Proteção Do Solo - Terraplanagem, Drenagem E Plantio De Espécies Vegetais Para Fixação Do Solo E Sombreamento - Ano Civil / Ano De Exploração",13906240217408]
["Serviços Profissionais/Técnicos - Residências Rurais - Construção Ou Reforma - Ano Civil / Ano De Exploração",13906460108408]
["Serviços Profissionais/Técnicos - Terraços, Porteiras, Mata-Burros, Currais, Cochos, Cercas - Construção Ou Reforma - Ano Civil / Ano De Exploração",13907710108408]
["Aquicultura - Aerador - Aquisição - Ano Civil / Ano De Exploração",23607465332002]
["Aquicultura - Alimentador De Peixe - Máquinas E Equipamentos - Ano Civil / Ano De Exploração",23607475337002]
["Aquicultura - Caminhões Frigoríficos - Aquisição - Ano Civil / Ano De Exploração",23607490332002]
["Aquicultura - Depósito Para Rações - Não Se Aplica - Ano Civil / Ano De Exploração",23607675000008]
["Aquicultura - Descamadora De Peixe - Aquisição - Ano Civil / Ano De Exploração",23607525332002]
["Aquicultura - Descascador De Camarão E Lagosta - Aquisição - Ano Civil / Ano De Exploração",23607530332002]
["Aquicultura - Despolpador De Pescado - Aquisição - Ano Civil / Ano De Exploração",23607680332002]
["Aquicultura - Embarcação Pequena (Até 20 A/B) - Aquisição - Ano Civil / Ano De Exploração",23607535332002]
["Aquicultura - Esteira - Aquisição - Ano Civil / Ano De Exploração",23607550332002]
["Aquicultura - Estufa - Aquisição - Ano Civil / Ano De Exploração",23607555332002]
["Aquicultura - Frigorífico - Melhoramento Das Explorações - Ano Civil / Ano De Exploração",23607565338002]
["Aquicultura - Matrizes E Reprodutores - Aquisição - Ano Civil / Ano De Exploração",23607580332002]
["Aquicultura - Mesa Para Filetagem - Aquisição - Ano Civil / Ano De Exploração",23607590332002]
["Aquicultura - Motobomba - Aquisição - Ano Civil / Ano De Exploração",23607600332002]
["Aquicultura - Tanques Escavados - Não Se Aplica - Ano Civil / Ano De Exploração",23607625000002]
["Aquicultura - Tanques Redes - Melhoramento Das Explorações - Ano Civil / Ano De Exploração",23607630338002]
["Aquicultura - Unidade De Beneficiamento Ou Processamento - Melhoramento Das Explorações - Ano Civil / Ano De Exploração",23607635338002]
["Aquisição De Animais - Animais Silvestres - Pacas, Capivaras, Queixadas, Catitus, Jacarés, Antas, Emas, Coelhos Etc, Para  Contemplação E Abate - Ano Civil / Ano De Exploração",23270800231002]
["Aquisição De Animais - Apicultura - Abrange Compra De Abelhas, Isoladamente Ou Em Colmeia - Ano Civil / Ano De Exploração",23270820015002]
["Aquisição De Animais - Avicultura - Abrange A  Compra De Aves E Ovos - Ano Civil / Ano De Exploração",23271080005002]
["Aquisição De Animais - Bovinos - Carne - Matrizes (Vacas E Crias Fêmeas Para Povoamento) - Ano Civil / Ano De Exploração",23271300078002]
["Aquisição De Animais - Bovinos - Carne - Reprodutores (Touros E  Tourinhos Para Povoamento) - Ano Civil / Ano De Exploração",23271300079002]
["Aquisição De Animais - Bovinos - Leite - Matrizes  (Vacas E Crias Fêmeas Para Povoamento) - Ano Civil / Ano De Exploração",23271300193002]
["Aquisição De Animais - Bovinos - Leite - Reprodutores (Touros E  Tourinhos Para Povoamento) - Ano Civil / Ano De Exploração",23271300194002]
["Aquisição De Animais - Búfalos (Bubalinos) - Não Se Aplica - Ano Civil / Ano De Exploração",23271400000002]
["Aquisição De Animais - Ovinos - Aquisição Ou Importação De Reprodutores De Alta Linhagem - Ano Civil / Ano De Exploração",23275580047002]
["Aquisição De Animais - Ovinos - Carne - Ano Civil / Ano De Exploração",23275580074002]
["Aquisição De Animais - Ovinos - Carne E Lã - Ano Civil / Ano De Exploração",23275580083002]
["Aquisição De Animais - Ovinos - Leite - Ano Civil / Ano De Exploração",23275580190002]
["Aquisição De Animais - Ovinos - Não Se Aplica - Ano Civil / Ano De Exploração",23275580000002]
["Aquisição De Animais - Ovinos - Produção De Lã - Ano Civil / Ano De Exploração",23275580187002]
["Aquisição De Animais - Sericicultura - Não Se Aplica - Ano Civil / Ano De Exploração",23276620000002]
["Aquisição De Animais - Suínos - Aquisição Ou Importação De Reprodutores De Alta Linhagem - Ano Civil / Ano De Exploração",23276760047002]
["Aquisição De Animais - Suínos - Não Se Aplica - Ano Civil / Ano De Exploração",23276760000002]
["Aquisição De Ativos Operacionais - Agroindústria - Instalação Completa De Agroindústria Para Beneficiamento ",23700440182408]
["Aquisição De Ativos Operacionais - Armazém, Depósito, Silo, Galpão, Paiol, Estufa E Instalações Congêneres - Construção Ou Reforma",23703180110408]
["Aquisição De Ativos Operacionais - Biodigestor, Esterqueira, Tanques De Oxidação Biológica E Tratamento De Água E Esgoto - Construção Ou Reforma - Ano Civil / Ano De Exploração",23707695108408]
["Aquisição De Veículos - Aquisição De Empilhadeira(S)/Tombadora(S) - Não Se Aplica - Ano Civil / Ano De Exploração",23150855000408]
["Aquisição De Veículos - Caminhões - Não Se Aplica - Ano Civil / Ano De Exploração",23151800000002]
["Aquisição De Veículos - Camionetas - Não Se Aplica - Ano Civil / Ano De Exploração",23151820000002]
["Aquisição De Veículos - Carretas, Carroças E Vagões De Carga, Forrageiros E Demais - Não Se Aplica - Ano Civil / Ano De Exploração",23152040000002]
["Aquisição De Veículos - Motocicletas E Motonetas - Carga, Transporte E Turismo Rural - Ano Civil / Ano De Exploração",23155150356002]
["Aquisição De Veículos - Ônibus, Micro-Ônibus E Vans - Carga, Transporte E Turismo Rural - Ano Civil / Ano De Exploração",23155310356002]
["Aquisição De Veículos - Triciclos E Quadriclos - Carga, Transporte E Turismo Rural - Ano Civil / Ano De Exploração",23157230356002]
["Aquisição De Veículos - Veículo Aéreo Não Tripulado (Drone) - Não Se Aplica - Ano Civil / Ano De Exploração",23157330000408]
["Máquinas, Equipamentos, Materiais E Utensílios - Aquecedor De Água (Boiler) - Não Se Aplica - Ano Civil / Ano De Exploração",23149876000408]
["Máquinas, Equipamentos, Materiais E Utensílios - Aquisição De Aquecedores, Geradores, Incineradores, Compressores, Ventiladores E Apar. De Ar Condic. - Não Se Aplica - Ano Civil / Ano De Exploração",23140847000408]
["Máquinas, Equipamentos, Materiais E Utensílios - Aquisição De Caixas D'Água, Lonas, Toldos, Campânulas - Não Se Aplica - Ano Civil / Ano De Exploração",23147715000408]
["Máquinas, Equipamentos, Materiais E Utensílios - Aquisição De Destiladores, Filtros, Depuradores E Dosadores - Não Se Aplica - Ano Civil / Ano De Exploração",23140851000408]
["Máquinas, Equipamentos, Materiais E Utensílios - Aquisição De Equipamentos Para Moldagem, Tornos, Moinhos E Prensa - Não Se Aplica - Ano Civil / Ano De Exploração",23140848000408]
["Máquinas, Equipamentos, Materiais E Utensílios - Aquisição De Ferramentas E Tubos - Não Se Aplica - Ano Civil / Ano De Exploração",23140852000408]
["Máquinas, Equipamentos, Materiais E Utensílios - Aquisição De Maquina(S)/Equipamento(S) Para Extração/Fabricação - Não Se Aplica - Ano Civil / Ano De Exploração",23140854000408]
["Máquinas, Equipamentos, Materiais E Utensílios - Aquisição De Material De Estocagem/Transporte/Sacaria/Caixas - Não Se Aplica - Ano Civil / Ano De Exploração",23140853000408]
["Máquinas, Equipamentos, Materiais E Utensílios - Aquisição De Motores E Elevadores - Não Se Aplica - Ano Civil / Ano De Exploração",23140849000408]
["Máquinas, Equipamentos, Materiais E Utensílios - Aquisição De Sistemas Para Rastreabilidade De Bovinos E Bubalinos - Não Se Aplica - Ano Civil / Ano De Exploração",23147720000408]
["Máquinas, Equipamentos, Materiais E Utensílios - Balança Para Animais - Aquisição - Ano Civil / Ano De Exploração",23143456332408]
["Máquinas, Equipamentos, Materiais E Utensílios - Base Para Balança - Construção Ou Reforma - Ano Civil / Ano De Exploração",23141175108408]
["Máquinas, Equipamentos, Materiais E Utensílios - Caixas De Abelhas, Favos, Centrifugas P/ Extração De Mel, Fumegadores - Não Se Aplica - Ano Civil / Ano De Exploração",23145678000008]
["Máquinas, Equipamentos, Materiais E Utensílios - Colheitadeiras, Colhedeiras E Arrancadeiras - Automotriz Importado - Ano Civil / Ano De Exploração",23142700050002]
["Máquinas, Equipamentos, Materiais E Utensílios - Colheitadeiras, Colhedeiras E Arrancadeiras - Automotriz Nacional - Ano Civil / Ano De Exploração",23142700051002]
["Máquinas, Equipamentos, Materiais E Utensílios - Colheitadeiras, Colhedeiras E Arrancadeiras - Importado - Ano Civil / Ano De Exploração",23142700178002]
["Máquinas, Equipamentos, Materiais E Utensílios - Colheitadeiras, Colhedeiras E Arrancadeiras - Nacional - Ano Civil / Ano De Exploração",23142700215002]
["Máquinas, Equipamentos, Materiais E Utensílios - Confinamento De Bovinos Free Stall\"\" - Construção Ou Reforma - Ano Civil / Ano De Exploração",23145555108408]
["Máquinas, Equipamentos, Materiais E Utensílios - Construção/Recuperação Barragem/Tanque, Sistemas Captação De Água - Não Se Aplica - Ano Civil / Ano De Exploração",23147705000408]
["Máquinas, Equipamentos, Materiais E Utensílios - Cultivadores Motorizados - Micro-Tratores - Ano Civil / Ano De Exploração",23142940206002]
["Máquinas, Equipamentos, Materiais E Utensílios - Eletrificação Rural - Abrange A Instalação De Força E Luz Elétrica Em Benfeitorias - Ano Civil / Ano De Exploração",23143280014408]
["Máquinas, Equipamentos, Materiais E Utensílios - Granjas Avícolas - Abrange A Compra De Equipamento Necessário A Sua Adequada Função - Ano Civil / Ano De Exploração",23143820009408]
["Máquinas, Equipamentos, Materiais E Utensílios - Granjas De Suínos - Abrange A Compra De Equipamento Necessário A Sua Adequada Função - Ano Civil / Ano De Exploração",23143821009408]
["Máquinas, Equipamentos, Materiais E Utensílios - Implantação De Tecnologias De Energia Renovável, Ambiental E Pequenas Aplicações Hidroenergéticas - Não Se Aplica - Ano Civil / Ano De Exploração",23147694000408]
["Máquinas, Equipamentos, Materiais E Utensílios - Inseminação Artificial - Abrange A Construção Ou Reforma De Instalações Adequadas",23143980013408]
["Máquinas, Equipamentos, Materiais E Utensílios - Instalação/Montagem/Transporte De Equipamento(S) - Não Se Aplica - Ano Civil / Ano De Exploração",23147730000408]
["Máquinas, Equipamentos, Materiais E Utensílios - Instalações Para Industrialização E Beneficiamento - Abrange A Compra De Maquinaria Necessária Ao Seu Funcionamento,  Balanças, Prensas",23144000012408]
["Máquinas, Equipamentos, Materiais E Utensílios - Irrigação - Construção Ou Reforma De Açudes, Abertura De Canais De Irrigação, Compra De Aparelhagem Necessária Aos Serviços De Irrigação ",23144020109408]
["Máquinas, Equipamentos, Materiais E Utensílios - Lavador - Não Se Aplica - Ano Civil / Ano De Exploração",23144260000408]
["Máquinas, Equipamentos, Materiais E Utensílios - Máquinas E Implementos - Adaptação Do Solo  (Destocadores, Destorroadores, Niveladores, Terraceadores, Retroescavadeira,Etc) - Ano Civil / Ano De Exploração",23144860022002]
["Máquinas, Equipamentos, Materiais E Utensílios - Máquinas E Implementos - Colheita (Ancinho Mecânico, Ceifeira Atadeira, Segadeira, Trilhadeira, Enfardadeira, Enleirador) - Ano Civil / Ano De Exploração",23144860101002]
["Máquinas, Equipamentos, Materiais E Utensílios - Máquinas E Implementos - Correção Do Solo E Combate Às Pragas, Ceifeiras, Ceifeiras-Atadeiras, Segadeiras, Trilhos, Trilhadeiras Etc - Ano Civil / Ano De Exploração",23144860112002]
["Máquinas, Equipamentos, Materiais E Utensílios - Máquinas E Implementos - Cultivação Do Solo (Enxadas Rotativas, Plantadeiras, Semeadeiras Etc) - Ano Civil / Ano De Exploração",23144860116002]
["Máquinas, Equipamentos, Materiais E Utensílios - Máquinas E Implementos - Empacotar E Embalar Produtos - Ano Civil / Ano De Exploração",23144860143002]
["Máquinas, Equipamentos, Materiais E Utensílios - Máquinas E Implementos - Preparação Do Solo (Arados De  Tração Animal, Aivecas, Arados De Tração Mecânica, Grades De Disco) - Ano Civil / Ano De Exploração",23144860247002]
["Máquinas, Equipamentos, Materiais E Utensílios - Máquinas, Aparelhos E Instrumentos - Ordenhadores, Tosquiadores, Batedeiras De Leite,  Desnatadeiras, Vasilhames, Resfriadores De Leite, Abatedouros",23144880225002]
["Máquinas, Equipamentos, Materiais E Utensílios - Máquinas, Aparelhos E Instrumentos Para Processamento E Beneficiamento  De  Produtos - Engenhos, Alambiques, Trituradores, Vasilhames, Balanças Etc",23144900145408]
["Máquinas, Equipamentos, Materiais E Utensílios - Materiais Industrializados - Aquisição De Máquinas E Equipamentos - Ano Civil / Ano De Exploração",23144567765008]
["Máquinas, Equipamentos, Materiais E Utensílios - Perfuração Poço, Cacimba/Cisterna - Não Se Aplica - Ano Civil / Ano De Exploração",23147706000408]
["Máquinas, Equipamentos, Materiais E Utensílios - Raspador - De Esterco - Ano Civil / Ano De Exploração",23146789789408]
["Máquinas, Equipamentos, Materiais E Utensílios - Reboques, Semireboques, Caçambas E Cabines - Adaptação Em Veículos Agrícolas (Caminhões, Colheitadeiras, Tratores) - Ano Civil / Ano De Exploração",23146410350002]
["Máquinas, Equipamentos, Materiais E Utensílios - Reformas  De  Máquinas, Aparelhos, Equipamentos  E Veículos, Compra De Pecas E Acessrios - Não Se Aplica - Ano Civil / Ano De Exploração",23146420000002]
["Máquinas, Equipamentos, Materiais E Utensílios - Sistemas De Captação, Retenção E Aproveitamento De Água - Reservatórios De Água, Bebedouros E Banheiros - Ano Civil / Ano De Exploração",23145540957408]
["Máquinas, Equipamentos, Materiais E Utensílios - Trator - Importado - Ano Civil / Ano De Exploração",23147080178002]
["Máquinas, Equipamentos, Materiais E Utensílios - Trator - Nacional - Ano Civil / Ano De Exploração",23147080215002]
["Pesca - Caminhões Frigoríficos - Aquisição - Ano Civil / Ano De Exploração",23507490332002]
["Pesca - Classificador De Pescado - Aquisição - Ano Civil / Ano De Exploração",23507655332002]
["Pesca - Cozedor De Pescado - Melhoramento Das Explorações - Ano Civil / Ano De Exploração",23507660338002]
["Pesca - Descamadora De Peixe - Aquisição - Ano Civil / Ano De Exploração",23507525332002]
["Pesca - Descascador De Camarão E Lagosta - Aquisição - Ano Civil / Ano De Exploração",23507530332002]
["Pesca - Embarcação Grande (A Partir De 100 A/B) - Aquisição - Ano Civil / Ano De Exploração",23507545332002]
["Pesca - Embarcação Média (Acima De 20 E Abaixo De 100 A/B) - Aquisição - Ano Civil / Ano De Exploração",23507540332002]
["Pesca - Embarcação Pequena (Até 20 A/B) - Aquisição - Ano Civil / Ano De Exploração",23507535332002]
["Pesca - Esteira - Aquisição - Ano Civil / Ano De Exploração",23507550332002]
["Pesca - Frigorífico - Melhoramento Das Explorações - Ano Civil / Ano De Exploração",23507565338002]
["Pesca - Mesa Para Descabeçamento De Pescado - Aquisição - Ano Civil / Ano De Exploração",23507670332002]
["Pesca - Mesa Para Filetagem - Aquisição - Ano Civil / Ano De Exploração",23507590332002]
["Pesca - Mesa Para Retirada De Pele, Escama E Carcaça De Pescado - Aquisição - Ano Civil / Ano De Exploração",23507665332002]
["Pesca - Pescado - Captura (Compreendem Os Bens De Capital Fixo E Semifixo Necessários À Exploração Da Pesca) - Ano Civil / Ano De Exploração",23505860072002]
["Pesca - Separador De Resíduos - Aquisição - Ano Civil / Ano De Exploração",23507650332002]
["Pesca - Unidade De Beneficiamento Ou Processamento - Melhoramento Das Explorações - Ano Civil / Ano De Exploração",23507635338002]
["Serviços Profissionais/Técnicos - Adubação Intensiva Do Solo - Não Se Aplica - Ano Civil / Ano De Exploração",23900360000408]
["Serviços Profissionais/Técnicos - Correção Intensiva Do Solo - Não Se Aplica - Ano Civil / Ano De Exploração",23902740000408]
["Serviços Profissionais/Técnicos - Desbravamento De Glebas Rurais - Abrange A Abertura De Estradas Internas, Desmatamento E Destocamento - Ano Civil / Ano De Exploração",23903200006408]
["Serviços Profissionais/Técnicos - Instalações Para Aves, Suínos E Coelhos - Construção Ou Reforma - Ano Civil / Ano De Exploração",23901070108408]
["Serviços Profissionais/Técnicos - Lago Artificial, Tanque, Barreiros, Canais, Reserv.Água Potavel - Não Se Aplica - Ano Civil / Ano De Exploração",23906050000408]
["Serviços Profissionais/Técnicos - Proteção Do Solo - Terraplanagem, Drenagem E Plantio De Espécies Vegetais Para Fixação Do Solo E Sombreamento - Ano Civil / Ano De Exploração",23906240217408]
["Serviços Profissionais/Técnicos - Residências Rurais - Construção Ou Reforma - Ano Civil / Ano De Exploração",23906460108408]
["Serviços Profissionais/Técnicos - Terraços, Porteiras, Mata-Burros, Currais, Cochos, Cercas - Construção Ou Reforma - Ano Civil / Ano De Exploração",23907710108408]

{"sheet":"Informações","index":3,"n_rows":164,"n_cols":74,"rows_kept":164,"cut":false,"hidden":true,"merged":[[0,20,0,28]]}
["Agência",null,"Unidade de medida",null,"Código UF","Unidade da Federação","UF",null,null,"Subcategoria",null,"GARANTIA_FIDEJUSSÓRIA","AVAL","GARANTIA_REAL","ALIENAÇÃO_FIDUCIÁRIA","CESSÃO_DE_DIREITOS_CREDITÓRIOS","PENHOR","ESTADO_CIVIL",null,"LINHA DE FINANCIAMENTO","Taxa de Juros",null,null,null,null,null,null,null,null,null,null,null,null,null,null,"PRONAF_CUSTEIO"]
["2-CASTANHAL",null,"Arroba",null,12,"Acre","AC",null,null,"CDB Banpará",null,"AVAL","AVAL DE PESSOA FÍSICA","ALIENAÇÃO_FIDUCIÁRIA","MÁQUINAS E EQUIPAMENTOS","CDB BANPARÁ ","PENHOR AGRÍCOLA","SOLTEIRO(A)",null,"PRONAF_CUSTEIO","CUSTEIO_RECURSO_OBRIGATÓRIO","CUSTEIO_RECURSO_LIVRE","INVESTIMENTO_RECURSO LIVRE","PRONAMP_CUSTEIO","PRONAMP_INVESTIMENTO","PRONAF_CUSTEIO","PRONAF_INVESTIMENTO_MAIS_ALIMENTO","PRONAF_INVESTIMENTO_FLORESTA","PRONAF_INVESTIMENTO_BIOECONOMIA",null,null,null,null,null,1,"PRODUTOS DA SOCIOBIODIVERSIDADE.",0.02,null,"PRONAF_INVESTIMENTO_MAIS_ALIMENTO","Juros",null,"PRONAF_INVESTIMENTO_BIOECONOMIA","Juros",null,"PRONAF_INVESTIMENTO_FLORESTA",null,null,null,"FINALIDADE DO CRÉDITO","TAXA DE JUROS",null,"PROGRAMA",null,"PRONAF","PRONAMP","SEM_VÍNCULO_A_PROGRAMA_ESPECÍFICO",null,"PRONAMP_CUSTEIO","PRONAMP_INVESTIMENTO","CUSTEIO_RECURSO_OBRIGATÓRIO","CUSTEIO_RECURSO_LIVRE","INVESTIMENTO_RECURSO_LIVRE",null,"HISTÓRICO BANPARÁ","HISTÓRICO OUTROS BANCOS",null,"EXPERIÊNCIA","EXPERIÊNCIA",null,"carencia_pronaf","carencia_outros",null,"prazo_pronaf","prazo_outros"]
["3-SANTARÉM",null,"Aves",null,27,"Alagoas","AL",null,null,"Equipamento ",null,null,"AVAL SOLIDÁRIO","CESSÃO_DE_DIREITOS_CREDITÓRIOS","VEÍCULOS",null,"PENHOR PECUÁRIO","CASADO(A)",null,"PRONAF_INVESTIMENTO_MAIS_ALIMENTO",0.115,0.155,0.155,7.4999999999999997E-2,0.08,0.02,2.5000000000000001E-2,0.03,0.03,null,null,null,null,null,2,"PRODUTOS INSERIDOS EM SISTEMAS DE PRODUÇÃO DE BASE AGROECOLÓGICA OU EM TRANSIÇÃO PARA SISTEMAS DE BASE AGROECOLÓGICA, CONFORME METODOLOGIA DEFINIDA EM PORTARIA DO MDA.",0.02,null,"AQUISIÇÃO, INSTALAÇÃO OU AMPLIAÇÃO RELACIONADO A  ESTRUTURAS DE CULTIVO PROTEGIDO.",0.03,null,"SILVICULTURA",0.08,null,"SISTEMAS AGROFLORESTAIS, EXCETO PARA BENEFICIÁRIOS ENQUADRADOS NOS GRUPOS “A”, “A/C” E “B”.",0.03,null,null,"PRODUTOS DA SOCIOBIODIVERSIDADE.",0.02,null,"PRONAF",null,"PRONAF_CUSTEIO","PRONAMP_CUSTEIO","CUSTEIO_RECURSO_OBRIGATÓRIO",null,"CUSTEIO AGRÍCOLA","INVESTIMENTO FIXO","CUSTEIO AGRÍCOLA","CUSTEIO AGRÍCOLA","INVESTIMENTO FIXO",null,"O PROPONENTE/CÔNJUGE POSSUI OPERAÇÃO DE CRÉDITO RURAL LIQUIDADA NO BANPARÁ","O PROPONENTE/CÔNJUGE POSSUI OPERAÇÃO DE CRÉDITO RURAL LIQUIDADA EM OUTROS BANCOS",null,"O PROPONENTE POSSUI EXPERIÊNCIA NA ATIVIDADE FINANCIADA (1 A 5 ANOS)","O PROPONENTE POSSUI EXPERIÊNCIA EM OUTRAS ATIVIDADE RURAIS (1 A 5 ANOS)",null,0,0,null,1,1]
["5-PARAGOMINAS",null,"Cabeça",null,16,"Amapá","AP",null,null,"Fiança Bancária",null,null,null,"PENHOR","IMÓVEIS RESIDENCIAIS",null,null,"DIVORCIADO(A)",null,"PRONAF_INVESTIMENTO_FLORESTA",0.12,0.16,0.16,0.08,null,0.03,0.03,null,0.06,null,null,null,null,null,3,"SISTEMAS ORGÂNICOS DE PRODUÇÃO.",0.02,null,"AQUISIÇÃO E INSTALAÇÃO DE  SILOS, ARMAZÉNS E CÂMARAS FRIAS DESTINADOS À GUARDA DE GRÃOS, FRUTAS, TUBÉRCULOS, BULBOS, HORTALIÇAS E FIBRAS;",0.03,null,"DEMAIS FINALIDADES",0.03,null,"AQUISIÇÃO DE MÁQUINAS, EQUIPAMENTOS E IMPLEMENTOS, PARA BENEFICIÁRIOS CUJA RENDA BRUTA FAMILIAR ANUAL, SEJA INFERIOR A R$100.000,00 (CEM MIL REAIS), EXCETO BENEFICIÁRIOS ENQUADRADOS NOS GRUPOS “A”, “A/C” E “B”",0.03,null,null,"PRODUTOS INSERIDOS EM SISTEMAS DE PRODUÇÃO DE BASE AGROECOLÓGICA OU EM TRANSIÇÃO PARA SISTEMAS DE BASE AGROECOLÓGICA, CONFORME METODOLOGIA DEFINIDA EM PORTARIA DO MDA.",0.02,null,"PRONAMP",null,"PRONAF_INVESTIMENTO_MAIS_ALIMENTO","PRONAMP_INVESTIMENTO","CUSTEIO_RECURSO_LIVRE",null,"CUSTEIO PECUÁRIO","INVESTIMENTO SEMIFIXO","CUSTEIO PECUÁRIO","CUSTEIO PECUÁRIO","INVESTIMENTO SEMIFIXO",null,"O PROPONENTE/CÔNJUGE POSSUI OPERAÇÃO DE CRÉDITO RURAL EM SITUAÇÃO NORMAL NO BANPARÁ","O PROPONENTE/CÔNJUGE POSSUI OPERAÇÃO DE CRÉDITO RURAL EM SITUAÇÃO NORMAL EM OUTROS BANCOS",null,"O PROPONENTE POSSUI EXPERIÊNCIA NA ATIVIDADE FINANCIADA (5 A 10 ANOS)","O PROPONENTE POSSUI EXPERIÊNCIA EM OUTRAS ATIVIDADE RURAIS (5 A 10 ANOS)",null,12,12,null,2,2]
["6-ABAETETUBA",null,"Caixa",null,13,"Amazonas","AM",null,null,"Fundo de Aval",null,null,null,null,"OUTROS IMÓVEIS",null,null,"VIÚVO(A)",null,"PRONAF_INVESTIMENTO_BIOECONOMIA",null,0.17,0.17,null,null,0.06,0.05,null,null,null,null,null,null,null,4,"CULTIVO DE ARROZ, FEIJÃO, FEIJÃO CAUPI, MANDIOCA, AMENDOIM, TOMATE, CEBOLA, INHAME, CARÁ, BATATA-DOCE, BATATA-INGLESA, ABACAXI, BANANA, AÇAÍ CULTIVADO, CACAU CULTIVADO, LARANJA, TANGERINA, OLERÍCOLAS, AROMÁTICAS E CONDIMENTARES.",0.03,null,"AQUISIÇÃO E INSTALAÇÃO DE TANQUES DE RESFRIAMENTO DE LEITE E ORDENHADEIRAS.",0.03,null,null,null,null,"DEMAIS FINALIDADES, EXCETO PARA BENEFICIÁRIOS ENQUADRADOS NOS GRUPOS “A”, “A/C” E “B”.",0.03,null,null,"SISTEMAS ORGÂNICOS DE PRODUÇÃO.",0.02,null,"SEM_VÍNCULO_A_PROGRAMA_ESPECÍFICO",null,"PRONAF_INVESTIMENTO_FLORESTA",null,"INVESTIMENTO_RECURSO_LIVRE",null,null,"INVESTIMENTO FIXO E SEMIFIXO",null,null,"INVESTIMENTO FIXO E SEMIFIXO",null,"O PROPONENTE/CÔNJUGE NÃO  POSSUI OPERAÇÃO DE CRÉDITO RURAL CONTRATADA JUNTO AO BANPARÁ","O PROPONENTE/CÔNJUGE NÃO  POSSUI OPERAÇÃO DE CRÉDITO RURAL CONTRATADA EM OUTROS BANCOS",null,"O PROPONENTE POSSUI EXPERIÊNCIA NA ATIVIDADE FINANCIADA (MAIS DE 10 ANOS)","O PROPONENTE POSSUI EXPERIÊNCIA EM OUTRAS ATIVIDADE RURAIS (MAIS DE 10 ANOS)",null,24,null,null,3,3]
["7-CAPITÃO POÇO",null,"Diária",null,29,"Bahia","BA",null,null,"Aval de Terceiros",null,null,null,null,"IMÓVEIS EM OUTROS ESTADOS",null,null,"UNIÃO ESTÁVEL",null,null,null,0.18,0.18,null,null,null,0.06,null,null,null,null,null,null,null,5,"CULTIVO DE MILHO, CUJAS OPERAÇÕES SOMADAS ATINJAM O VALOR DE ATÉ R$25.000,00 POR MUTUÁRIO EM CADA ANO AGRÍCOLA.",0.03,null,"AQUISIÇÃO, INSTALAÇÃO OU AMPLIAÇÃO RELACIONADA A AQUICULTURA E PESCA.",0.03,null,null,null,null,"BENEFICIÁRIOS ENQUADRADOS NOS GRUPOS “A”, “A/C” E \"B\": TODAS AS FINALIDADES",0.03,null,null,"CULTIVO DE ARROZ, FEIJÃO, FEIJÃO CAUPI, MANDIOCA, AMENDOIM, TOMATE, CEBOLA, INHAME, CARÁ, BATATA-DOCE, BATATA-INGLESA, ABACAXI, BANANA, AÇAÍ CULTIVADO, CACAU CULTIVADO, LARANJA, TANGERINA, OLERÍCOLAS, AROMÁTICAS E CONDIMENTARES.",0.03,null,null,null,"PRONAF_INVESTIMENTO_BIOECONOMIA",null,null,null,null,null,null,null,null,null,null,null,null,"O PROPONENTE NÃO POSSUI EXPERIÊNCIA NA ATIVIDADE FINANCIADA","O PROPONENTE NÃO POSSUI EXPERIÊNCIA EM OUTRAS ATIVIDADES RURAIS",null,36,null,null,4,4]
["8-CONCEIÇÃO DO ARAGUAIA",null,"Dúzia",null,23,"Ceará","CE",null,null,"Aval Solidário",null,null,null,null,null,null,null,null,null,null,null,null,null,null,null,null,null,null,null,null,null,null,null,null,6,"CUSTEIO PECUÁRIO DAS ATIVIDADES DE APICULTURA, BOVINOCULTURA DE LEITE, AVICULTURA DE POSTURA, AQUICULTURA E PESCA, OVINOCULTURA E CAPRINOCULTURA E EXPLORAÇÃO EXTRATIVISTA ECOLOGICAMENTE SUSTENTÁVEL.",0.03,null,"AQUISIÇÃO DE  SÊMEN, ÓVULOS E EMBRIÕES PARA MELHORAMENTO GENÉTICO DA PECUÁRIA DE LEITE, INCLUSIVE QUANTO AOS SERVIÇOS DE INSEMINAÇÃO ARTIFICIAL E TRANSFERÊNCIA DE EMBRIÕES.",0.03,null,null,null,null,null,null,null,null,"CULTIVO DE MILHO, CUJAS OPERAÇÕES SOMADAS ATINJAM O VALOR DE ATÉ R$20.000,00 POR MUTUÁRIO EM CADA ANO AGRÍCOLA.",0.03,null,null,null,null,null,null,null,null,null,null,null,null,null,null,null,null,null,null,null,{"$f":"IF('Dados Cadastrais'!E3=\"pronaf\",Informações!BR2,Informações!BS2)","v":"carencia_pronaf"},null,null,5]
["9-MARACANÃ",null,"Galão",null,53,"Distrito Federal","DF",null,null,"Imoveis - Rurais",null,null,null,null,null,null,null,null,null,null,null,null,null,null,null,null,null,null,null,null,null,null,null,null,7,"CULTIVO DE SOJA, ALGODÃO, BOVINOCULTURA DE CORTE, INCLUSIVE AQUISIÇÃO DE ANIMAIS DESTINADOS A RECRIA E ENGORDA.",0.08,null,"AQUISIÇÃO, INSTALAÇÃO OU AMPLIAÇÃO RELACIONADA A AVICULTURA CAIPIRA DE POSTURA.",0.03,null,null,null,null,null,null,null,null,"CUSTEIO PECUÁRIO DAS ATIVIDADES DE APICULTURA, BOVINOCULTURA DE LEITE, AVICULTURA DE POSTURA, AQUICULTURA E PESCA, OVINOCULTURA E CAPRINOCULTURA E EXPLORAÇÃO EXTRATIVISTA ECOLOGICAMENTE SUSTENTÁVEL.",0.03,null,null,null,null,null,null,null,null,null,null,null,null,null,null,null,null,null,null,null,null,null,null,6]
["11-BELÉM CENTRO",null,"Garrafa",null,32,"Espírito Santo","ES",null,null,"Máquinas",null,null,null,null,null,null,null,null,null,null,null,null,null,null,null,null,null,null,null,null,null,null,null,null,8,"DEMAIS EMPREENDIMENTOS E FINALIDADES DE CUSTEIO",6.5000000000000002E-2,null,"AQUISIÇÃO, INSTALAÇÃO OU AMPLIAÇÃO RELACIONADA A CAPRINOCULTURA E OVINOCULTURA.",0.03,null,null,null,null,null,null,null,null,"CULTIVO DE SOJA, ALGODÃO, BOVINOCULTURA DE CORTE, INCLUSIVE AQUISIÇÃO DE ANIMAIS DESTINADOS A RECRIA E ENGORDA.",0.08,null,null,null,null,null,null,null,null,null,null,null,null,null,null,null,null,null,null,null,null,null,null,7]
["12-ÓBIDOS",null,"Hectare",null,52,"Goiás","GO",null,null,"Primeiro Grau - imoveis residenciais",null,null,null,null,null,null,null,null,null,null,null,null,null,null,null,null,null,null,null,null,null,null,null,null,null,null,null,null,"AQUISIÇÃO E INSTALAÇÃO DE ITENS RELACIONADOS A SISTEMAS DE CONECTIVIDADE NO CAMPO.",0.03,null,null,null,null,null,null,null,null,"DEMAIS EMPREENDIMENTOS E FINALIDADES DE CUSTEIO",6.5000000000000002E-2,null,null,null,null,null,null,null,null,null,null,null,null,null,null,null,null,null,null,null,null,null,null,{"$f":"IF('Dados Cadastrais'!E3=\"pronaf\",BU2,BV2)","v":"prazo_pronaf"}]
["13-MARABÁ",null,"Hectare (lâmina d'água)",null,21,"Maranhão","MA",null,null,"Primeiro Grau - Outros",null,null,null,null,null,null,null,null,null,null,null,null,null,null,null,null,null,null,null,null,null,null,null,null,null,null,null,null,"AQUISIÇÃO, INSTALAÇÃO DE EQUIPAMENTOS ADAPTADOS A PESSOAS COM DEFICIÊNCIA, INCLUINDO CADEIRA DE RODAS MOTORIZADA PARA TODO O TERRENO.",0.03,null,null,null,null,null,null,null,null,"AQUISIÇÃO, INSTALAÇÃO OU AMPLIAÇÃO RELACIONADO A  ESTRUTURAS DE CULTIVO PROTEGIDO.",0.03]
["14-TELÉGRAFO",null,"Hectolitro",null,51,"Mato Grosso","MT",null,null,"Veiculos",null,null,null,null,null,null,null,null,null,null,null,null,null,null,null,null,null,null,null,null,null,null,null,null,null,null,null,null,"AQUISIÇÃO DE MÁQUINAS, EQUIPAMENTOS E IMPLEMENTOS POR BENEFICIÁRIOS CUJA RENDA BRUTA FAMILIAR ANUAL SEJA INFERIOR A R$ 150.000",2.5000000000000001E-2,null,null,null,null,null,null,null,null,"AQUISIÇÃO E INSTALAÇÃO DE  SILOS, ARMAZÉNS E CÂMARAS FRIAS DESTINADOS À GUARDA DE GRÃOS, FRUTAS, TUBÉRCULOS, BULBOS, HORTALIÇAS E FIBRAS;",0.03]
["15-SENADOR LEMOS",null,"Homem / Dia",null,50,"Mato Grosso do Sul","MS",null,null,"Animais",null,null,null,null,null,null,null,null,null,null,null,null,null,null,null,null,null,null,null,null,null,null,null,null,null,null,null,null,"AQUISIÇÃO DE TRATORES, MÁQUINAS, EQUIPAMENTOS E IMPLEMENTOS ",0.05,null,null,null,null,null,null,null,null,"AQUISIÇÃO E INSTALAÇÃO DE TANQUES DE RESFRIAMENTO DE LEITE E ORDENHADEIRAS.",0.03]
["16-TUCURUÍ",null,"Hora / Maquina",null,31,"Minas Gerais","MG",null,null,null,null,null,null,null,null,null,null,null,null,null,null,null,null,null,null,null,null,null,null,null,null,null,null,null,null,null,null,null,"DEMAIS EMPREENDIMENTOS E FINALIDADES",0.08,null,null,null,null,null,null,null,null,"AQUISIÇÃO, INSTALAÇÃO OU AMPLIAÇÃO RELACIONADA A AQUICULTURA E PESCA.",0.03]
["18-BRAGANÇA",null,"H / TE",null,15,"Pará","PA",null,null,null,null,null,null,null,null,null,null,null,null,null,null,null,null,null,null,null,null,null,null,null,null,null,null,null,9,null,null,null,null,null,null,null,null,null,null,null,null,null,"AQUISIÇÃO DE  SÊMEN, ÓVULOS E EMBRIÕES PARA MELHORAMENTO GENÉTICO DA PECUÁRIA DE LEITE, INCLUSIVE QUANTO AOS SERVIÇOS DE INSEMINAÇÃO ARTIFICIAL E TRANSFERÊNCIA DE EMBRIÕES.",0.03]
["19-BREVES",null,"H / TP",null,25,"Paraíba","PB",null,null,null,null,null,null,null,null,null,null,null,null,null,null,null,null,null,null,null,null,null,null,null,null,null,null,null,null,null,null,null,null,null,null,null,null,null,null,null,null,null,"AQUISIÇÃO, INSTALAÇÃO OU AMPLIAÇÃO RELACIONADA A AVICULTURA CAIPIRA DE POSTURA.",0.03]
["20-ANANINDEUA",null,"Kg",null,41,"Paraná","PR",null,null,null,null,null,null,null,null,null,null,null,null,null,null,null,null,null,null,null,null,null,null,null,null,null,null,null,10,null,null,null,null,null,null,null,null,null,null,null,null,null,"AQUISIÇÃO, INSTALAÇÃO OU AMPLIAÇÃO RELACIONADA A CAPRINOCULTURA E OVINOCULTURA.",0.03]
["21-ESTRADA NOVA",null,"Lata",null,26,"Pernambuco","PE",null,null,null,null,null,null,null,null,null,null,null,null,null,null,null,null,null,null,null,null,null,null,null,null,null,null,null,11,null,null,null,null,null,null,null,null,null,null,null,null,null,"AQUISIÇÃO E INSTALAÇÃO DE ITENS RELACIONADOS A SISTEMAS DE CONECTIVIDADE NO CAMPO.",0.03]
["22-BARCARENA",null,"Litro",null,22,"Piauí","PI",null,null,null,null,null,null,null,null,null,null,null,null,null,null,null,null,null,null,null,null,null,null,null,null,null,null,null,12,null,null,null,null,null,null,null,null,null,null,null,null,null,"AQUISIÇÃO, INSTALAÇÃO DE EQUIPAMENTOS ADAPTADOS A PESSOAS COM DEFICIÊNCIA, INCLUINDO CADEIRA DE RODAS MOTORIZADA PARA TODO O TERRENO.",0.03]
["24-NAZARÉ",null,"Maço",null,33,"Rio de Janeiro","RJ",null,null,null,null,null,null,null,null,null,null,null,null,null,null,null,null,null,null,null,null,null,null,null,null,null,null,null,13,null,null,null,null,null,null,null,null,null,null,null,null,null,"AQUISIÇÃO DE MÁQUINAS, EQUIPAMENTOS E IMPLEMENTOS POR BENEFICIÁRIOS CUJA RENDA BRUTA FAMILIAR ANUAL SEJA INFERIOR A R$ 150.000",2.5000000000000001E-2]
["25-SÃO BRÁS",null,"Metro Cúbico",null,24,"Rio Grande do Norte","RN",null,null,null,null,null,null,null,null,null,null,null,null,null,null,null,null,null,null,null,null,null,null,null,null,null,null,null,14,null,null,null,null,null,null,null,null,null,null,null,null,null,"AQUISIÇÃO DE TRATORES, MÁQUINAS, EQUIPAMENTOS E IMPLEMENTOS ",0.05]
["26-PALÁCIO",null,"Metro Cúbico de Tanque",null,43,"Rio Grande do Sul (*)","RS",null,null,null,null,null,null,null,null,null,null,null,null,null,null,null,null,null,null,null,null,null,null,null,null,null,null,null,null,null,null,null,null,null,null,null,null,null,null,null,null,null,"DEMAIS EMPREENDIMENTOS E FINALIDADES",0.08]
["27-ICOARACI",null,"Metro Quadrado",null,11,"Rondônia","RO",null,null,null,null,null,null,null,null,null,null,null,null,null,null,null,null,null,null,null,null,null,null,null,null,null,null,null,null,null,null,null,null,null,null,null,null,null,null,null,null,null,"SILVICULTURA",0.08]
["28-REDENÇÃO",null,"Mil Aves (Lote)",null,14,"Roraima","RR",null,null,null,null,null,null,null,null,null,null,null,null,null,null,null,null,null,null,null,null,null,null,null,null,null,null,null,null,null,null,null,null,null,null,null,null,null,null,null,null,null,"DEMAIS FINALIDADES",0.03]
["29-ALTAMIRA",null,"Mil Cabeças",null,42,"Santa Catarina","SC",null,null,null,null,null,null,null,null,null,null,null,null,null,null,null,null,null,null,null,null,null,null,null,null,null,null,null,null,null,null,null,null,null,null,null,null,null,null,null,null,null,"SISTEMAS AGROFLORESTAIS, EXCETO PARA BENEFICIÁRIOS ENQUADRADOS NOS GRUPOS “A”, “A/C” E “B”.",0.03]
["30-CAMETÁ",null,"Mil Dúzias",null,35,"São Paulo","SP",null,null,null,null,null,null,null,null,null,null,null,null,null,null,null,null,null,null,null,null,null,null,null,null,null,null,null,null,null,null,null,null,null,null,null,null,null,null,null,null,null,"AQUISIÇÃO DE MÁQUINAS, EQUIPAMENTOS E IMPLEMENTOS, PARA BENEFICIÁRIOS CUJA RENDA BRUTA FAMILIAR ANUAL, SEJA INFERIOR A R$100.000,00 (CEM MIL REAIS), EXCETO BENEFICIÁRIOS ENQUADRADOS NOS GRUPOS “A”, “A/C” E “B”",0.03]
["31-RONDON DO PARÁ",null,"Mil Litros",null,28,"Sergipe","SE",null,null,null,null,null,null,null,null,null,null,null,null,null,null,null,null,null,null,null,null,null,null,null,null,null,null,null,null,null,null,null,null,null,null,null,null,null,null,null,null,null,"DEMAIS FINALIDADES, EXCETO PARA BENEFICIÁRIOS ENQUADRADOS NOS GRUPOS “A”, “A/C” E “B”.",0.03]
["32-CAPANEMA",null,"Mil Metros Quadrados de Aviário",null,17,"Tocantins","TO",null,null,null,null,null,null,null,null,null,null,null,null,null,null,null,null,null,null,null,null,null,null,null,null,null,null,null,null,null,null,null,null,null,null,null,null,null,null,null,null,null,"BENEFICIÁRIOS ENQUADRADOS NOS GRUPOS “A”, “A/C” E \"B\": TODAS AS FINALIDADES",0.03]
["33-ALENQUER",null,"Mil Mudas"]
["34-CONCÓRDIA DO PARÁ",null,"Mil Pés"]
["35-ITUPIRANGA",null,"Mil Unidades"]
["36-VISEU",null,"Milimetro"]
["37-SANTA IZABEL DO PARÁ",null,"Outro"]
["38-ITAITUBA",null,"Pacote"]
["39-VIGIA",null,"Pés"]
["40-XINGUARA",null,"Quantidade"]
["41-DOM ELISEU",null,"Quilograma"]
["42-ORIXIMINÁ",null,"Quilograma (Peso Vivo)"]
["43-PARAUAPEBAS",null,"Saca de 60 Quilos"]
["44-BR-ANANINDEUA",null,"Tonelada"]
["45-CIDADE NOVA",null,"Unidade"]
["46-JURUTI",null,"Saco"]
["47-PEDREIRA",null,"Km"]
["48-CANAÃ DOS CARAJÁS"]
["49-PRIVATE"]
["50-TAPAJÓS"]
["51-MARABÁ CIDADE NOVA"]
["52-MARITUBA"]
["53-AUGUSTO MONTENEGRO"]
["54-TAILÂNDIA"]
["55-MOJU"]
["56-BARCARENA CENTRO"]
["57-SANTA BÁRBARA DO PARÁ"]
["58-TUCUMÃ"]
["59-BENEVIDES"]
["60-BOM JESUS DO TOCANTINS"]
["61-RIO MARIA"]
["62-SANTA LUZIA DO PARÁ"]
["63-CURUÇÁ"]
["64-JACUNDÁ"]
["65-SANTA MARIA DO PARÁ"]
["66-TOMÉ AÇÚ - QUATRO BOCAS"]
["67-BONITO"]
["68-FARO"]
["69-ALMEIRIM"]
["70-IGARAPE-MIRI"]
["71-SÃO MIGUEL DO GUAMÁ"]
["72-BAIÃO"]
["73-BREU BRANCO"]
["74-ANAJÁS"]
["75-ACARÁ"]
["76-SÃO GERALDO DO ARAGUAIA"]
["77-MOJUÍ DOS CAMPOS"]
["78-MUANÁ"]
["79-SANTANA DO ARAGUAIA"]
["80-MARAPANIM"]
["81-SÃO CAETANO DE ODIVELAS"]
["82-IGARAPÉ AÇU"]
["83-MOSQUEIRO"]
["84-MEDICILANDIA"]
["85-NOVO PROGRESSO"]
["86-OURILÂNDIA DO NORTE"]
["87-SOURE"]
["88-ITAITUBA CIDADE ALTA"]
["89-LIMOEIRO DO AJURU"]
["90-PONTA DE PEDRAS"]
["91-AFUÁ"]
["92-ELDORADO DO CARAJÁS"]
["93-SALVATERRA"]
["94-SÃO JOÃO DE PIRABAS"]
["95-SALINÓPOLIS"]
["96-GOIANÉSIA DO PARA"]
["97-BUJARU"]
["98-IPIXUNA DO PARÁ"]
["99-MONTE ALEGRE"]
["102-VITÓRIA DO XINGÚ"]
["103-FLORESTA DO ARAGUAIA"]
["104-GARRAFÃO DO NORTE"]
["105-ABEL FIGUEIREDO"]
["106-ÁGUA AZUL DO NORTE"]
["107-ANAPÚ"]
["108-BREJO GRANDE DO ARAGUAIA"]
["109-CURUÁ"]
["110-PRIMAVERA"]
["111-SANTO ANTÔNIO DO TAUÁ"]
["112-SAPUCAIA"]
["113-MELGAÇO"]
["114-CURRALINHO"]
["115-AUGUSTO CORREA"]
["116-CURIONÓPOLIS"]
["117-TERRA SANTA"]
["118-AURORA DO PARÁ"]
["119-CACHOEIRA DO ARARI"]
["120-TRACUATEUA"]
["121-SÃO FÉLIX DO XINGU"]
["122-TRAIRÃO"]
["123-MARABÁ SÃO FÉLIX"]
["124-OEIRAS DO PARÁ"]
["125-SENADOR JOSÉ PORFÍRIO"]
["126-PORTO DE MOZ"]
["127-CUMARU DO NORTE"]
["128-PAU D'ARCO"]
["129-MOCAJUBA"]
["130-PALESTINA DO PARÁ"]
["131-JACAREACANGA"]
["132-RURÓPOLIS"]
["133-CACHOEIRA DO PIRIÁ"]
["134-PACAJÁ"]
["135-PIÇARRA"]
["136-ULIANÓPOLIS"]
["137-BANNACH"]
["138-PRAINHA"]
["139-COLARES"]
["140-MAGALHÃES BARATA"]
["141-NOVA IPIXUNA"]
["142-CASA DE TÁBUA"]
["143-NOVA TIMBOTEUA"]
["144-BRASIL NOVO"]
["145-BAGRE"]
["146-INHANGAPI"]
["147-IRITUIA"]
["148-OURÉM"]
["149-SÃO DOMINGOS DO ARAGUAIA"]
["150-SANTARÉM NOVO"]
["151-QUATIPURU"]
["152-SÃO JOÃO DO ARAGUAIA"]
["153-TERRA ALTA "]
["154-CASTANHAL JADERLÂNDIA"]
["155-SÃO FRANCISCO DO PARÁ"]
["156-SÃO SEBASTIÃO DA BOA VISTA"]
["157-SANTA CRUZ DO ARARI"]
["158-URUARÁ"]
["159-SÃO DOMINGOS DO CAPIM"]
["160-MÃE DO RIO "]
["161-BELTERRA"]
["162-PEIXE BOI"]
["163-NOVO REPARTIMENTO"]
["164-GURUPÁ"]
["165-AVEIRO"]
["166-SÃO JOÃO DA PONTA"]
["167-NOVA ESPERANÇA DO PIRIÁ"]
["168-PLACAS"]
["169-PORTEL "]
["170-CHAVES"]

{"sheet":"Descrição do Projeto","index":4,"n_rows":45,"n_cols":1,"rows_kept":45,"cut":false,"hidden":false,"merged":[[44,0,44,2],[45,0,51,2],[29,0,29,2],[30,0,36,2],[37,0,37,2],[38,0,43,2],[21,0,28,2],[2,0,2,2],[3,0,10,2],[11,0,11,2],[12,0,19,2],[20,0,20,2]]}
[]
["10. Descrição do projeto"]
["Resumo do projeto"]
[]
[]
[]
[]
[]
[]
[]
[]
["Localização Geográfica e clima"]
[]
[]
[]
[]
[]
[]
[]
[]
["Recursos hídricos e meio ambiente"]
[]
[]
[]
[]
[]
[]
[]
[]
["Aspectos Técnicos (manejo produtivo e reprodutivo)"]
[]
[]
[]
[]
[]
[]
[]
["Mercado"]
[]
[]
[]
[]
[]
[]
["Outros "]

{"sheet":"Orçamento","index":5,"n_rows":152,"n_cols":17,"rows_kept":152,"cut":false,"hidden":false,"merged":[[144,0,144,3],[110,0,110,3],[91,0,91,3],[83,0,83,3],[2,0,2,7],[5,0,5,3],[3,0,4,0],[3,1,4,1],[3,2,4,2],[3,3,3,6],[3,7,4,7]]}
[]
["11. Orçamento"]
[null,null,null,null,null,null,null,null,null,null,null,null,null,null,{"$f":"IF('Dados Cadastrais'!E95=\"não\",\"0\",E6*2%)","v":0},{"$f":"IF('Dados Cadastrais'!E95=\"não\",\"0\",F6*2%)","v":0},{"$f":"IF('Dados Cadastrais'!E95=\"não\",\"0\",G6*2%)","v":0}]
["Especificação","Unid","Quant","Valor",null,null,null,"Época de Realização",null,null,null,null,null,null,{"$f":"IF('Dados Cadastrais'!E95=\"não\",\"0\",E84*2%)","v":0},{"$f":"IF('Dados Cadastrais'!E95=\"não\",\"0\",F84*2%)","v":0},{"$f":"IF('Dados Cadastrais'!E95=\"não\",\"0\",G84*2%)","v":0}]
[null,null,null," Unitário","Total","Financiado","R. Próprio",null,null,null,null,null,null,null,{"$f":"IF('Dados Cadastrais'!$E$95=\"não\",\"0\",E92*2%)","v":0},{"$f":"IF('Dados Cadastrais'!$E$95=\"não\",\"0\",F92*2%)","v":0},{"$f":"IF('Dados Cadastrais'!$E$95=\"não\",\"0\",G92*2%)","v":0}]
["Investimento Fixo",null,null,null,{"$f":"IFERROR(SUM(E7:E83),0)","v":0},{"$f":"IFERROR(SUM(F7:F83),0)","v":0},{"$f":"IFERROR(SUM(G7:G83),0)","v":0},"-",null,null,null,null,null,null,{"$f":"IF('Dados Cadastrais'!$E$95=\"não\",\"0\",E111*2%)","v":0},{"$f":"IF('Dados Cadastrais'!$E$95=\"não\",\"0\",F111*2%)","v":0},{"$f":"IF('Dados Cadastrais'!$E$95=\"não\",\"0\",G111*2%)","v":0}]
[null,null,null,null,{"$f":"IF(A7=\"\",\"\",C7*D7)","v":""},{"$f":"IF(A7=\"\",\"\",IFERROR(((100-Análise!$E$4)/100)*E7,0))","v":""},{"$f":"IF(A7=\"\",\"\",E7-F7)","v":""}]
[null,null,null,null,"",{"$f":"IF(A8=\"\",\"\",IFERROR(((100-Análise!$E$4)/100)*E8,0))","v":""},""]
[null,null,null,null,"",{"$f":"IF(A9=\"\",\"\",IFERROR(((100-Análise!$E$4)/100)*E9,0))","v":""},""]
[null,null,null,null,"",{"$f":"IF(A10=\"\",\"\",IFERROR(((100-Análise!$E$4)/100)*E10,0))","v":""},""]
[null,null,null,null,"",{"$f":"IF(A11=\"\",\"\",IFERROR(((100-Análise!$E$4)/100)*E11,0))","v":""},""]
[null,null,null,null,"",{"$f":"IF(A12=\"\",\"\",IFERROR(((100-Análise!$E$4)/100)*E12,0))","v":""},""]
[null,null,null,null,"",{"$f":"IF(A13=\"\",\"\",IFERROR(((100-Análise!$E$4)/100)*E13,0))","v":""},""]
[null,null,null,null,"",{"$f":"IF(A14=\"\",\"\",IFERROR(((100-Análise!$E$4)/100)*E14,0))","v":""},""]
[null,null,null,null,"",{"$f":"IF(A15=\"\",\"\",IFERROR(((100-Análise!$E$4)/100)*E15,0))","v":""},""]
[null,null,null,null,"",{"$f":"IF(A16=\"\",\"\",IFERROR(((100-Análise!$E$4)/100)*E16,0))","v":""},""]
[null,null,null,null,"",{"$f":"IF(A17=\"\",\"\",IFERROR(((100-Análise!$E$4)/100)*E17,0))","v":""},""]
[null,null,null,null,"",{"$f":"IF(A18=\"\",\"\",IFERROR(((100-Análise!$E$4)/100)*E18,0))","v":""},""]
[null,null,null,null,"",{"$f":"IF(A19=\"\",\"\",IFERROR(((100-Análise!$E$4)/100)*E19,0))","v":""},""]
[null,null,null,null,"",{"$f":"IF(A20=\"\",\"\",IFERROR(((100-Análise!$E$4)/100)*E20,0))","v":""},""]
[null,null,null,null,"",{"$f":"IF(A21=\"\",\"\",IFERROR(((100-Análise!$E$4)/100)*E21,0))","v":""},""]
[null,null,null,null,"",{"$f":"IF(A22=\"\",\"\",IFERROR(((100-Análise!$E$4)/100)*E22,0))","v":""},""]
[null,null,null,null,"",{"$f":"IF(A23=\"\",\"\",IFERROR(((100-Análise!$E$4)/100)*E23,0))","v":""},""]
[null,null,null,null,"",{"$f":"IF(A24=\"\",\"\",IFERROR(((100-Análise!$E$4)/100)*E24,0))","v":""},""]
[null,null,null,null,"",{"$f":"IF(A25=\"\",\"\",IFERROR(((100-Análise!$E$4)/100)*E25,0))","v":""},""]
[null,null,null,null,"",{"$f":"IF(A26=\"\",\"\",IFERROR(((100-Análise!$E$4)/100)*E26,0))","v":""},""]
[null,null,null,null,"",{"$f":"IF(A27=\"\",\"\",IFERROR(((100-Análise!$E$4)/100)*E27,0))","v":""},""]
[null,null,null,null,"",{"$f":"IF(A28=\"\",\"\",IFERROR(((100-Análise!$E$4)/100)*E28,0))","v":""},""]
[null,null,null,null,{"$f":"IF(A29=\"\",\"\",C29*D29)","v":""},{"$f":"IF(A29=\"\",\"\",IFERROR(((100-Análise!$E$4)/100)*E29,0))","v":""},{"$f":"IF(A29=\"\",\"\",E29-F29)","v":""}]
[null,null,null,null,"",{"$f":"IF(A30=\"\",\"\",IFERROR(((100-Análise!$E$4)/100)*E30,0))","v":""},""]
[null,null,null,null,"",{"$f":"IF(A31=\"\",\"\",IFERROR(((100-Análise!$E$4)/100)*E31,0))","v":""},""]
[null,null,null,null,"",{"$f":"IF(A32=\"\",\"\",IFERROR(((100-Análise!$E$4)/100)*E32,0))","v":""},""]
[null,null,null,null,"",{"$f":"IF(A33=\"\",\"\",IFERROR(((100-Análise!$E$4)/100)*E33,0))","v":""},""]
[null,null,null,null,"",{"$f":"IF(A34=\"\",\"\",IFERROR(((100-Análise!$E$4)/100)*E34,0))","v":""},""]
[null,null,null,null,"",{"$f":"IF(A35=\"\",\"\",IFERROR(((100-Análise!$E$4)/100)*E35,0))","v":""},""]
[null,null,null,null,"",{"$f":"IF(A36=\"\",\"\",IFERROR(((100-Análise!$E$4)/100)*E36,0))","v":""},""]
[null,null,null,null,"",{"$f":"IF(A37=\"\",\"\",IFERROR(((100-Análise!$E$4)/100)*E37,0))","v":""},""]
[null,null,null,null,"",{"$f":"IF(A38=\"\",\"\",IFERROR(((100-Análise!$E$4)/100)*E38,0))","v":""},""]
[null,null,null,null,"",{"$f":"IF(A39=\"\",\"\",IFERROR(((100-Análise!$E$4)/100)*E39,0))","v":""},""]
[null,null,null,null,{"$f":"IF(A40=\"\",\"\",C40*D40)","v":""},{"$f":"IF(A40=\"\",\"\",IFERROR(((100-Análise!$E$4)/100)*E40,0))","v":""},{"$f":"IF(A40=\"\",\"\",E40-F40)","v":""}]
[null,null,null,null,"",{"$f":"IF(A41=\"\",\"\",IFERROR(((100-Análise!$E$4)/100)*E41,0))","v":""},""]
[null,null,null,null,"",{"$f":"IF(A42=\"\",\"\",IFERROR(((100-Análise!$E$4)/100)*E42,0))","v":""},""]
[null,null,null,null,"",{"$f":"IF(A43=\"\",\"\",IFERROR(((100-Análise!$E$4)/100)*E43,0))","v":""},""]
[null,null,null,null,"",{"$f":"IF(A44=\"\",\"\",IFERROR(((100-Análise!$E$4)/100)*E44,0))","v":""},""]
[null,null,null,null,"",{"$f":"IF(A45=\"\",\"\",IFERROR(((100-Análise!$E$4)/100)*E45,0))","v":""},""]
[null,null,null,null,"",{"$f":"IF(A46=\"\",\"\",IFERROR(((100-Análise!$E$4)/100)*E46,0))","v":""},""]
[null,null,null,null,"",{"$f":"IF(A47=\"\",\"\",IFERROR(((100-Análise!$E$4)/100)*E47,0))","v":""},""]
[null,null,null,null,"",{"$f":"IF(A48=\"\",\"\",IFERROR(((100-Análise!$E$4)/100)*E48,0))","v":""},""]
[null,null,null,null,"",{"$f":"IF(A49=\"\",\"\",IFERROR(((100-Análise!$E$4)/100)*E49,0))","v":""},""]
[null,null,null,null,"",{"$f":"IF(A50=\"\",\"\",IFERROR(((100-Análise!$E$4)/100)*E50,0))","v":""},""]
[null,null,null,null,"",{"$f":"IF(A51=\"\",\"\",IFERROR(((100-Análise!$E$4)/100)*E51,0))","v":""},""]
[null,null,null,null,"",{"$f":"IF(A52=\"\",\"\",IFERROR(((100-Análise!$E$4)/100)*E52,0))","v":""},""]
[null,null,null,null,"",{"$f":"IF(A53=\"\",\"\",IFERROR(((100-Análise!$E$4)/100)*E53,0))","v":""},""]
[null,null,null,null,"",{"$f":"IF(A54=\"\",\"\",IFERROR(((100-Análise!$E$4)/100)*E54,0))","v":""},""]
[null,null,null,null,"",{"$f":"IF(A55=\"\",\"\",IFERROR(((100-Análise!$E$4)/100)*E55,0))","v":""},""]
[null,null,null,null,"",{"$f":"IF(A56=\"\",\"\",IFERROR(((100-Análise!$E$4)/100)*E56,0))","v":""},""]
[null,null,null,null,"",{"$f":"IF(A57=\"\",\"\",IFERROR(((100-Análise!$E$4)/100)*E57,0))","v":""},""]
[null,null,null,null,"",{"$f":"IF(A58=\"\",\"\",IFERROR(((100-Análise!$E$4)/100)*E58,0))","v":""},""]
[null,null,null,null,"",{"$f":"IF(A59=\"\",\"\",IFERROR(((100-Análise!$E$4)/100)*E59,0))","v":""},""]
[null,null,null,null,"",{"$f":"IF(A60=\"\",\"\",IFERROR(((100-Análise!$E$4)/100)*E60,0))","v":""},""]
[null,null,null,null,"",{"$f":"IF(A61=\"\",\"\",IFERROR(((100-Análise!$E$4)/100)*E61,0))","v":""},""]
[null,null,null,null,"",{"$f":"IF(A62=\"\",\"\",IFERROR(((100-Análise!$E$4)/100)*E62,0))","v":""},""]
[null,null,null,null,"",{"$f":"IF(A63=\"\",\"\",IFERROR(((100-Análise!$E$4)/100)*E63,0))","v":""},""]
[null,null,null,null,"",{"$f":"IF(A64=\"\",\"\",IFERROR(((100-Análise!$E$4)/100)*E64,0))","v":""},""]
[null,null,null,null,"",{"$f":"IF(A65=\"\",\"\",IFERROR(((100-Análise!$E$4)/100)*E65,0))","v":""},""]
[null,null,null,null,"",{"$f":"IF(A66=\"\",\"\",IFERROR(((100-Análise!$E$4)/100)*E66,0))","v":""},""]
[null,null,null,null,"",{"$f":"IF(A67=\"\",\"\",IFERROR(((100-Análise!$E$4)/100)*E67,0))","v":""},""]
[null,null,null,null,"",{"$f":"IF(A68=\"\",\"\",IFERROR(((100-Análise!$E$4)/100)*E68,0))","v":""},""]
[null,null,null,null,"",{"$f":"IF(A69=\"\",\"\",IFERROR(((100-Análise!$E$4)/100)*E69,0))","v":""},""]
[null,null,null,null,"",{"$f":"IF(A70=\"\",\"\",IFERROR(((100-Análise!$E$4)/100)*E70,0))","v":""},""]
[null,null,null,null,"",{"$f":"IF(A71=\"\",\"\",IFERROR(((100-Análise!$E$4)/100)*E71,0))","v":""},""]
[null,null,null,null,{"$f":"IF(A72=\"\",\"\",C72*D72)","v":""},{"$f":"IF(A72=\"\",\"\",IFERROR(((100-Análise!$E$4)/100)*E72,0))","v":""},{"$f":"IF(A72=\"\",\"\",E72-F72)","v":""}]
[null,null,null,null,"",{"$f":"IF(A73=\"\",\"\",IFERROR(((100-Análise!$E$4)/100)*E73,0))","v":""},""]
[null,null,null,null,"",{"$f":"IF(A74=\"\",\"\",IFERROR(((100-Análise!$E$4)/100)*E74,0))","v":""},""]
[null,null,null,null,"",{"$f":"IF(A75=\"\",\"\",IFERROR(((100-Análise!$E$4)/100)*E75,0))","v":""},""]
[null,null,null,null,"",{"$f":"IF(A76=\"\",\"\",IFERROR(((100-Análise!$E$4)/100)*E76,0))","v":""},""]
[null,null,null,null,"",{"$f":"IF(A77=\"\",\"\",IFERROR(((100-Análise!$E$4)/100)*E77,0))","v":""},""]
[null,null,null,null,"",{"$f":"IF(A78=\"\",\"\",IFERROR(((100-Análise!$E$4)/100)*E78,0))","v":""},""]
[null,null,null,null,"",{"$f":"IF(A79=\"\",\"\",IFERROR(((100-Análise!$E$4)/100)*E79,0))","v":""},""]
[null,null,null,null,"",{"$f":"IF(A80=\"\",\"\",IFERROR(((100-Análise!$E$4)/100)*E80,0))","v":""},""]
[null,null,null,null,"",{"$f":"IF(A81=\"\",\"\",IFERROR(((100-Análise!$E$4)/100)*E81,0))","v":""},""]
[null,null,null,null,"",{"$f":"IF(A82=\"\",\"\",IFERROR(((100-Análise!$E$4)/100)*E82,0))","v":""},""]
[null,null,null,null,{"$f":"IF(A83=\"\",\"\",C83*D83)","v":""},{"$f":"IF(A83=\"\",\"\",IFERROR(((100-Análise!$E$4)/100)*E83,0))","v":""},""]
["Investimentos Semifixos - Aquisição de Animais",null,null,null,{"$f":"SUM(E85:E91)","v":0},{"$f":"IFERROR(SUM(F85:F91),0)","v":0},{"$f":"IFERROR(SUM(G85:G91),0)","v":0},"-"]
[null,null,null,null,{"$f":"IF(A85=\"\",\"\",C85*D85)","v":""},{"$f":"IF(A85=\"\",\"\",IFERROR(((100-Análise!$F$4)/100)*E85,0))","v":""},{"$f":"IF(A85=\"\",\"\",E85-F85)","v":""}]
[null,null,null,null,"",{"$f":"IF(A86=\"\",\"\",IFERROR(((100-Análise!$F$4)/100)*E86,0))","v":""},""]
[null,null,null,null,"",{"$f":"IF(A87=\"\",\"\",IFERROR(((100-Análise!$F$4)/100)*E87,0))","v":""},""]
[null,null,null,null,"",{"$f":"IF(A88=\"\",\"\",IFERROR(((100-Análise!$F$4)/100)*E88,0))","v":""},""]
[null,null,null,null,"",{"$f":"IF(A89=\"\",\"\",IFERROR(((100-Análise!$F$4)/100)*E89,0))","v":""},""]
[null,null,null,null,"",{"$f":"IF(A90=\"\",\"\",IFERROR(((100-Análise!$F$4)/100)*E90,0))","v":""},""]
[null,null,null,null,"",{"$f":"IF(A91=\"\",\"\",IFERROR(((100-Análise!$F$4)/100)*E91,0))","v":""},""]
["Investimentos Semifixos - Máquinas e Equipamentos",null,null,null,{"$f":"SUM(E93:E110)","v":0},{"$f":"IFERROR(SUM(F93:F110),0)","v":0},{"$f":"IFERROR(SUM(G93:G110),0)","v":0},"-"]
[null,null,null,null,{"$f":"IF(A93=\"\",\"\",C93*D93)","v":""},{"$f":"IF(A93=\"\",\"\",IFERROR(((100-Análise!$G$4)/100)*E93,0))","v":""},{"$f":"IF(A93=\"\",\"\",E93-F93)","v":""}]
[null,null,null,null,"",{"$f":"IF(A94=\"\",\"\",IFERROR(((100-Análise!$G$4)/100)*E94,0))","v":""},""]
[null,null,null,null,"",{"$f":"IF(A95=\"\",\"\",IFERROR(((100-Análise!$G$4)/100)*E95,0))","v":""},""]
[null,null,null,null,"",{"$f":"IF(A96=\"\",\"\",IFERROR(((100-Análise!$G$4)/100)*E96,0))","v":""},""]
[null,null,null,null,"",{"$f":"IF(A97=\"\",\"\",IFERROR(((100-Análise!$G$4)/100)*E97,0))","v":""},""]
[null,null,null,null,"",{"$f":"IF(A98=\"\",\"\",IFERROR(((100-Análise!$G$4)/100)*E98,0))","v":""},""]
[null,null,null,null,"",{"$f":"IF(A99=\"\",\"\",IFERROR(((100-Análise!$G$4)/100)*E99,0))","v":""},""]
[null,null,null,null,"",{"$f":"IF(A100=\"\",\"\",IFERROR(((100-Análise!$G$4)/100)*E100,0))","v":""},""]
[null,null,null,null,"",{"$f":"IF(A101=\"\",\"\",IFERROR(((100-Análise!$G$4)/100)*E101,0))","v":""},""]
[null,null,null,null,"",{"$f":"IF(A102=\"\",\"\",IFERROR(((100-Análise!$G$4)/100)*E102,0))","v":""},""]
[null,null,null,null,"",{"$f":"IF(A103=\"\",\"\",IFERROR(((100-Análise!$G$4)/100)*E103,0))","v":""},""]
[null,null,null,null,"",{"$f":"IF(A104=\"\",\"\",IFERROR(((100-Análise!$G$4)/100)*E104,0))","v":""},""]
[null,null,null,null,"",{"$f":"IF(A105=\"\",\"\",IFERROR(((100-Análise!$G$4)/100)*E105,0))","v":""},""]
[null,null,null,null,"",{"$f":"IF(A106=\"\",\"\",IFERROR(((100-Análise!$G$4)/100)*E106,0))","v":""},""]
[null,null,null,null,"",{"$f":"IF(A107=\"\",\"\",IFERROR(((100-Análise!$G$4)/100)*E107,0))","v":""},""]
[null,null,null,null,"",{"$f":"IF(A108=\"\",\"\",IFERROR(((100-Análise!$G$4)/100)*E108,0))","v":""},""]
[null,null,null,null,"",{"$f":"IF(A109=\"\",\"\",IFERROR(((100-Análise!$G$4)/100)*E109,0))","v":""},""]
[null,null,null,null,"",{"$f":"IF(A110=\"\",\"\",IFERROR(((100-Análise!$G$4)/100)*E110,0))","v":""},""]
["Custeio",null,null,null,{"$f":"SUM(E112:E144)","v":0},{"$f":"IFERROR(SUM(F112:F144),0)","v":0},{"$f":"IFERROR(SUM(G112:G144),0)","v":0},"-"]
[null,null,null,null,{"$f":"IF(A112=\"\",\"\",C112*D112)","v":""},{"$f":"IF(A112=\"\",\"\",IFERROR(((100-Análise!$H$4)/100)*E112,0))","v":""},{"$f":"IF(A112=\"\",\"\",E112-F112)","v":""}]
[null,null,null,null,"",{"$f":"IF(A113=\"\",\"\",IFERROR(((100-Análise!$H$4)/100)*E113,0))","v":""},""]
[null,null,null,null,"",{"$f":"IF(A114=\"\",\"\",IFERROR(((100-Análise!$H$4)/100)*E114,0))","v":""},""]
[null,null,null,null,"",{"$f":"IF(A115=\"\",\"\",IFERROR(((100-Análise!$H$4)/100)*E115,0))","v":""},""]
[null,null,null,null,"",{"$f":"IF(A116=\"\",\"\",IFERROR(((100-Análise!$H$4)/100)*E116,0))","v":""},""]
[null,null,null,null,"",{"$f":"IF(A117=\"\",\"\",IFERROR(((100-Análise!$H$4)/100)*E117,0))","v":""},""]
[null,null,null,null,"",{"$f":"IF(A118=\"\",\"\",IFERROR(((100-Análise!$H$4)/100)*E118,0))","v":""},""]
[null,null,null,null,"",{"$f":"IF(A119=\"\",\"\",IFERROR(((100-Análise!$H$4)/100)*E119,0))","v":""},""]
[null,null,null,null,"",{"$f":"IF(A120=\"\",\"\",IFERROR(((100-Análise!$H$4)/100)*E120,0))","v":""},""]
[null,null,null,null,"",{"$f":"IF(A121=\"\",\"\",IFERROR(((100-Análise!$H$4)/100)*E121,0))","v":""},""]
[null,null,null,null,"",{"$f":"IF(A122=\"\",\"\",IFERROR(((100-Análise!$H$4)/100)*E122,0))","v":""},""]
[null,null,null,null,"",{"$f":"IF(A123=\"\",\"\",IFERROR(((100-Análise!$H$4)/100)*E123,0))","v":""},""]
[null,null,null,null,"",{"$f":"IF(A124=\"\",\"\",IFERROR(((100-Análise!$H$4)/100)*E124,0))","v":""},""]
[null,null,null,null,"",{"$f":"IF(A125=\"\",\"\",IFERROR(((100-Análise!$H$4)/100)*E125,0))","v":""},""]
[null,null,null,null,"",{"$f":"IF(A126=\"\",\"\",IFERROR(((100-Análise!$H$4)/100)*E126,0))","v":""},""]
[null,null,null,null,"",{"$f":"IF(A127=\"\",\"\",IFERROR(((100-Análise!$H$4)/100)*E127,0))","v":""},""]
[null,null,null,null,"",{"$f":"IF(A128=\"\",\"\",IFERROR(((100-Análise!$H$4)/100)*E128,0))","v":""},""]
[null,null,null,null,"",{"$f":"IF(A129=\"\",\"\",IFERROR(((100-Análise!$H$4)/100)*E129,0))","v":""},""]
[null,null,null,null,"",{"$f":"IF(A130=\"\",\"\",IFERROR(((100-Análise!$H$4)/100)*E130,0))","v":""},""]
[null,null,null,null,"",{"$f":"IF(A131=\"\",\"\",IFERROR(((100-Análise!$H$4)/100)*E131,0))","v":""},""]
[null,null,null,null,"",{"$f":"IF(A132=\"\",\"\",IFERROR(((100-Análise!$H$4)/100)*E132,0))","v":""},""]
[null,null,null,null,"",{"$f":"IF(A133=\"\",\"\",IFERROR(((100-Análise!$H$4)/100)*E133,0))","v":""},""]
[null,null,null,null,"",{"$f":"IF(A134=\"\",\"\",IFERROR(((100-Análise!$H$4)/100)*E134,0))","v":""},""]
[null,null,null,null,"",{"$f":"IF(A135=\"\",\"\",IFERROR(((100-Análise!$H$4)/100)*E135,0))","v":""},""]
[null,null,null,null,"",{"$f":"IF(A136=\"\",\"\",IFERROR(((100-Análise!$H$4)/100)*E136,0))","v":""},""]
[null,null,null,null,"",{"$f":"IF(A137=\"\",\"\",IFERROR(((100-Análise!$H$4)/100)*E137,0))","v":""},""]
[null,null,null,null,"",{"$f":"IF(A138=\"\",\"\",IFERROR(((100-Análise!$H$4)/100)*E138,0))","v":""},""]
[null,null,null,null,"",{"$f":"IF(A139=\"\",\"\",IFERROR(((100-Análise!$H$4)/100)*E139,0))","v":""},""]
[null,null,null,null,"",{"$f":"IF(A140=\"\",\"\",IFERROR(((100-Análise!$H$4)/100)*E140,0))","v":""},""]
[null,null,null,null,"",{"$f":"IF(A141=\"\",\"\",IFERROR(((100-Análise!$H$4)/100)*E141,0))","v":""},""]
[null,null,null,null,"",{"$f":"IF(A142=\"\",\"\",IFERROR(((100-Análise!$H$4)/100)*E142,0))","v":""},""]
[null,null,null,null,"",{"$f":"IF(A143=\"\",\"\",IFERROR(((100-Análise!$H$4)/100)*E143,0))","v":""},""]
[null,null,null,null,"",{"$f":"IF(A144=\"\",\"\",IFERROR(((100-Análise!$H$4)/100)*E144,0))","v":""},""]
["Outros Custos",null,null,null,{"$f":"IFERROR(SUM(E146:E151),0)","v":0},{"$f":"IFERROR(SUM(F146:F151),0)","v":0},{"$f":"IFERROR(SUM(G146:G151),0)","v":0},"-"]
[{"$f":"IF(OR('Dados Cadastrais'!E95=\"não\",'Dados Cadastrais'!E95=\"\"),\"\",\"Elaboração do Projeto\")","v":""},{"$f":"IF(A146=\"\",\"\",\"vb\")","v":""},{"$f":"IF(A146=\"\",\"\",1)","v":""},{"$f":"IF(A146=\"\",\"\",(TRUNC(Análise!$E$17*SUM($E$6,$E$84,$E$92,$E$111),2)))","v":""},{"$f":"IF(A146=\"\",\"\",IFERROR(C146*D146,0))","v":""},{"$f":"IF(C146=\"\",\"\",TRUNC(Análise!$E$17*SUM($F$6,$F$84,$F$92,$F$111),2))","v":""},{"$f":"IF(A146=\"\",\"\",E146-F146)","v":""}]
[{"$f":"IF(OR('Dados Cadastrais'!E95=\"não\",'Dados Cadastrais'!E95=\"\"),\"\",\"Assistência Técnica - Parcela 1\")","v":""},"","",{"$f":"IF(A147=\"\",\"\",(TRUNC(Análise!$E$18/'Dados Cadastrais'!$E$96*SUM($E$6,$E$84,$E$92,$E$111),2)))","v":""},{"$f":"IF(A147=\"\",\"\",IFERROR(C147*D147,0))","v":""},{"$f":"IF(C147=\"\",\"\",TRUNC(Análise!$E$18/'Dados Cadastrais'!$E$96*SUM($F$6,$F$84,$F$92,$F$111),2))","v":""},""]
[{"$f":"IF(OR('Dados Cadastrais'!E95=\"não\",'Dados Cadastrais'!E95=\"\"),\"\",IF('Dados Cadastrais'!$E$96>1,\"Assistência Técnica - Parcela 2\",\"\"))","v":""},"","",{"$f":"IF(A148=\"\",\"\",TRUNC(Análise!$E$18/'Dados Cadastrais'!$E$96*SUM($E$6,$E$84,$E$92,$E$111),2))","v":""},{"$f":"IF(A148=\"\",\"\",IFERROR(C148*D148,0))","v":""},{"$f":"IF(C148=\"\",\"\",TRUNC(Análise!$E$18/'Dados Cadastrais'!$E$96*SUM($F$6,$F$84,$F$92,$F$111),2))","v":""},""]
[{"$f":"IF(OR('Dados Cadastrais'!E95=\"não\",'Dados Cadastrais'!E95=\"\"),\"\",IF('Dados Cadastrais'!$E$96>2,\"Assistência Técnica - Parcela 3\",\"\"))","v":""},"","",{"$f":"IF(A149=\"\",\"\",TRUNC(Análise!$E$18/'Dados Cadastrais'!$E$96*SUM($E$6,$E$84,$E$92,$E$111),2))","v":""},{"$f":"IF(A149=\"\",\"\",C149*D149)","v":""},{"$f":"IF(C149=\"\",\"\",TRUNC(Análise!$E$18/'Dados Cadastrais'!$E$96*SUM($F$6,$F$84,$F$92,$F$111),2))","v":""},""]
[{"$f":"IF(OR('Dados Cadastrais'!E95=\"não\",'Dados Cadastrais'!E95=\"\"),\"\",IF('Dados Cadastrais'!$E$96>3,\"Assistência Técnica - Parcela 4\",\"\"))","v":""},"","",{"$f":"IF(A150=\"\",\"\",TRUNC(Análise!$E$18/'Dados Cadastrais'!$E$96*SUM($E$6,$E$84,$E$92,$E$111),2))","v":""},{"$f":"IF(A150=\"\",\"\",C150*D150)","v":""},{"$f":"IF(C150=\"\",\"\",TRUNC(Análise!$E$18/'Dados Cadastrais'!$E$96*SUM($F$6,$F$84,$F$92,$F$111),2))","v":""},""]
[{"$f":"IF(OR('Dados Cadastrais'!$E$95=\"não\",Análise!$E$17=\"\"),\"\",IF('Dados Cadastrais'!$E$96>4,\"Assistência Técnica - Parcela 5\",\"\"))","v":""},"","",{"$f":"IF(A151=\"\",\"\",TRUNC(Análise!$E$18/'Dados Cadastrais'!$E$96*SUM($E$6,$E$84,$E$92,$E$111),2))","v":""},{"$f":"IF(A151=\"\",\"\",C151*D151)","v":""},{"$f":"IF(C151=\"\",\"\",TRUNC(Análise!$E$18/'Dados Cadastrais'!$E$96*SUM($F$6,$F$84,$F$92,$F$111),2))","v":""},""]
["Total",null,null,null,{"$f":"E84+E111+E145+E92+E6","v":0},{"$f":"F84+F111+F145+F92+F6","v":0},{"$f":"G84+G111+G145+G92+G6","v":0},"-"]

{"sheet":"Dimensionamento de tratores","index":6,"n_rows":45,"n_cols":16,"rows_kept":45,"cut":false,"hidden":false,"merged":[[0,0,2,8],[3,0,3,8],[4,0,4,8],[7,1,7,2],[7,3,7,4],[7,5,7,6],[7,7,7,8],[8,1,8,2],[8,3,8,4],[8,5,8,6],[8,7,8,8],[9,1,9,2],[9,3,9,4],[9,5,9,6],[9,7,9,8],[10,1,10,2],[10,3,10,4],[10,5,10,6],[10,7,10,8],[11,1,11,2],[11,3,11,4],[11,5,11,6],[11,7,11,8],[14,0,15,1],[14,2,15,2],[14,3,14,8],[15,7,15,8],[16,0,16,1],[16,7,16,8],[24,0,24,1],[17,0,17,1],[17,7,17,8],[18,0,18,1],[18,7,18,8],[19,0,19,1],[19,7,19,8],[20,0,20,1],[20,7,20,8],[21,0,21,1],[22,0,22,1],[23,0,23,1],[33,0,33,1],[33,7,33,8],[25,0,25,1],[26,0,26,1],[26,7,26,8],[27,0,27,1],[27,7,27,8],[28,0,28,1],[28,7,28,8],[30,0,30,8],[31,0,31,1],[31,7,31,8],[32,0,32,1],[32,7,32,8],[34,0,34,1],[34,7,34,8],[35,0,35,1],[35,7,35,8],[36,0,36,1],[36,7,36,8],[43,2,43,4],[44,2,44,8],[44,0,44,1],[37,0,37,1],[37,7,37,8],[38,0,38,1],[38,7,38,8],[39,0,39,1],[39,7,39,8],[40,0,40,1],[40,7,40,8],[41,7,41,8],[42,0,42,1],[42,7,42,8]]}
[]
[]
[]
["DIMENSIONAMENTO DA NECESSICADE DE AQUISIÇÃO DE TRATORES"]
[]
[]
["Características do trator"]
["Qtde","Marca",null,"Modelo ",null,"Potência (CV)",null,"Código Finame"]
[]
[]
[]
[]
[]
["Demanda de serviços",null,null,null,null,null,null,null,null,null,"área","Preparo solo","Plantio","Pulverização","Transporte","Tomada de força"]
["Explorações Agrícolas",null,"Área (ha)","Quantidade de Operações"]
[null,null,null,"Preparo solo","Plantio","Pulverização","Transporte","Tomada de força",null,null,{"$f":"C17","v":0},{"$f":"IFERROR(D17*C17,0)","v":0},{"$f":"IFERROR(E17*C17,0)","v":0},{"$f":"IFERROR(F17*C17,0)","v":0},{"$f":"IFERROR(G17*C17,0)","v":0},{"$f":"IFERROR(H17*C17,0)","v":0}]
[null,null,null,null,null,null,null,null,null,null,{"$f":"C18","v":0},{"$f":"IFERROR(D18*C18,0)","v":0},{"$f":"IFERROR(E18*C18,0)","v":0},{"$f":"IFERROR(F18*C18,0)","v":0},{"$f":"IFERROR(G18*C18,0)","v":0},{"$f":"IFERROR(H18*C18,0)","v":0}]
[null,null,null,null,null,null,null,null,null,null,{"$f":"C19","v":0},0,0,0,0,0]
[null,null,null,null,null,null,null,null,null,null,{"$f":"C20","v":0},0,0,0,0,0]
[null,null,null,null,null,null,null,null,null,null,0,0,0,0,0,0]
[null,null,null,null,null,null,null,null,null,null,0,0,0,0,0,0]
[null,null,null,null,null,null,null,null,null,null,0,0,0,0,0,0]
[null,null,null,null,null,null,null,null,null,null,0,0,0,0,0,0]
[null,null,null,null,null,null,null,null,null,null,0,0,0,0,0,0]
[null,null,null,null,null,null,null,null,null,null,0,0,0,0,0,0]
[null,null,null,null,null,null,null,null,null,null,0,0,0,0,0,0]
[null,null,null,null,null,null,null,null,null,null,0,0,0,0,0,0]
[null,null,null,null,null,null,null,null,null,null,{"$f":"C29","v":0},0,0,0,0,0]
["Outros",null,null,null,null,null,null,null,null,null,null,{"$f":"SUM(L16:L28)","v":0},{"$f":"SUM(M16:M28)","v":0},{"$f":"SUM(N16:N28)","v":0},{"$f":"SUM(O16:O28)","v":0},{"$f":"SUM(P16:P28)","v":0}]
[]
["Dimensionamento"]
["Índices",null,"Trator","Preparo solo","Plantio","Pulverizador","Transporte","Tomada de força"]
["Faixa de trabalho (m)"]
["Velocidade (Km/h)"]
["Eficiência de campo (%)"]
["Coeficiente mecanizado (ha/h)",null,null,{"$f":"IF(D33=0,0,IF(D34=0,0,IF(D35=0,0,10/D33/D34/D35*100)))","v":0},{"$f":"IF(E33=0,0,IF(E34=0,0,IF(E35=0,0,10/E33/E34/E35*100)))","v":0},{"$f":"IF(F33=0,0,IF(F34=0,0,IF(F35=0,0,10/F33/F34/F35*100)))","v":0},{"$f":"IF(G33=0,0,IF(G34=0,0,IF(G35=0,0,10/G33/G34/G35*100)))","v":0},{"$f":"H33/H35*100","v":{"$error":"#DIV/0!"}}]
["Área a trabalhar (ha)",null,null,{"$f":"L29","v":0},{"$f":"M29","v":0},{"$f":"N29","v":0},{"$f":"O29","v":0},{"$f":"P29","v":0}]
["Potência necessária às atividades (cv)",null,{"$f":"SUM(D38:I38)","v":450},100,100,75,75,100]
["Total de horas a trabalhar (h)",null,{"$f":"SUM(D39:I39)","v":{"$error":"#DIV/0!"}},{"$f":"D37*D36","v":0},{"$f":"E37*E36","v":0},{"$f":"F37*F36","v":0},{"$f":"G37*G36","v":0},{"$f":"H37*H36","v":{"$error":"#DIV/0!"}}]
["Necessidade de tratores (unidade)",null,{"$f":"IF(C38=0,0,C39/C38)","v":{"$error":"#DIV/0!"}}]
["Tratores existentes (unidade)"]
["Potência dos tratores existentes (cv)"]
["Resultado (Viabilidade = - 0,40)",null,{"$f":"((C40*-1)+((C41*C42)/100))","v":{"$error":"#DIV/0!"}}]
[]
["Conclusão:",null,{"$f":"IF(C40<=-0.4,\"As atividades exercidas e a área explorada justificam a aquisição do novo trator\",IF(C40=0,\"\",\"A aquisição do novo trator é inviável tecnicamente\"))","v":{"$error":"#DIV/0!"}}]

{"sheet":"Informações do Imóvel","index":7,"n_rows":69,"n_cols":12,"rows_kept":69,"cut":false,"hidden":false,"merged":[[1,0,1,8]]}
[]
["12. Imóveis"]
["Descrição do Imóvel","Proprietário","N° CAR","Tipo","CCIR","NIRF/CIB","Área (ha)","Consolidada (ha)","Situação do CAR","Benfeitorias (R$)","Máquinas (R$)","Veiculos (R$)"]
[]
[]
[]
[]
[]
[]
[]
[]
[]
[]
[]
[]
[]
[]
[]
[]
[]
[]
[]
[]
[]
[]
[]
[]
[]
[]
[]
[]
[]
[]
[]
[]
[]
[]
[]
[]
[]
[]
[]
[]
[]
[]
[]
[]
[]
[]
[]
[]
[]
[]
[]
[]
[]
[]
[]
[]
[]
[]
[]
[]
[]
[]
[]
[]
[]
["Total",null,{"$f":"SUBTOTAL(103,Tabela1[N° CAR])","v":0},null,null,null,{"$f":"SUBTOTAL(109,Tabela1[Área (ha)])","v":0},{"$f":"SUBTOTAL(109,Tabela1[Consolidada (ha)])","v":0},null,{"$f":"SUBTOTAL(109,Tabela1[Benfeitorias (R$)])","v":0},{"$f":"SUBTOTAL(109,Tabela1[Máquinas (R$)])","v":0},{"$f":"SUBTOTAL(109,Tabela1[Veiculos (R$)])","v":0}]

{"sheet":"Garantias","index":8,"n_rows":66,"n_cols":13,"rows_kept":66,"cut":false,"hidden":false,"merged":[]}
[]
["13. Garantias"]
["13.1 Garantias Fidejussórias"]
["TIPO DE GARANTIA","OBJETO DA GARANTIA","NOME","CPF","RG","ESTADO CIVIL","RENDA BRUTA ANUAL","NOME DO CÔNJUGE","CPF DO CÔNJUGE","ENDEREÇO","CEP","MUNICÍPIO","UF"]
[]
[]
[]
[]
[]
[]
["TOTAL","-","-","-","-","-",{"$f":"SUBTOTAL(9,$G$6:G10)","v":0},"-","-","-","-","-","-"]
[]
["13.2 Garantias Reais "]
["TIPO DE GARANTIA","OBJETO DA GARANTIA","DESCRIÇÃO DA GARANTIA","MATRÍCULA","FOLHA","LIVRO","COMARCA","CARTÓRIO","VALOR","ENDEREÇO","CEP","MUNICÍPIO","UF"]
[]
[]
[]
[]
[]
[]
[]
[]
[]
[]
[]
[]
[]
[]
[]
[]
[]
[]
[]
[]
[]
[]
[]
[]
[]
[]
[]
[]
[]
[]
[]
[]
[]
[]
[]
[]
[]
[]
[]
[]
[]
[]
[]
[]
[]
[]
[]
[]
[]
[]
[]
["TOTAL","-","-","-","-","-","-","-",{"$f":"SUBTOTAL(9,Tabela7[VALOR])","v":0},"-","-","-","-"]

{"sheet":"Atividades não financiadas","index":9,"n_rows":55,"n_cols":7,"rows_kept":55,"cut":false,"hidden":false,"merged":[[28,0,29,0],[28,1,29,1],[28,2,29,2],[28,3,28,6],[42,0,42,1],[2,0,3,0],[2,1,3,1],[2,2,3,2],[2,3,2,6],[15,0,16,0],[15,1,16,1],[15,2,16,2],[15,3,15,6]]}
[]
["14. Atividades não financiadas"]
["Produto","Área (ha)","Unidade","Produtividade  (und/ha)"]
[null,null,null,"Ano 1","Ano 2","Ano 3","Ano 4"]
[]
[]
[]
[]
[]
[]
[]
[]
[]
[]
[]
["Produto","Área (ha)","Unidade","Produtividade  (und/ha)"]
[null,null,null,"Ano 5","Ano 6","Ano 7","Ano 8"]
[{"$f":"IF(A5=\"\",\"\",A5)","v":""}]
[{"$f":"IF(A6=\"\",\"\",A6)","v":""}]
[""]
[""]
[""]
[""]
[""]
[""]
[""]
[""]
[""]
["Produto","Área (ha)","Unidade","Produtividade  (und/ha)"]
[null,null,null,"Ano 9","Ano 10","Ano 11","Ano 12"]
[{"$f":"IF(A5=\"\",\"\",A5)","v":""}]
[{"$f":"IF(A6=\"\",\"\",A6)","v":""}]
[""]
[""]
[""]
[""]
[""]
[""]
[""]
[""]
[""]
[]
["15. Preço de Comercialização"]
["Produto","Valor Unitário "]
[{"$f":"IF(A5=\"\",\"\",CONCATENATE(A5,\" \",\"(\",C5,\")\"))","v":""}]
[{"$f":"IF(A6=\"\",\"\",CONCATENATE(A6,\" \",\"(\",C6,\")\"))","v":""}]
[""]
[""]
[""]
[""]
[""]
[""]
[""]
[""]
[""]

{"sheet":"Agricultura","index":10,"n_rows":151,"n_cols":7,"rows_kept":151,"cut":false,"hidden":false,"merged":[[58,3,58,6],[151,0,161,6],[150,0,150,6],[148,0,148,4],[142,0,142,4],[143,0,143,6],[144,0,144,1],[144,6,147,6],[145,0,145,1],[146,0,146,1],[147,0,147,1],[136,0,136,4],[137,0,137,6],[138,0,138,1],[138,6,141,6],[139,0,139,1],[140,0,140,1],[141,0,141,1],[123,0,123,4],[124,0,124,6],[125,0,125,1],[125,6,135,6],[133,0,133,1],[134,0,134,1],[135,0,135,1],[126,0,126,1],[127,0,127,1],[128,0,128,1],[129,0,129,1],[130,0,130,1],[131,0,131,1],[132,0,132,1],[116,0,116,4],[117,0,117,6],[118,0,118,6],[119,0,119,1],[119,6,122,6],[120,0,120,1],[121,0,121,1],[122,0,122,1],[110,0,110,4],[111,0,111,6],[112,0,112,1],[112,6,115,6],[113,0,113,1],[114,0,114,1],[115,0,115,1],[97,0,97,4],[98,0,98,6],[99,0,99,1],[99,6,109,6],[107,0,107,1],[108,0,108,1],[109,0,109,1],[100,0,100,1],[101,0,101,1],[102,0,102,1],[103,0,103,1],[104,0,104,1],[105,0,105,1],[106,0,106,1],[91,0,91,6],[92,0,92,6],[93,0,93,1],[93,6,96,6],[94,0,94,1],[95,0,95,1],[96,0,96,1],[30,0,31,0],[30,1,31,1],[30,2,31,2],[30,3,30,6],[89,0,90,1],[89,2,90,2],[89,3,90,3],[89,4,89,5],[89,6,90,6],[44,0,45,0],[44,1,45,1],[44,2,45,2],[44,3,44,6],[58,0,59,0],[58,1,59,1],[58,2,59,2],[2,0,3,0],[2,1,3,1],[2,2,3,2],[2,3,2,6],[16,0,17,0],[16,1,17,1],[16,2,17,2],[16,3,16,6]]}
[]
["16. Receitas Agricolas"]
["Produto","Área (ha)","Unidade","Produtividade  (und/ha)"]
[null,null,null,"Ano 1","Ano 2","Ano 3","Ano 4"]
[]
[]
[]
[]
[]
[]
[]
[]
[]
[]
[]
[]
["Produto","Área (ha)","Unidade","Produtividade  (und/ha)"]
[null,null,null,"Ano 5","Ano 6","Ano 7","Ano 8"]
[{"$f":"IF(A5=\"\",\"\",A5)","v":""},{"$f":"IF(A19=\"\",0,B5)","v":0},{"$f":"IF(A19=\"\",\"\",C5)","v":""}]
[{"$f":"IF(A6=\"\",\"\",A6)","v":""},{"$f":"IF(A20=\"\",0,B6)","v":0},{"$f":"IF(A20=\"\",\"\",C6)","v":""}]
[{"$f":"IF(A7=\"\",\"\",A7)","v":""},0,""]
["",0,""]
["",0,""]
["",0,""]
["",0,""]
["",0,""]
["",0,""]
["",0,""]
["",0,""]
["",0,""]
["Produto","Área (ha)","Unidade","Produtividade  (und/ha)"]
[null,null,null,"Ano 9","Ano 10","Ano 11","Ano 12"]
[{"$f":"IF(A5=\"\",\"\",A5)","v":""},{"$f":"IF(A33=\"\",0,B19)","v":0},{"$f":"IF(A33=\"\",\"\",C19)","v":""}]
[{"$f":"IF(A6=\"\",\"\",A6)","v":""},{"$f":"IF(A34=\"\",0,B20)","v":0},{"$f":"IF(A34=\"\",\"\",C20)","v":""}]
[{"$f":"IF(A7=\"\",\"\",A7)","v":""},0,""]
["",0,""]
["",0,""]
["",0,""]
["",0,""]
["",0,""]
["",0,""]
["",0,""]
["",0,""]
[{"$f":"IF(A16=\"\",\"\",A16)","v":""},0,""]
["Produto","Área (ha)","Unidade","Produtividade  (und/ha)"]
[null,null,null,13,14,15,16]
[{"$f":"IF(A19=\"\",\"\",A19)","v":""},{"$f":"IF(A47=\"\",0,B33)","v":0},{"$f":"IF(A47=\"\",\"\",C33)","v":""}]
[{"$f":"IF(A20=\"\",\"\",A20)","v":""},{"$f":"IF(A48=\"\",0,B34)","v":0},{"$f":"IF(A48=\"\",\"\",C34)","v":""}]
[{"$f":"IF(A21=\"\",\"\",A21)","v":""},0,""]
["",0,""]
["",0,""]
["",0,""]
["",0,""]
["",0,""]
["",0,""]
["",0,""]
["",0,""]
[{"$f":"IF(A30=\"\",\"\",A30)","v":""},0,""]
["Produto","Área (ha)","Unidade","Produtividade  (und/ha)"]
[null,null,null,17,18,19,20]
[{"$f":"IF(A33=\"\",\"\",A33)","v":""},{"$f":"IF(A61=\"\",0,B47)","v":0},{"$f":"IF(A61=\"\",\"\",C47)","v":""}]
[{"$f":"IF(A34=\"\",\"\",A34)","v":""},{"$f":"IF(A62=\"\",0,B48)","v":0},{"$f":"IF(A62=\"\",\"\",C48)","v":""}]
["",0,""]
["",0,""]
["",0,""]
["",0,""]
["",0,""]
["",0,""]
["",0,""]
["",0,""]
["",0,""]
[{"$f":"IF(A44=\"\",\"\",A44)","v":""},0,""]
[]
["17. Preço de Comercialização"]
["Produto","Valor Unitário (R$)"]
[{"$f":"IF(A5=\"\",\"\",CONCATENATE(A5,\" \",\"(\",C5,\")\"))","v":""},null,{"$f":"IF(B76=\"\",IF(A5=\"\",\"\",\"*Preenchimento Obrigatório\"),\"\")","v":""}]
["",null,""]
["",null,""]
["",null,""]
["",null,""]
["",null,""]
["",null,""]
["",null,""]
["",null,""]
["",null,""]
["",null,""]
["",null,""]
[]
["18. Custo Operacional - Despesas não Financiadas"]
["Especificação",null,"Unid.","Quant.","Valor (R$)",null,"Ano de Inicio de Aplicação"]
[null,null,null,null,"Unit.","Total"]
["Insumos"]
[" 1 – Preparo do solo/plantio"]
[null,null,null,null,null,{"$f":"D94*E94","v":0}]
[null,null,null,null,null,{"$f":"D95*E95","v":0}]
[null,null,null,null,null,{"$f":"D96*E96","v":0}]
[null,null,null,null,null,{"$f":"D97*E97","v":0}]
["Total",null,null,null,null,{"$f":"SUM(F94:F97)","v":0},"-"]
["2 – Tratos culturais"]
[null,null,null,null,null,{"$f":"D100*E100","v":0}]
[null,null,null,null,null,{"$f":"D101*E101","v":0}]
[null,null,null,null,null,{"$f":"D102*E102","v":0}]
[null,null,null,null,null,0]
[null,null,null,null,null,0]
[null,null,null,null,null,0]
[null,null,null,null,null,0]
[null,null,null,null,null,0]
[null,null,null,null,null,{"$f":"D108*E108","v":0}]
[null,null,null,null,null,{"$f":"D109*E109","v":0}]
[null,null,null,null,null,{"$f":"D110*E110","v":0}]
["Total",null,null,null,null,{"$f":"SUM(F100:F110)","v":0},"-"]
["3 – Colheita "]
[null,null,null,null,null,{"$f":"D113*E113","v":0}]
[null,null,null,null,null,{"$f":"D114*E114","v":0}]
[null,null,null,null,null,{"$f":"D115*E115","v":0}]
[null,null,null,null,null,{"$f":"D116*E116","v":0}]
["Total",null,null,null,null,{"$f":"SUM(F113:F116)","v":0},"-"]
["Serviços"]
["1 – Preparo do  solo/plantio"]
[null,null,null,null,null,{"$f":"D120*E120","v":0}]
[null,null,null,null,null,{"$f":"D121*E121","v":0}]
[null,null,null,null,null,{"$f":"D122*E122","v":0}]
[null,null,null,null,null,{"$f":"D123*E123","v":0}]
["Total",null,null,null,null,{"$f":"SUM(F120:F123)","v":0},"-"]
["2 – Tratos culturais"]
[null,null,null,null,null,{"$f":"D126*E126","v":0}]
[null,null,null,null,null,{"$f":"D127*E127","v":0}]
[null,null,null,null,null,0]
[null,null,null,null,null,0]
[null,null,null,null,null,0]
[null,null,null,null,null,0]
[null,null,null,null,null,0]
[null,null,null,null,null,0]
[null,null,null,null,null,{"$f":"D134*E134","v":0}]
[null,null,null,null,null,{"$f":"D135*E135","v":0}]
[null,null,null,null,null,{"$f":"D136*E136","v":0}]
["Total",null,null,null,null,{"$f":"SUM(F126:F136)","v":0},"-"]
["3 – Colheita"]
[null,null,null,null,null,{"$f":"D139*E139","v":0}]
[null,null,null,null,null,{"$f":"D140*E140","v":0}]
[null,null,null,null,null,{"$f":"D141*E141","v":0}]
[null,null,null,null,null,{"$f":"D142*E142","v":0}]
["Total",null,null,null,null,{"$f":"SUM(F139:F142)","v":0},"-"]
["Outros Desembolsos"]
["Energia elétrica",null,null,null,null,{"$f":"D145*E145","v":0}]
["Combustível",null,null,null,null,{"$f":"D146*E146","v":0}]
["Transporte interno",null,null,null,null,{"$f":"D147*E147","v":0}]
["Outros",null,null,null,null,{"$f":"D148*E148","v":0}]
["Total",null,null,null,null,{"$f":"SUM(F145:F148)","v":0},"-"]
[]
["19. Justificativa Técnica"]

{"sheet":"Piscicultura-Apicultura","index":11,"n_rows":105,"n_cols":7,"rows_kept":105,"cut":false,"hidden":true,"merged":[[105,0,111,6],[102,0,102,4],[96,0,96,4],[97,0,97,6],[98,0,98,1],[98,6,101,6],[99,0,99,1],[100,0,100,1],[101,0,101,1],[90,0,90,4],[91,0,91,6],[92,0,92,1],[92,6,95,6],[93,0,93,1],[94,0,94,1],[95,0,95,1],[84,0,84,4],[85,0,85,6],[86,0,86,1],[86,6,89,6],[87,0,87,1],[88,0,88,1],[89,0,89,1],[77,0,77,4],[78,0,78,6],[79,0,79,6],[80,0,80,1],[80,6,83,6],[81,0,81,1],[82,0,82,1],[83,0,83,1],[71,0,71,4],[72,0,72,6],[73,0,73,1],[73,6,76,6],[74,0,74,1],[75,0,75,1],[76,0,76,1],[65,0,65,4],[66,0,66,6],[67,0,67,1],[67,6,70,6],[68,0,68,1],[69,0,69,1],[70,0,70,1],[59,0,59,6],[60,0,60,6],[61,0,61,1],[61,6,64,6],[62,0,62,1],[63,0,63,1],[64,0,64,1],[28,0,29,0],[28,1,29,1],[28,2,29,2],[28,3,28,6],[57,0,58,1],[57,2,58,2],[57,3,58,3],[57,4,57,5],[57,6,58,6],[2,0,3,0],[2,1,3,1],[2,2,3,2],[2,3,2,6],[15,0,16,0],[15,1,16,1],[15,2,16,2],[15,3,15,6]]}
[]
["17. Receitas de Piscicultura e/ou Apicultura"]
["Produto","Tanques - Colmeias (n°)","Unidade","Produtividade  (und/tanque-colmeia)"]
[null,null,null,"Ano 1","Ano 2","Ano 3","Ano 4"]
[]
[]
[]
[]
[]
[]
[]
[]
[]
[]
[]
["Produto","Tanques - Colmeias (n°)","Unidade","Produtividade  (und/tanque-colmeia)"]
[null,null,null,"Ano 5","Ano 6","Ano 7","Ano 8"]
[{"$f":"IF(A5=\"\",\"\",A5)","v":""}]
[""]
[""]
[""]
[""]
[""]
[""]
[""]
[""]
[""]
[""]
["Produto","Tanques - Colmeias (n°)","Unidade","Produtividade  (und/tanque-colmeia)"]
[null,null,null,"Ano 9","Ano 10","Ano 11","Ano 12"]
[{"$f":"IF(A5=\"\",\"\",A5)","v":""}]
[""]
[""]
[""]
[""]
[""]
[""]
[""]
[""]
[""]
[""]
[]
["18. Preço de Comercialização "]
["Produto","Valor Unitário "]
[{"$f":"IF(A5=\"\",\"\",CONCATENATE(A5,\" \",\"(\",C5,\")\"))","v":""},null,{"$f":"IF(B45=\"\",IF(A45=\"\",\"\",\"*Preenchimento Obrigatório\"),\"\")","v":""}]
["",null,{"$f":"IF(B46=\"\",IF(A46=\"\",\"\",\"*Preenchimento Obrigatório\"),\"\")","v":""}]
["",null,""]
["",null,""]
["",null,""]
["",null,""]
["",null,""]
["",null,""]
["",null,""]
["",null,""]
["",null,{"$f":"IF(B55=\"\",IF(A55=\"\",\"\",\"*Preenchimento Obrigatório\"),\"\")","v":""}]
[]
["19. Custo Operacional - Despesas não Financiadas"]
["Especificação",null,"Unid.","Quant.","Valor (R$)",null,"Ano de Inicio de Aplicação"]
[null,null,null,null,"Unit.","Total"]
["Insumos"]
[" 1 – Implantação"]
[null,null,null,null,null,{"$f":"D62*E62","v":0},1]
[null,null,null,null,null,{"$f":"D63*E63","v":0}]
[null,null,null,null,null,{"$f":"D64*E64","v":0}]
[null,null,null,null,null,{"$f":"D65*E65","v":0}]
["Total",null,null,null,null,{"$f":"SUM(F62:F65)","v":0},"-"]
["2 – Manutenção"]
[null,null,null,null,null,{"$f":"D68*E68","v":0},1]
[null,null,null,null,null,{"$f":"D69*E69","v":0}]
[null,null,null,null,null,{"$f":"D70*E70","v":0}]
[null,null,null,null,null,{"$f":"D71*E71","v":0}]
["Total",null,null,null,null,{"$f":"SUM(F68:F71)","v":0},"-"]
["3 – Comercialização"]
[null,null,null,null,null,{"$f":"D74*E74","v":0},1]
[null,null,null,null,null,{"$f":"D75*E75","v":0}]
[null,null,null,null,null,{"$f":"D76*E76","v":0}]
[null,null,null,null,null,{"$f":"D77*E77","v":0}]
["Total",null,null,null,null,{"$f":"SUM(F74:F77)","v":0},"-"]
["Serviços"]
[" 1 – Implantação"]
[null,null,null,null,null,{"$f":"D81*E81","v":0},1]
[null,null,null,null,null,{"$f":"D82*E82","v":0}]
[null,null,null,null,null,{"$f":"D83*E83","v":0}]
[null,null,null,null,null,{"$f":"D84*E84","v":0}]
["Total",null,null,null,null,{"$f":"SUM(F81:F84)","v":0},"-"]
["2 – Manutenção"]
[null,null,null,null,null,{"$f":"D87*E87","v":0},1]
[null,null,null,null,null,{"$f":"D88*E88","v":0}]
[null,null,null,null,null,{"$f":"D89*E89","v":0}]
[null,null,null,null,null,{"$f":"D90*E90","v":0}]
["Total",null,null,null,null,{"$f":"SUM(F87:F90)","v":0},"-"]
["3 – Comercialização"]
[null,null,null,null,null,{"$f":"D93*E93","v":0},1]
[null,null,null,null,null,{"$f":"D94*E94","v":0}]
[null,null,null,null,null,{"$f":"D95*E95","v":0}]
[null,null,null,null,null,{"$f":"D96*E96","v":0}]
["Total",null,null,null,null,{"$f":"SUM(F93:F96)","v":0},"-"]
["Outros Desembolsos"]
["1 - Energia elétrica",null,null,null,null,{"$f":"D99*E99","v":0},1]
["2 - Combustível",null,null,null,null,{"$f":"D100*E100","v":0}]
["3 - Transporte interno",null,null,null,null,{"$f":"D101*E101","v":0}]
["5 - Outros",null,null,null,null,{"$f":"D102*E102","v":0}]
["Total",null,null,null,null,{"$f":"SUM(F99:F102)","v":0},"-"]
[]
["20. Justificativa Técnica"]

{"sheet":"Pecuária","index":12,"n_rows":146,"n_cols":5,"rows_kept":146,"cut":false,"hidden":false,"merged":[[146,0,153,4],[140,4,143,4],[118,4,121,4],[123,0,124,0],[123,1,124,1],[123,2,124,2],[123,3,124,3],[123,4,124,4],[125,0,125,4],[126,4,131,4],[132,0,132,4],[133,4,138,4],[139,0,139,4],[111,4,113,4],[115,0,115,4],[116,0,117,0],[116,1,117,1],[116,2,117,2],[116,3,117,3],[116,4,117,4],[108,0,108,4],[109,0,110,0],[109,1,110,1],[109,2,110,2],[109,3,110,3],[109,4,110,4],[92,0,93,0],[27,0,28,0],[27,1,28,1],[27,2,27,4],[40,0,41,0],[40,1,40,2],[40,3,40,4],[60,0,61,0],[60,1,60,2],[60,3,60,4],[85,0,86,0],[87,0,88,0],[2,0,3,0],[2,1,2,2],[2,3,2,4],[16,0,17,0],[16,1,17,1],[16,2,16,4]]}
[]
["20. Rebanho existente e financiado"]
["Categoria","Rebanho de Corte",null,"Rebanho de Leite"]
[null,"Existente (cab)","Financiado (cab)","Existente (cab)","Financiado (cab)"]
["Reprodutores"]
["Matrizes"]
["Bois"]
["Novilhos"]
["Novilhas"]
["Garrotes "]
["Garrotas "]
["Bezerros "]
["Bezerras "]
["Total",{"$f":"SUM(B5:B13)","v":0},{"$f":"SUM(C5:C13)","v":0},{"$f":"SUM(D5:D13)","v":0},{"$f":"SUM(E5:E13)","v":0}]
[]
["21. Aquisições programada de bovinos  durante o tempo projetado (Inclusive substituição de matrizes e reprodutores)"]
["Categoria","Preço (R$)","Rebanho de Corte - Aquisições (cab) "]
[null,null,"Ano 1","Ano 2","Demais Anos"]
["Reprodutores"]
["Matrizes"]
["Bois"]
["Novilhos"]
["Novilhas"]
["Garrotes "]
["Garrotas "]
["Bezerros "]
["Bezerras "]
["Categoria","Preço (R$)","Rebanho de Leite - Aquisições (cab)"]
[null,null,"Ano 1","Ano 2","Demais Anos"]
["Reprodutores"]
["Matrizes"]
["Bois"]
["Novilhos"]
["Novilhas"]
["Garrotes "]
["Garrotas "]
["Bezerros "]
["Bezerras "]
[]
["22. Indices Técnicos"]
["Especificações","Coeficientes -  Rebanho de Corte",null,"Coeficientes -  Rebanho de Leite"]
[null,"Padrão","Projetado","Padrão","Projetado"]
["Taxa de Natalidade (%)",0.8,null,0.8]
["Taxa de Mortalidade (%) - até 12 meses ",0.04,null,0.04]
["Taxa de Mortalidade (%) - de 12 a 24 meses ",0.03,null,0.03]
["Taxa de Mortalidade (%) - de  24 a 36 meses",0.02,null,0.02]
["Taxa de Mortalidade (%) - acima de 36 meses",0.01,null,0.01]
["Relação Matriz/Reprodutor",25,null,25]
["Idade de desmama (meses)",8,null,8]
["Idade ao 1º parto (meses)",36,null,36]
["Intervalo entre partos (meses)",14,null,14]
["Idade ao abate (meses)",36,null,36]
["Peso ao abate (kg)",550,null,550]
["Período de lactação (dias)",null,null,240]
["Produção leite/matriz/dia (l)",null,null,6]
["Relação Leite/Queijo (l/kg)",null,null,10]
["Relação Leite/Manteiga (l/kg)",null,null,10]
[]
["23. Suporte Forrageiro"]
["Tipo"]
["Pastagem","Área (ha)",null,"Capacidade (UA/ha)"]
[null,"Atual ","Projetado","Atual","Projetado"]
["Mecanizado - Sistema Rotacionado Intensivo"]
["Mecanizado - Tradicional"]
["Não Mecanizado "]
["Capineira"]
["Pastagens Degradadas"]
["Pastagens Nativas"]
[]
["24. Conversão do Rebanho em U.A."]
["Categorias","Cabeças","U.A. (Padrão)"]
["Reprodutores",1,1.25]
["Matrizes",1,1]
["Bois",1,1.25]
["Novilhos",1,0.75]
["Novilhas",1,0.75]
["Garrotes ",1,0.5]
["Garrotas ",1,0.5]
["Bezerros ",1,0.3]
["Bezerras ",1,0.3]
[]
["25. Comercialização"]
["Produto","Unidade","Rebanho de Corte","Rebanho de Leite","Padrão"]
["Touro descartado","cab",null,null,"até 10%"]
["Matriz descartada","cab",null,null,"até 15%"]
["Machos","cab"]
[null,"cab"]
["Fêmeas","cab"]
[null,"cab"]
["Outros Produtos","l"]
[]
["26. Preço de Comercialização"]
["Produto","Rebanho de Corte","Rebanho de Leite"]
[null,"Valor Unitário ","Valor Unitário "]
["Touro descartado"]
["Matriz descartada"]
["Boi Gordo p/ abate"]
["Novilho Gordo"]
["Fêmea Excedente"]
["Garrotes "]
["Garrotas "]
["Bezerros "]
["Bezerras "]
["Leite (l)"]
["Queijo (kg)"]
["Manteiga (kg)"]
[]
["27. Custo Operacional - Despesas não Financiadas (Rebanho de Corte e Rebanho de Leite)"]
["Alimentação"]
["Especificação","Unid.","Qtd/cab/dia","Valor Unit.(R$)","Ano de Inicio de Aplicação"]
[]
["Sal mineral","Quilograma"]
[]
[]
[]
["Sanidade (vacinas e medicamentos)"]
["Especificação","Unid.","Dose/cab/ano","Valor Unit.(R$)","Ano de Inicio de Aplicação"]
[]
["Brucelose","dose"]
["Aftosa","dose"]
["Carbúnculo/Manqueira","dose"]
["Botulismo","dose"]
[]
["Especificação","Unid.","Qtd (ano)","Valor Unit.(R$)","Ano de Inicio de Aplicação"]
[]
["Reforma/Manutenção de Pastagem"]
[]
[]
[]
[]
[]
[]
["Construção/Manutenção de Cerca"]
[]
[]
[]
[]
[]
[]
["Outros Desembolsos"]
[]
[]
[]
[]
[]
["28. Justificativa Técnica"]

{"sheet":"Despesas Fixas","index":13,"n_rows":25,"n_cols":5,"rows_kept":25,"cut":false,"hidden":false,"merged":[[23,0,23,3],[1,0,1,3],[2,0,2,3],[8,0,8,3],[13,0,13,3],[18,0,18,3]]}
[]
["29. Despesas Fixas"]
["Mão de Obra Fixa e Encargos Sociais"]
["Cargo/Função","Nº de Funcionários","Salário","Encargos Sociais - 80%"]
[null,null,null,{"$f":"IF(A5=\"\",\"\",C5*80%)","v":""}]
[null,null,null,{"$f":"IF(A6=\"\",\"\",C6*80%)","v":""}]
[null,null,null,{"$f":"IF(A7=\"\",\"\",C7*80%)","v":""}]
[null,null,null,{"$f":"IF(A8=\"\",\"\",C8*80%)","v":""}]
["Manutenção"]
["Discriminação ","Valor (Existente)","Valor (Projetado)","Taxa Anual (%)"]
["Benfeitorias (Construções Civis)",{"$f":"'Informações do Imóvel'!$J$69","v":0},null,5.0000000000000001E-3,{"$f":"(B11+C11)*D11","v":0}]
["Máquinas e Equipamentos",{"$f":"'Informações do Imóvel'!$K$69","v":0},null,1.4999999999999999E-2,{"$f":"(B12+C12)*D12","v":0}]
["Veículos",{"$f":"'Informações do Imóvel'!$L$69","v":0},null,0.05,0]
["Depreciação"]
["Discriminação ","Valor (Existente)","Valor (Projetado)","Taxa Anual (%)"]
["Benfeitorias (Construções Civis)",{"$f":"'Informações do Imóvel'!$J$69","v":0},null,5.0000000000000001E-3,{"$f":"(B16+C16)*D16","v":0}]
["Máquinas e Equipamentos",{"$f":"'Informações do Imóvel'!$K$69","v":0},null,0.01,{"$f":"(B17+C17)*D17","v":0}]
["Veículos",{"$f":"'Informações do Imóvel'!$L$69","v":0},null,0.02,0]
["Seguros"]
["Discriminação ","Valor (Existente)","Valor (Projetado)","Taxa Anual (%)"]
["Benfeitorias (Construções Civis)",{"$f":"'Informações do Imóvel'!$J$69","v":0},null,5.0000000000000001E-3,{"$f":"(B21+C21)*D21","v":0}]
["Máquinas e Equipamentos",{"$f":"'Informações do Imóvel'!$K$69","v":0},null,0.01,{"$f":"(B22+C22)*D22","v":0}]
["Veículos",{"$f":"'Informações do Imóvel'!$L$69","v":0},null,0.03,0]
["Outros custos fixos"]
["Discriminação","Unid","Quantidade/ano","Valor"]

{"sheet":"Análise","index":14,"n_rows":153,"n_cols":39,"rows_kept":153,"cut":false,"hidden":false,"merged":[[152,8,152,10],[122,0,122,3],[122,4,122,9],[122,10,122,11],[130,0,130,11],[131,0,147,11],[120,0,120,3],[120,4,120,9],[120,10,120,11],[121,0,121,3],[121,4,121,9],[121,10,121,11],[124,0,124,11],[125,0,128,11],[118,0,118,3],[118,4,118,9],[118,10,118,11],[119,0,119,3],[119,4,119,9],[119,10,119,11],[116,0,116,3],[116,4,116,9],[116,10,116,11],[117,0,117,3],[117,4,117,9],[117,10,117,11],[91,9,91,10],[91,11,92,11],[114,0,114,11],[115,0,115,3],[115,4,115,9],[115,10,115,11],[89,0,89,11],[91,0,92,0],[91,1,92,1],[91,2,92,2],[91,3,92,3],[91,4,92,4],[91,5,92,5],[91,6,92,6],[91,7,92,7],[91,8,92,8],[90,0,90,11],[86,0,86,3],[86,4,86,9],[86,10,86,11],[87,0,87,3],[87,4,87,9],[87,10,87,11],[84,0,84,3],[84,4,84,9],[84,10,84,11],[85,0,85,3],[85,4,85,9],[85,10,85,11],[82,0,82,3],[82,4,82,9],[82,10,82,11],[83,0,83,3],[83,4,83,9],[83,10,83,11],[80,0,80,3],[80,4,80,9],[80,10,80,11],[81,0,81,3],[81,4,81,9],[81,10,81,11],[56,6,57,6],[56,7,57,7],[56,8,57,8],[56,9,56,10],[56,11,57,11],[79,0,79,11],[52,0,52,3],[52,4,52,9],[52,10,52,11],[54,0,54,11],[56,0,57,0],[56,1,57,1],[56,2,57,2],[56,3,57,3],[56,4,57,4],[56,5,57,5],[55,0,55,11],[50,0,50,3],[50,4,50,9],[50,10,50,11],[51,0,51,3],[51,4,51,9],[51,10,51,11],[48,0,48,3],[48,4,48,9],[48,10,48,11],[49,0,49,3],[49,4,49,9],[49,10,49,11],[46,0,46,3],[46,4,46,9],[46,10,46,11],[47,0,47,3],[47,4,47,9],[47,10,47,11],[20,8,21,8],[20,9,20,10],[20,11,21,11],[44,0,44,11],[45,0,45,3],[45,4,45,9],[45,10,45,11],[20,0,21,0],[20,1,21,1],[20,2,21,2],[20,3,21,3],[20,4,21,4],[20,5,21,5],[20,6,21,6],[20,7,21,7],[19,0,19,11],[15,15,15,17],[17,0,17,3],[16,15,16,17],[17,15,17,17],[14,0,14,3],[12,15,12,17],[15,0,15,3],[13,15,13,17],[16,0,16,3],[3,23,3,29],[3,31,3,32],[3,33,3,34],[3,35,3,36],[3,37,3,38],[3,0,3,3],[4,15,4,17],[7,0,7,3],[14,15,14,17],[6,0,6,3],[11,15,11,17],[11,0,11,3],[6,15,6,17],[12,0,12,3],[7,15,7,17],[13,0,13,3],[10,15,10,17],[8,0,8,3],[10,0,10,3],[13,9,13,11],[6,10,6,11],[10,8,11,11],[1,0,1,7],[2,0,2,3],[4,10,4,11],[2,15,2,17],[9,0,9,3],[5,10,5,11],[3,15,3,17],[5,15,5,17],[3,10,3,11],[2,10,2,11],[4,0,4,3],[8,15,8,17],[5,0,5,3],[9,15,9,17],[7,4,7,7]]}
[]
["30. Condições de Financiamento",null,null,null,null,null,null,null,null,"31. Resumo"]
["Parametros",null,null,null,"Fixo","Animais","Máquinas","Custeio",null,"Total",{"$f":"SUM(E10:H10)","v":0},null,null,null,null,"CONDIÇÕES DO FINANCIAMENTO",null,null,"Fixo","Semifixo1","Semifixo2","Custeio"]
["Recursos Próprios/Contrapartida (%):",null,null,null,{"$f":"IF('Dados Cadastrais'!$E$3=Informações!$AZ$3,0,IF('Dados Cadastrais'!$E$64=Informações!$BL$3,0,IF(OR('Dados Cadastrais'!$E$64=Informações!$BL$4,'Dados Cadastrais'!$E$68=Informações!$BM$3),5,IF('Dados Cadastrais'!$E$68=Informações!$BM$4,10,15))))","v":0},{"$f":"IF('Dados Cadastrais'!$E$3=Informações!$AZ$3,0,IF('Dados Cadastrais'!$E$64=Informações!$BL$3,0,IF(OR('Dados Cadastrais'!$E$64=Informações!$BL$4,'Dados Cadastrais'!$E$68=Informações!$BM$3),5,IF('Dados Cadastrais'!$E$68=Informações!$BM$4,10,15))))","v":0},{"$f":"IF('Dados Cadastrais'!$E$3=Informações!$AZ$3,0,IF('Dados Cadastrais'!$E$64=Informações!$BL$3,0,IF(OR('Dados Cadastrais'!$E$64=Informações!$BL$4,'Dados Cadastrais'!$E$68=Informações!$BM$3),5,IF('Dados Cadastrais'!$E$68=Informações!$BM$4,10,15))))","v":0},{"$f":"IF('Dados Cadastrais'!$E$3=Informações!$AZ$3,0,IF('Dados Cadastrais'!$E$64=Informações!$BL$3,0,IF(OR('Dados Cadastrais'!$E$64=Informações!$BL$4,'Dados Cadastrais'!$E$68=Informações!$BM$3),5,IF('Dados Cadastrais'!$E$68=Informações!$BM$4,10,15))))","v":0},null,"Financiado",{"$f":"SUM(E11:H11)","v":0},null,null,null,{"$f":"LARGE(E9:H9,1)","v":100},"Valor do Financiamento (R$):",null,null,{"$f":"E11","v":0},0,0,0,null,"Quadro de Amortização ao Ano",null,null,null,null,null,null,null,"Amortização",null,"Amortização",null,"Amortização",null,"Amortização"]
["Carência em meses:",null,null,null,null,null,null,null,null,"Rec. Próprios",{"$f":"SUM(E12:H12)","v":0},null,null,null,null,"Valor da Contrapartida (R$):",null,null,0,0,0,0,null,"Data base","Ano","Fixo","Semifixo1","Semifxo2","Custeio","Total Prestação",null,"Data","Fixo","Data","Semifxo1","Data","Semifxo2","Data","Custeio"]
["Qtd. das Amortizações:",null,null,null,null,null,null,1,null,"IOF",{"$f":"K4*0.38%","v":0},null,null,null,{"$f":"SUM(E10:H10)","v":0},"Valor Total do Investimento (R$):",null,null,{"$f":"S4+S5","v":0},{"$f":"T4+T5","v":0},{"$f":"U4+U5","v":0},{"$f":"V4+V5","v":0},null,null,null,null,null,null,null,null,null,{"$f":"S9","v":"2023-02-28"},"-",{"$f":"T9","v":"2023-02-28"},"-",{"$f":"U9","v":"2023-02-28"},"-",{"$f":"V9","v":"2023-02-28"},"-"]
["Periodicidade de Amortização:",null,null,null,null,null,null,"Mensal",null,"Porte",{"$f":"Enquadramento!B10","v":""},null,null,null,{"$f":"SUM(E11:H11)","v":0},"Data da Contratação:",null,null,"2023-02-28","2023-02-28","2023-02-28","2023-02-28",null,{"$f":"EOMONTH(S7,12)","v":"2024-02-29"},1,{"$f":"SUMIFS($AG$6:$AG$892,$AF$6:$AF$892,\"<=\"&X7)","v":0},{"$f":"SUMIFS($AI$6:$AI$892,$AH$6:$AH$892,\"<=\"&$X7)","v":0},{"$f":"SUMIFS($AK$6:$AK$892,$AJ$6:$AJ$892,\"<=\"&$X7)","v":0},{"$f":"SUMIFS($AM$6:$AM$892,$AL$6:$AL$892,\"<=\"&$X7)","v":0},{"$f":"SUM(Z7:AC7)","v":0},null,{"$f":"IF(OR(AF6=\"\",AF6>=$S$13),\"\",IF($S$12=\"mensal\",EOMONTH(AF6,1),IF($S$12=\"bimestral\",EOMONTH(AF6,2),IF($S$12=\"trimestral\",EOMONTH(AF6,3),IF($S$12=\"quadrimestral\",EOMONTH(AF6,4),IF($S$12=\"semestral\",EOMONTH(AF6,6),IF($S$12=\"anual\",EOMONTH(AF6,12),\"\")))))))","v":""},{"$f":"IF(AF7=\"\",\"\",$S$18)","v":""},{"$f":"IF(OR(AH6=\"\",AH6>=$T$13),\"\",IF($T$12=\"mensal\",EOMONTH(AH6,1),IF($T$12=\"bimestral\",EOMONTH(AH6,2),IF($T$12=\"trimestral\",EOMONTH(AH6,3),IF($T$12=\"quadrimestral\",EOMONTH(AH6,4),IF($T$12=\"semestral\",EOMONTH(AH6,6),IF($T$12=\"anual\",EOMONTH(AH6,12),\"\")))))))","v":""},{"$f":"IF(AH7=\"\",\"\",$T$18)","v":""},{"$f":"IF(OR(AJ6=\"\",AJ6>=$U$13),\"\",IF($U$12=\"mensal\",EOMONTH(AJ6,1),IF($U$12=\"bimestral\",EOMONTH(AJ6,2),IF($U$12=\"trimestral\",EOMONTH(AJ6,3),IF($U$12=\"quadrimestral\",EOMONTH(AJ6,4),IF($U$12=\"semestral\",EOMONTH(AJ6,6),IF($U$12=\"anual\",EOMONTH(AJ6,12),\"\")))))))","v":""},{"$f":"IF(AJ7=\"\",\"\",$U$18)","v":""},{"$f":"IF(OR(AL6=\"\",AL6>=$V$13),\"\",IF($V$12=\"mensal\",EOMONTH(AL6,1),IF($V$12=\"bimestral\",EOMONTH(AL6,2),IF($V$12=\"trimestral\",EOMONTH(AL6,3),IF($V$12=\"quadrimestral\",EOMONTH(AL6,4),IF($V$12=\"semestral\",EOMONTH(AL6,6),IF($V$12=\"anual\",EOMONTH(AL6,12),\"\")))))))","v":"2023-03-31"},{"$f":"IF(AL7=\"\",\"\",$V$18)","v":0}]
["Taxa de Juros (% a.a.):",null,null,null,{"$f":"IFERROR(IF('Dados Cadastrais'!E3=\"PRONAF\",VLOOKUP('Dados Cadastrais'!E7,Informações!$AW:$AX,2,FALSE),IF('Dados Cadastrais'!E3=\"PRONAMP\",10%,IF('Dados Cadastrais'!E5=\"CUSTEIO_RECURSO_OBRIGATÓRIO\",14%,19%))),\"\")","v":""},null,null,null,null,null,null,null,null,null,{"$f":"SUM(E12:H12)","v":0},"Prazo de Carência (em meses):",null,null,{"$f":"E5","v":0},{"$f":"F5","v":0},{"$f":"G5","v":0},{"$f":"H5","v":0},null,{"$f":"EOMONTH(X7,12)","v":"2025-02-28"},2,{"$f":"SUMIFS($AG$6:$AG$892,$AF$6:$AF$892,\">\"&X7,$AF$6:$AF$892,\"<=\"&X8)","v":0},{"$f":"SUMIFS($AI$6:$AI$892,$AH$6:$AH$892,\">\"&$X7,$AH$6:$AH$892,\"<=\"&X8)","v":0},{"$f":"SUMIFS($AK$6:$AK$892,$AJ$6:$AJ$892,\">\"&$X7,$AJ$6:$AJ$892,\"<=\"&X8)","v":0},{"$f":"SUMIFS($AM$6:$AM$892,$AL$6:$AL$892,\">\"&$X7,$AL$6:$AL$892,\"<=\"&$X8)","v":0},0,null,{"$f":"IF(OR(AF7=\"\",AF7>=$S$13),\"\",IF($S$12=\"mensal\",EOMONTH(AF7,1),IF($S$12=\"bimestral\",EOMONTH(AF7,2),IF($S$12=\"trimestral\",EOMONTH(AF7,3),IF($S$12=\"quadrimestral\",EOMONTH(AF7,4),IF($S$12=\"semestral\",EOMONTH(AF7,6),IF($S$12=\"anual\",EOMONTH(AF7,12),\"\")))))))","v":""},{"$f":"IF(AF8=\"\",\"\",$S$18)","v":""},"","",{"$f":"IF(OR(AJ7=\"\",AJ7>=$U$13),\"\",IF($U$12=\"mensal\",EOMONTH(AJ7,1),IF($U$12=\"bimestral\",EOMONTH(AJ7,2),IF($U$12=\"trimestral\",EOMONTH(AJ7,3),IF($U$12=\"quadrimestral\",EOMONTH(AJ7,4),IF($U$12=\"semestral\",EOMONTH(AJ7,6),IF($U$12=\"anual\",EOMONTH(AJ7,12),\"\")))))))","v":""},{"$f":"IF(AJ8=\"\",\"\",$U$18)","v":""},{"$f":"IF(OR(AL7=\"\",AL7>=$V$13),\"\",IF($V$12=\"mensal\",EOMONTH(AL7,1),IF($V$12=\"bimestral\",EOMONTH(AL7,2),IF($V$12=\"trimestral\",EOMONTH(AL7,3),IF($V$12=\"quadrimestral\",EOMONTH(AL7,4),IF($V$12=\"semestral\",EOMONTH(AL7,6),IF($V$12=\"anual\",EOMONTH(AL7,12),\"\")))))))","v":""},{"$f":"IF(AL8=\"\",\"\",$V$18)","v":""}]
["Financiamento (%):",null,null,null,{"$f":"IFERROR(100-E4,0)","v":100},{"$f":"IFERROR(100-F4,0)","v":100},{"$f":"IFERROR(100-G4,0)","v":100},{"$f":"IFERROR(100-H4,0)","v":100},null,null,null,null,null,null,{"$f":"LARGE(E5:H5,1)","v":{"$error":"#NUM!"}},"Data Fim da Carência:",null,null,{"$f":"EOMONTH(S7,S8)","v":"2023-02-28"},{"$f":"EOMONTH(T7,T8)","v":"2023-02-28"},{"$f":"EOMONTH(U7,U8)","v":"2023-02-28"},{"$f":"EOMONTH(V7,V8)","v":"2023-02-28"},null,{"$f":"EOMONTH(X8,12)","v":"2026-02-28"},3,0,0,0,0,0,null,{"$f":"IF(OR(AF8=\"\",AF8>=$S$13),\"\",IF($S$12=\"mensal\",EOMONTH(AF8,1),IF($S$12=\"bimestral\",EOMONTH(AF8,2),IF($S$12=\"trimestral\",EOMONTH(AF8,3),IF($S$12=\"quadrimestral\",EOMONTH(AF8,4),IF($S$12=\"semestral\",EOMONTH(AF8,6),IF($S$12=\"anual\",EOMONTH(AF8,12),\"\")))))))","v":""},{"$f":"IF(AF9=\"\",\"\",$S$18)","v":""},"","","",{"$f":"IF(AJ9=\"\",\"\",$U$18)","v":""},"",""]
["Valor Total do Investimento (R$):",null,null,null,{"$f":"Orçamento!E6+Orçamento!O3","v":0},{"$f":"Orçamento!E84+Orçamento!O4","v":0},{"$f":"Orçamento!E92+Orçamento!O5","v":0},{"$f":"Orçamento!E111+Orçamento!O6","v":0},null,null,null,null,null,null,{"$f":"COUNTIF(E6:H6,\"> 0,00\")","v":1},"Saldo Deverdor no Fim da Carência:",null,null,{"$f":"FV(S17,S8,,-S4,0)","v":{"$error":"#VALUE!"}},{"$f":"FV(T17,T8,,-T4,0)","v":{"$error":"#VALUE!"}},{"$f":"FV(U17,U8,,-U4,0)","v":{"$error":"#VALUE!"}},{"$f":"FV(V17,V8,,-V4,0)","v":{"$error":"#VALUE!"}},null,{"$f":"EOMONTH(X9,12)","v":"2027-02-28"},4,0,0,0,0,0,null,"","",{"$f":"IF(OR(AH9=\"\",AH9>=$T$13),\"\",IF($T$12=\"mensal\",EOMONTH(AH9,1),IF($T$12=\"bimestral\",EOMONTH(AH9,2),IF($T$12=\"trimestral\",EOMONTH(AH9,3),IF($T$12=\"quadrimestral\",EOMONTH(AH9,4),IF($T$12=\"semestral\",EOMONTH(AH9,6),IF($T$12=\"anual\",EOMONTH(AH9,12),\"\")))))))","v":""},"","","","",""]
["Valor do Financiamento (R$):",null,null,null,{"$f":"Orçamento!F6+Orçamento!P3","v":0},{"$f":"Orçamento!F84+Orçamento!P4","v":0},{"$f":"Orçamento!F92+Orçamento!P5","v":0},{"$f":"Orçamento!F111+Orçamento!P6","v":0},{"$f":"IF(AND('Dados Cadastrais'!E3=\"PRONAF\",OR(SUM(E11:G11)>250000,H11>250000)),\"<===ALERTA: Ajustar o Valor do Orçamento para até R$ 250.000,00\",IF(AND('Dados Cadastrais'!E5=Informações!BC3,H11>1500000),\"<===ALERTA: Ajustar o Valor do Orçamento para até R$ 1.500.000,00\",IF(AND('Dados Cadastrais'!E5:J5=Informações!BC4,SUM(E11:G11)>600000),\"<===ALERTA: Ajustar o Valor do Orçamento  para até R$ 600.000,00\",IF(AND('Dados Cadastrais'!E5=Informações!BD3,H11>3000000),\"<===ALERTA: Ajustar o Valor do Orçamento para até R$ 3.000.000,00\",IF(AND('Dados Cadastrais'!E5=Informações!BD5,SUM(E11:G11)>1000000),\"<===ALERTA: Ajustar o Valor do Orçamento para até R$ 1.000.000,00\",\"\")))))","v":""},null,null,null,null,null,"Não","Quantidade de Amortizações:",null,null,{"$f":"E6","v":0},0,0,1,null,"2028-02-29",5,0,0,0,0,0,null,"","","","","","","",""]
["Recursos Próprios/Contrapartida (R$):",null,null,null,{"$f":"E10-E11","v":0},{"$f":"F10-F11","v":0},{"$f":"G10-G11","v":0},{"$f":"H10-H11","v":0},null,null,null,null,null,null,{"$f":"E7","v":0},"Periodicidade de Amortização:",null,null,0,0,0,"Mensal",null,"2029-02-28",6,0,0,0,0,0,null,"","","","","",{"$f":"IF(AJ12=\"\",\"\",$U$18)","v":""},"",""]
["Pagamento Juros na Carência:",null,null,null,"Não","Não","Não","Não",null,null,null,null,null,null,{"$f":"O10*12","v":12},"Data de Vencimento da Operação:",null,null,{"$f":"EOMONTH(S7,S15)","v":"2023-02-28"},{"$f":"EOMONTH(T7,T15)","v":"2023-02-28"},{"$f":"EOMONTH(U7,U15)","v":"2023-02-28"},{"$f":"EOMONTH(V7,V15)","v":"2023-03-31"},null,"2030-02-28",7,0,0,0,0,0,null,"","","","",{"$f":"IF(OR(AJ12=\"\",AJ12>=$U$13),\"\",IF($U$12=\"mensal\",EOMONTH(AJ12,1),IF($U$12=\"bimestral\",EOMONTH(AJ12,2),IF($U$12=\"trimestral\",EOMONTH(AJ12,3),IF($U$12=\"quadrimestral\",EOMONTH(AJ12,4),IF($U$12=\"semestral\",EOMONTH(AJ12,6),IF($U$12=\"anual\",EOMONTH(AJ12,12),\"\")))))))","v":""},"","",""]
["Prazo de Amortização (em meses):",null,null,null,{"$f":"IF(E7=\"anual\",E6*12,IF(E7=\"semestral\",E6*6,IF(E7=\"quadrimestral\",E6*4,IF(E7=\"trimestral\",E6*3,IF(E7=\"bimestral\",E6*2,E6)))))","v":0},{"$f":"IF(F7=\"anual\",F6*12,IF(F7=\"semestral\",F6*6,IF(F7=\"quadrimestral\",F6*4,IF(F7=\"trimestral\",F6*3,IF(F7=\"bimestral\",F6*2,F6)))))","v":0},{"$f":"IF(G7=\"anual\",G6*12,IF(G7=\"semestral\",G6*6,IF(G7=\"quadrimestral\",G6*4,IF(G7=\"trimestral\",G6*3,IF(G7=\"bimestral\",G6*2,G6)))))","v":0},{"$f":"IF(H7=\"anual\",H6*12,IF(H7=\"semestral\",H6*6,IF(H7=\"quadrimestral\",H6*4,IF(H7=\"trimestral\",H6*3,IF(H7=\"bimestral\",H6*2,H6)))))","v":1},null,"32. Análise de Sensibilidade",null,null,null,null,{"$f":"LARGE(E15:H15,1)","v":1},"Prazo de Amortização (em meses):",null,null,{"$f":"E14","v":0},0,0,1,null,"2031-02-28",8,0,0,0,0,{"$f":"SUM(Z14:AC14)","v":0},null,"","","","","","","",""]
["Prazo Total em meses:",null,null,null,{"$f":"E5+E14","v":0},{"$f":"F5+F14","v":0},{"$f":"G5+G14","v":0},{"$f":"H5+H14","v":1},null,"Item","Cenário 1","Cenário 2",null,null,null,"Prazo Total (em meses):",null,null,0,0,0,1,null,"2032-02-29",9,0,0,0,0,{"$f":"SUM(Z15:AC15)","v":0},null,"","","","","","","",""]
["Valor da Prestação (previsto):",null,null,null,{"$f":"S18","v":0},{"$f":"T18","v":0},{"$f":"U18","v":0},{"$f":"V18","v":0},null,"R. Pecuária (%)",null,null,null,null,{"$f":"N18","v":0},"Taxa Efetiva de Juros (% a.a.):",null,null,{"$f":"E8","v":""},{"$f":"E8","v":""},{"$f":"E8","v":""},{"$f":"E8","v":""},null,"2033-02-28",10,0,0,0,0,{"$f":"SUM(Z16:AC16)","v":0},null,"","","","","","","",""]
["Taxa de Elaboração de Projetos:",null,null,null,{"$f":"IF('Dados Cadastrais'!$E$95=\"Sim\",0.5%,0)","v":0},{"$f":"IF('Dados Cadastrais'!$E$95=\"Sim\",0.5%,0)","v":0},{"$f":"IF('Dados Cadastrais'!$E$95=\"Sim\",0.5%,0)","v":0},{"$f":"IF('Dados Cadastrais'!$E$95=\"Sim\",0.5%,0)","v":0},null,"R. Agricola (%)",null,null,null,null,0,"Taxa Efetiva de Juros (% a.m.):",null,null,{"$f":"(1+S16)^(1/12)-1","v":{"$error":"#VALUE!"}},{"$f":"(1+T16)^(1/12)-1","v":{"$error":"#VALUE!"}},{"$f":"(1+U16)^(1/12)-1","v":{"$error":"#VALUE!"}},{"$f":"(1+V16)^(1/12)-1","v":{"$error":"#VALUE!"}},null,"2034-02-28",11,0,0,0,0,{"$f":"SUM(Z17:AC17)","v":0},null,"","","","","","","",""]
["Taxa de Assistência Técnica:",null,null,null,{"$f":"IF('Dados Cadastrais'!$E$95=\"Sim\",1.5%,0)","v":0},{"$f":"IF('Dados Cadastrais'!$E$95=\"Sim\",1.5%,0)","v":0},{"$f":"IF('Dados Cadastrais'!$E$95=\"Sim\",1.5%,0)","v":0},{"$f":"IF('Dados Cadastrais'!$E$95=\"Sim\",1.5%,0)","v":0},null,"Custos (%)",null,null,null,null,0,"Valor da Prestação (R$):",null,null,{"$f":"IFERROR(PMT(IF(S12=\"mensal\",(1+S16)^(1/12)-1,IF(S12=\"bimestral\",(1+S16)^(1/6)-1,IF(S12=\"trimestral\",(1+S16)^(1/4)-1,IF(S12=\"quadrimestral\",(1+S16)^(1/3)-1,IF(S12=\"semestral\",(1+S16)^(1/2)-1,IF(S12=\"anual\",(1+S16)^(1/1)-1)))))),S11,-S10,,0),0)","v":0},{"$f":"IFERROR(PMT(IF(T12=\"mensal\",(1+T16)^(1/12)-1,IF(T12=\"bimestral\",(1+T16)^(1/6)-1,IF(T12=\"trimestral\",(1+T16)^(1/4)-1,IF(T12=\"quadrimestral\",(1+T16)^(1/3)-1,IF(T12=\"semestral\",(1+T16)^(1/2)-1,IF(T12=\"anual\",(1+T16)^(1/1)-1)))))),T11,-T10,,0),0)","v":0},{"$f":"IFERROR(PMT(IF(U12=\"mensal\",(1+U16)^(1/12)-1,IF(U12=\"bimestral\",(1+U16)^(1/6)-1,IF(U12=\"trimestral\",(1+U16)^(1/4)-1,IF(U12=\"quadrimestral\",(1+U16)^(1/3)-1,IF(U12=\"semestral\",(1+U16)^(1/2)-1,IF(U12=\"anual\",(1+U16)^(1/1)-1)))))),U11,-U10,,0),0)","v":0},{"$f":"IFERROR(PMT(IF(V12=\"mensal\",(1+V16)^(1/12)-1,IF(V12=\"bimestral\",(1+V16)^(1/6)-1,IF(V12=\"trimestral\",(1+V16)^(1/4)-1,IF(V12=\"quadrimestral\",(1+V16)^(1/3)-1,IF(V12=\"semestral\",(1+V16)^(1/2)-1,IF(V12=\"anual\",(1+V16)^(1/1)-1)))))),V11,-V10,,0),0)","v":0},null,{"$f":"EOMONTH(X17,12)","v":"2035-02-28"},12,0,0,0,0,{"$f":"SUM(Z18:AC18)","v":0},null,"","","","","","","",""]
[null,null,null,null,null,null,null,null,null,null,null,null,null,null,null,null,null,null,null,null,null,null,null,{"$f":"EOMONTH(X18,12)","v":"2036-02-29"},13,0,0,0,0,{"$f":"SUM(Z19:AC19)","v":0},null,{"$f":"IF(OR(AF18=\"\",AF18>=$S$13),\"\",IF($S$12=\"mensal\",EOMONTH(AF18,1),IF($S$12=\"bimestral\",EOMONTH(AF18,2),IF($S$12=\"trimestral\",EOMONTH(AF18,3),IF($S$12=\"quadrimestral\",EOMONTH(AF18,4),IF($S$12=\"semestral\",EOMONTH(AF18,6),IF($S$12=\"anual\",EOMONTH(AF18,12),\"\")))))))","v":""},{"$f":"IF(AF19=\"\",\"\",$S$18)","v":""},{"$f":"IF(OR(AH18=\"\",AH18>=$T$13),\"\",IF($T$12=\"mensal\",EOMONTH(AH18,1),IF($T$12=\"bimestral\",EOMONTH(AH18,2),IF($T$12=\"trimestral\",EOMONTH(AH18,3),IF($T$12=\"quadrimestral\",EOMONTH(AH18,4),IF($T$12=\"semestral\",EOMONTH(AH18,6),IF($T$12=\"anual\",EOMONTH(AH18,12),\"\")))))))","v":""},{"$f":"IF(AH19=\"\",\"\",$T$18)","v":""},{"$f":"IF(OR(AJ18=\"\",AJ18>=$U$13),\"\",IF($U$12=\"mensal\",EOMONTH(AJ18,1),IF($U$12=\"bimestral\",EOMONTH(AJ18,2),IF($U$12=\"trimestral\",EOMONTH(AJ18,3),IF($U$12=\"quadrimestral\",EOMONTH(AJ18,4),IF($U$12=\"semestral\",EOMONTH(AJ18,6),IF($U$12=\"anual\",EOMONTH(AJ18,12),\"\")))))))","v":""},{"$f":"IF(AJ19=\"\",\"\",$U$18)","v":""},{"$f":"IF(OR(AL18=\"\",AL18>=$V$13),\"\",IF($V$12=\"mensal\",EOMONTH(AL18,1),IF($V$12=\"bimestral\",EOMONTH(AL18,2),IF($V$12=\"trimestral\",EOMONTH(AL18,3),IF($V$12=\"quadrimestral\",EOMONTH(AL18,4),IF($V$12=\"semestral\",EOMONTH(AL18,6),IF($V$12=\"anual\",EOMONTH(AL18,12),\"\")))))))","v":""},{"$f":"IF(AL19=\"\",\"\",$V$18)","v":""}]
["33. Fluxo de Caixa e Capacidade de Pagamento",null,null,null,null,null,null,null,null,null,null,null,null,null,null,null,null,null,null,null,null,null,null,"2037-02-28",14,0,0,0,0,0,null,{"$f":"IF(OR(AF19=\"\",AF19>=$S$13),\"\",IF($S$12=\"mensal\",EOMONTH(AF19,1),IF($S$12=\"bimestral\",EOMONTH(AF19,2),IF($S$12=\"trimestral\",EOMONTH(AF19,3),IF($S$12=\"quadrimestral\",EOMONTH(AF19,4),IF($S$12=\"semestral\",EOMONTH(AF19,6),IF($S$12=\"anual\",EOMONTH(AF19,12),\"\")))))))","v":""},{"$f":"IF(AF20=\"\",\"\",$S$18)","v":""},{"$f":"IF(OR(AH19=\"\",AH19>=$T$13),\"\",IF($T$12=\"mensal\",EOMONTH(AH19,1),IF($T$12=\"bimestral\",EOMONTH(AH19,2),IF($T$12=\"trimestral\",EOMONTH(AH19,3),IF($T$12=\"quadrimestral\",EOMONTH(AH19,4),IF($T$12=\"semestral\",EOMONTH(AH19,6),IF($T$12=\"anual\",EOMONTH(AH19,12),\"\")))))))","v":""},"",{"$f":"IF(OR(AJ19=\"\",AJ19>=$U$13),\"\",IF($U$12=\"mensal\",EOMONTH(AJ19,1),IF($U$12=\"bimestral\",EOMONTH(AJ19,2),IF($U$12=\"trimestral\",EOMONTH(AJ19,3),IF($U$12=\"quadrimestral\",EOMONTH(AJ19,4),IF($U$12=\"semestral\",EOMONTH(AJ19,6),IF($U$12=\"anual\",EOMONTH(AJ19,12),\"\")))))))","v":""},"",{"$f":"IF(OR(AL19=\"\",AL19>=$V$13),\"\",IF($V$12=\"mensal\",EOMONTH(AL19,1),IF($V$12=\"bimestral\",EOMONTH(AL19,2),IF($V$12=\"trimestral\",EOMONTH(AL19,3),IF($V$12=\"quadrimestral\",EOMONTH(AL19,4),IF($V$12=\"semestral\",EOMONTH(AL19,6),IF($V$12=\"anual\",EOMONTH(AL19,12),\"\")))))))","v":""},""]
["Ano","Receita Pecuária","Receita Agricola","Custos","Fluxo Operacional","Desembolsos","Fluxo Liquido","Operações em ser","Amortização","Disponibilidade Líquida",null,"Capacidade Pagamento",null,null,null,null,null,null,null,null,null,null,null,"2038-02-28",15,0,0,0,0,0,null,{"$f":"IF(OR(AF20=\"\",AF20>=$S$13),\"\",IF($S$12=\"mensal\",EOMONTH(AF20,1),IF($S$12=\"bimestral\",EOMONTH(AF20,2),IF($S$12=\"trimestral\",EOMONTH(AF20,3),IF($S$12=\"quadrimestral\",EOMONTH(AF20,4),IF($S$12=\"semestral\",EOMONTH(AF20,6),IF($S$12=\"anual\",EOMONTH(AF20,12),\"\")))))))","v":""},{"$f":"IF(AF21=\"\",\"\",$S$18)","v":""},{"$f":"IF(OR(AH20=\"\",AH20>=$T$13),\"\",IF($T$12=\"mensal\",EOMONTH(AH20,1),IF($T$12=\"bimestral\",EOMONTH(AH20,2),IF($T$12=\"trimestral\",EOMONTH(AH20,3),IF($T$12=\"quadrimestral\",EOMONTH(AH20,4),IF($T$12=\"semestral\",EOMONTH(AH20,6),IF($T$12=\"anual\",EOMONTH(AH20,12),\"\")))))))","v":""},"",{"$f":"IF(OR(AJ20=\"\",AJ20>=$U$13),\"\",IF($U$12=\"mensal\",EOMONTH(AJ20,1),IF($U$12=\"bimestral\",EOMONTH(AJ20,2),IF($U$12=\"trimestral\",EOMONTH(AJ20,3),IF($U$12=\"quadrimestral\",EOMONTH(AJ20,4),IF($U$12=\"semestral\",EOMONTH(AJ20,6),IF($U$12=\"anual\",EOMONTH(AJ20,12),\"\")))))))","v":""},"",{"$f":"IF(OR(AL20=\"\",AL20>=$V$13),\"\",IF($V$12=\"mensal\",EOMONTH(AL20,1),IF($V$12=\"bimestral\",EOMONTH(AL20,2),IF($V$12=\"trimestral\",EOMONTH(AL20,3),IF($V$12=\"quadrimestral\",EOMONTH(AL20,4),IF($V$12=\"semestral\",EOMONTH(AL20,6),IF($V$12=\"anual\",EOMONTH(AL20,12),\"\")))))))","v":""},{"$f":"IF(AL21=\"\",\"\",$V$18)","v":""}]
[null,null,null,null,null,null,null,null,null,"Simples","Acumulada",null,null,null,"ANO","FLUXO DE CAIXA","SALDO","FLUXO DESCONTADO","SALDO",null,"Payback Simples",{"$f":"IFERROR(V26-OFFSET(Q23,V26,0)/OFFSET(P23,V26+1,0),\"\")","v":""},null,"2039-02-28",16,0,0,0,0,0,null,"","","","","","","",""]
[0,0,0,0,{"$f":"B23+C23-D23","v":0},{"$f":"O6","v":0},{"$f":"E23-F23","v":0},0,0,{"$f":"IF(B23=\"\",\"\",G23-H23-I23)","v":0},{"$f":"J23","v":0},{"$f":"IFERROR((((C23+B23)-(D23+H23))/I23)-1,\"\")","v":""},null,null,0,{"$f":"G23","v":0},{"$f":"P23","v":0},{"$f":"P23","v":0},{"$f":"R23","v":0},null,"Início do Projeto",{"$f":"'Dados Cadastrais'!$E$15","v":"00:00:00"},null,"2040-02-29",17,0,0,0,0,0,null,"","","","","","","",""]
[{"$f":"IF(A23<ROUNDUP($O$14/12,0),A23+1,\"\")","v":1},{"$f":"IF(A24=\"\",\"\",'Mem piscicultura-apicultura'!C15+'Mem pecuaria'!C17+'Mem pecuaria'!C52)","v":0},{"$f":"IF(A24=\"\",\"\",'Mem agricultura'!C16)","v":0},{"$f":"IF(A24=\"\",\"\",'Mem agricultura'!B91+'Mem piscicultura-apicultura'!B54+'Mem pecuaria'!B97+'Mem pecuaria'!B111+'Mem despesas fixas'!B14)","v":0},{"$f":"IFERROR(IF(A24=\"\",\"\",B24+C24-D24),\"\")","v":0},null,{"$f":"IFERROR(IF(A24=\"\",\"\",E24-F24),\"\")","v":0},{"$f":"IF(A24=\"\",\"\",'Dados Cadastrais'!P82)","v":0},{"$f":"IF(A24=\"\",\"\",$AD7)","v":0},{"$f":"IFERROR(IF(B24=\"\",\"\",G24-H24-I24),0)","v":0},{"$f":"IFERROR(IF(A24=\"\",\"\",J24),0)","v":0},{"$f":"IFERROR((((C24+B24)-(D24+H24))/I24)-1,\"\")","v":""},null,null,1,{"$f":"G24","v":0},{"$f":"P24+Q23","v":0},{"$f":"PV($E$51,O24,,-P24)","v":0},{"$f":"R24+S23","v":0},null,"Recuperação do Projeto",{"$f":"IFERROR(V23+V25,\"\")","v":""},null,"2041-02-28",18,0,0,0,0,0,null,"","","","","","","",""]
[{"$f":"IF(A24<ROUNDUP($O$14/12,0),A24+1,\"\")","v":""},{"$f":"IF(A25=\"\",\"\",'Mem piscicultura-apicultura'!E15+'Mem pecuaria'!E17+'Mem pecuaria'!E52)","v":""},{"$f":"IF(A25=\"\",\"\",'Mem agricultura'!E16)","v":""},{"$f":"IF(A25=\"\",\"\",'Mem agricultura'!C91+'Mem piscicultura-apicultura'!C54+'Mem pecuaria'!C97+'Mem pecuaria'!C111+'Mem despesas fixas'!C14)","v":""},{"$f":"IFERROR(IF(A25=\"\",\"\",B25+C25-D25),\"\")","v":""},null,{"$f":"IFERROR(IF(A25=\"\",\"\",E25-F25),\"\")","v":""},{"$f":"IF(A25=\"\",\"\",'Dados Cadastrais'!P83)","v":""},{"$f":"IF(A25=\"\",\"\",$AD8)","v":""},{"$f":"IFERROR(IF(B25=\"\",\"\",G25-H25-I25),0)","v":""},{"$f":"IF(A25=\"\",\"\",J25+K24)","v":""},{"$f":"IFERROR((((C25+B25)-(D25+H25))/I25)-1,\"\")","v":""},null,null,2,"",{"$f":"P25+Q24","v":{"$error":"#VALUE!"}},{"$error":"#VALUE!"},{"$error":"#VALUE!"},null,"Dias",{"$f":"IFERROR(V22*365,\"\")","v":""},null,"2042-02-28",19,0,0,0,0,0,null,"","","","","","","",""]
[{"$f":"IF(A25<ROUNDUP($O$14/12,0),A25+1,\"\")","v":""},{"$f":"IF(A26=\"\",\"\",'Mem piscicultura-apicultura'!G15+'Mem pecuaria'!G17+'Mem pecuaria'!G52)","v":""},{"$f":"IF(A26=\"\",\"\",'Mem agricultura'!G16)","v":""},{"$f":"IF(A26=\"\",\"\",'Mem agricultura'!D91+'Mem piscicultura-apicultura'!D54+'Mem pecuaria'!D97+'Mem pecuaria'!D111+'Mem despesas fixas'!D14)","v":""},"",null,"",{"$f":"IF(A26=\"\",\"\",'Dados Cadastrais'!P84)","v":""},{"$f":"IF(A26=\"\",\"\",$AD9)","v":""},{"$f":"IFERROR(IF(B26=\"\",\"\",G26-H26-I26),0)","v":""},"","",null,null,3,{"$f":"G26","v":""},{"$f":"P26+Q25","v":{"$error":"#VALUE!"}},{"$error":"#VALUE!"},{"$error":"#VALUE!"},null,"Anos",{"$f":"IFERROR(MATCH(0,Q23:Q43,1)-1,\"\")","v":1},null,"2043-02-28",20,0,0,0,0,0,null,"","","","","","","",""]
[{"$f":"IF(A26<ROUNDUP($O$14/12,0),A26+1,\"\")","v":""},{"$f":"IF(A27=\"\",\"\",'Mem piscicultura-apicultura'!I15+'Mem pecuaria'!I17+'Mem pecuaria'!I52)","v":""},{"$f":"IF(A27=\"\",\"\",'Mem agricultura'!I16)","v":""},{"$f":"IF(A27=\"\",\"\",'Mem agricultura'!E91+'Mem piscicultura-apicultura'!E54+'Mem pecuaria'!E97+'Mem pecuaria'!E111+'Mem despesas fixas'!E14)","v":""},"",null,"",{"$f":"IF(A27=\"\",\"\",'Dados Cadastrais'!P85)","v":""},"",{"$f":"IFERROR(IF(B27=\"\",\"\",G27-H27-I27),0)","v":""},"","",null,null,4,{"$f":"G27","v":""},{"$f":"P27+Q26","v":{"$error":"#VALUE!"}},{"$error":"#VALUE!"},{"$error":"#VALUE!"},null,null,null,null,null,null,null,null,null,null,null,null,"","","","","","","",""]
[{"$f":"IF(A27<ROUNDUP($O$14/12,0),A27+1,\"\")","v":""},{"$f":"IF(A28=\"\",\"\",'Mem piscicultura-apicultura'!C31+'Mem pecuaria'!K17+'Mem pecuaria'!K52)","v":""},{"$f":"IF(A28=\"\",\"\",'Mem agricultura'!C33)","v":""},{"$f":"IF(A28=\"\",\"\",'Mem agricultura'!F91+'Mem piscicultura-apicultura'!F54+'Mem pecuaria'!F111+'Mem pecuaria'!F97+'Mem despesas fixas'!F14)","v":""},"",null,"",{"$f":"IF(A28=\"\",\"\",'Dados Cadastrais'!P86)","v":""},"",{"$f":"IFERROR(IF(B28=\"\",\"\",G28-H28-I28),0)","v":""},"","",null,null,5,"",{"$error":"#VALUE!"},{"$error":"#VALUE!"},{"$error":"#VALUE!"},null,"Payback Descontado",{"$f":"IFERROR(V32-OFFSET(S23,V32,0)/OFFSET(R23,V32+1,0),\"\")","v":""},null,null,null,null,null,null,null,null,null,"","","","","","","",""]
["",{"$f":"IF(A29=\"\",\"\",'Mem piscicultura-apicultura'!E31+'Mem pecuaria'!M17+'Mem pecuaria'!M52)","v":""},{"$f":"IF(A29=\"\",\"\",'Mem agricultura'!E33)","v":""},{"$f":"IF(A29=\"\",\"\",'Mem agricultura'!G91+'Mem piscicultura-apicultura'!G54+'Mem pecuaria'!G97+'Mem pecuaria'!G111+'Mem despesas fixas'!B28)","v":""},"",null,"",{"$f":"IF(A29=\"\",\"\",'Dados Cadastrais'!P87)","v":""},"",{"$f":"IFERROR(IF(B29=\"\",\"\",G29-H29-I29),0)","v":""},"","",null,null,6,"",{"$error":"#VALUE!"},{"$error":"#VALUE!"},{"$error":"#VALUE!"},null,"Início do Projeto",{"$f":"'Dados Cadastrais'!$E$15","v":"00:00:00"},null,null,null,null,null,null,null,null,null,"","","","","","","",""]
[{"$f":"IF(A29<ROUNDUP($O$14/12,0),A29+1,\"\")","v":""},{"$f":"IF(A30=\"\",\"\",'Mem piscicultura-apicultura'!G31+'Mem pecuaria'!C34+'Mem pecuaria'!C69)","v":""},{"$f":"IF(A30=\"\",\"\",'Mem agricultura'!G33)","v":""},{"$f":"IF(A30=\"\",\"\",'Mem agricultura'!H91+'Mem piscicultura-apicultura'!H54+'Mem pecuaria'!H97+'Mem pecuaria'!H111+'Mem despesas fixas'!C28)","v":""},"",null,"",{"$f":"IF(A30=\"\",\"\",'Dados Cadastrais'!P88)","v":""},"","","",{"$f":"IFERROR((((C30+B30)-(D30+H30))/I30)-1,\"\")","v":""},null,null,7,{"$f":"G30","v":""},{"$error":"#VALUE!"},{"$error":"#VALUE!"},{"$error":"#VALUE!"},null,"Recuperação do Projeto",{"$f":"IFERROR(V29+V31,\"\")","v":""},null,null,null,null,null,null,null,null,null,"","","","","","","",""]
["",{"$f":"IF(A31=\"\",\"\",'Mem piscicultura-apicultura'!I31+'Mem pecuaria'!E34+'Mem pecuaria'!E69)","v":""},{"$f":"IF(A31=\"\",\"\",'Mem agricultura'!I33)","v":""},{"$f":"IF(A31=\"\",\"\",'Mem agricultura'!I91+'Mem piscicultura-apicultura'!I54+'Mem pecuaria'!I97+'Mem pecuaria'!I111+'Mem despesas fixas'!D28)","v":""},"",null,"",{"$f":"IF(A31=\"\",\"\",'Dados Cadastrais'!P89)","v":""},"","",{"$f":"IF(A31=\"\",\"\",J31+K30)","v":""},"",null,null,8,"",{"$error":"#VALUE!"},{"$error":"#VALUE!"},{"$error":"#VALUE!"},null,"Dias",{"$f":"IFERROR(V28*365,\"\")","v":""},null,null,null,null,null,null,null,null,null,"","","","","","","",""]
["",{"$f":"IF(A32=\"\",\"\",'Mem piscicultura-apicultura'!C47+'Mem pecuaria'!G34+'Mem pecuaria'!G69)","v":""},{"$f":"IF(A32=\"\",\"\",'Mem agricultura'!C50)","v":""},{"$f":"IF(A32=\"\",\"\",'Mem agricultura'!B98+'Mem piscicultura-apicultura'!B61+'Mem pecuaria'!J97+'Mem pecuaria'!J111+'Mem despesas fixas'!E28)","v":""},"",null,"",{"$f":"IF(A32=\"\",\"\",'Dados Cadastrais'!P90)","v":""},"","","","",null,null,9,"",{"$error":"#VALUE!"},{"$error":"#VALUE!"},{"$error":"#VALUE!"},null,"Anos",{"$f":"IFERROR(MATCH(0,S23:S43,1)-1,\"\")","v":1},null,null,null,null,null,null,null,null,null,"","","","","","","",""]
["",{"$f":"IF(A33=\"\",\"\",'Mem piscicultura-apicultura'!E47+'Mem pecuaria'!I34+'Mem pecuaria'!I69)","v":""},{"$f":"IF(A33=\"\",\"\",'Mem agricultura'!E50)","v":""},{"$f":"IF(A33=\"\",\"\",'Mem agricultura'!C98+'Mem piscicultura-apicultura'!C61+'Mem pecuaria'!K97+'Mem pecuaria'!K111+'Mem despesas fixas'!F28)","v":""},"",null,"",{"$f":"IF(A33=\"\",\"\",'Dados Cadastrais'!P91)","v":""},"","",{"$f":"IF(A33=\"\",\"\",J33+K32)","v":""},"",null,null,10,"",{"$error":"#VALUE!"},{"$error":"#VALUE!"},{"$error":"#VALUE!"},null,null,null,null,null,null,null,null,null,null,null,null,"","","","","","","",""]
["",{"$f":"IF(A34=\"\",\"\",'Mem piscicultura-apicultura'!G47+'Mem pecuaria'!K34+'Mem pecuaria'!K69)","v":""},{"$f":"IF(A34=\"\",\"\",'Mem agricultura'!G50)","v":""},{"$f":"IF(A34=\"\",\"\",'Mem agricultura'!D98+'Mem piscicultura-apicultura'!D61+'Mem pecuaria'!L97+'Mem pecuaria'!L111+'Mem despesas fixas'!B42)","v":""},{"$f":"IFERROR(IF(A34=\"\",\"\",B34+C34-D34),\"\")","v":""},null,"",{"$f":"IF(A34=\"\",\"\",'Dados Cadastrais'!R82)","v":""},"",{"$f":"IFERROR(IF(B34=\"\",\"\",G34-H34-I34),0)","v":""},{"$f":"IF(A34=\"\",\"\",J34+K33)","v":""},{"$f":"IFERROR((((C34+B34)-(D34+H34))/I34)-1,\"\")","v":""},null,null,11,"",{"$error":"#VALUE!"},{"$error":"#VALUE!"},{"$error":"#VALUE!"},null,"VPentradas",null,null,null,null,null,null,null,null,null,null,"","","","","","","",""]
["",{"$f":"IF(A35=\"\",\"\",'Mem piscicultura-apicultura'!I47+'Mem pecuaria'!M34+'Mem pecuaria'!M69)","v":""},{"$f":"IF(A35=\"\",\"\",'Mem agricultura'!I50)","v":""},{"$f":"IF(A35=\"\",\"\",'Mem agricultura'!$E$98+'Mem piscicultura-apicultura'!$E$61+'Mem pecuaria'!$M$97+'Mem pecuaria'!$M$111+'Mem despesas fixas'!$C$42)","v":""},{"$f":"IFERROR(IF(A35=\"\",\"\",B35+C35-D35),\"\")","v":""},null,"",{"$f":"IF(A35=\"\",\"\",'Dados Cadastrais'!R83)","v":""},"",{"$f":"IFERROR(IF(B35=\"\",\"\",G35-H35-I35),0)","v":""},{"$f":"IF(A35=\"\",\"\",J35+K34)","v":""},{"$f":"IFERROR((((C35+B35)-(D35+H35))/I35)-1,\"\")","v":""},null,null,12,"",{"$error":"#VALUE!"},{"$error":"#VALUE!"},{"$error":"#VALUE!"},null,{"$f":"NPV(E51,G24:G43)","v":0},null,null,null,null,null,null,null,null,null,null,"","","","","","","",""]
["",{"$f":"B35","v":""},{"$f":"IF(A36=\"\",\"\",'Mem agricultura'!C$67)","v":""},{"$f":"IF(A36=\"\",\"\",'Mem agricultura'!$F$98+'Mem piscicultura-apicultura'!$E$61+'Mem pecuaria'!$M$97+'Mem pecuaria'!$M$111+'Mem despesas fixas'!$C$42)","v":""},"",null,"",{"$f":"IF(A36=\"\",\"\",'Dados Cadastrais'!R84)","v":""},"","","","",null,null,13,{"$f":"G36","v":""},{"$f":"P36+Q35","v":{"$error":"#VALUE!"}},{"$error":"#VALUE!"},{"$f":"R36+S35","v":{"$error":"#VALUE!"}},null,null,null,null,null,null,null,null,null,null,null,null,"","","","","","","",""]
["",{"$f":"B36","v":""},{"$f":"IF(A37=\"\",\"\",'Mem agricultura'!E$67)","v":""},{"$f":"IF(A37=\"\",\"\",'Mem agricultura'!$G$98+'Mem piscicultura-apicultura'!$E$61+'Mem pecuaria'!$M$97+'Mem pecuaria'!$M$111+'Mem despesas fixas'!$C$42)","v":""},"",null,"",{"$f":"IF(A37=\"\",\"\",'Dados Cadastrais'!R85)","v":""},"","","","",null,null,14,"",{"$error":"#VALUE!"},{"$error":"#VALUE!"},{"$error":"#VALUE!"}]
["","",{"$f":"IF(A38=\"\",\"\",'Mem agricultura'!G$67)","v":""},{"$f":"IF(A38=\"\",\"\",'Mem agricultura'!$H$98+'Mem piscicultura-apicultura'!$E$61+'Mem pecuaria'!$M$97+'Mem pecuaria'!$M$111+'Mem despesas fixas'!$C$42)","v":""},"",null,"",{"$f":"IF(A38=\"\",\"\",'Dados Cadastrais'!R86)","v":""},"","","","",null,null,15,"",{"$f":"P38+Q37","v":{"$error":"#VALUE!"}},{"$error":"#VALUE!"},{"$error":"#VALUE!"}]
["","",{"$f":"IF(A39=\"\",\"\",'Mem agricultura'!I$67)","v":""},{"$f":"IF(A39=\"\",\"\",'Mem agricultura'!$I$98+'Mem piscicultura-apicultura'!$E$61+'Mem pecuaria'!$M$97+'Mem pecuaria'!$M$111+'Mem despesas fixas'!$C$42)","v":""},"",null,"",{"$f":"IF(A39=\"\",\"\",'Dados Cadastrais'!R87)","v":""},"","","","",null,null,16,{"$f":"G39","v":""},{"$error":"#VALUE!"},{"$error":"#VALUE!"},{"$error":"#VALUE!"}]
["","",{"$f":"IF(A40=\"\",\"\",'Mem agricultura'!C$84)","v":""},{"$f":"IF(A40=\"\",\"\",'Mem agricultura'!$B$105+'Mem piscicultura-apicultura'!$E$61+'Mem pecuaria'!$M$97+'Mem pecuaria'!$M$111+'Mem despesas fixas'!$C$42)","v":""},"",null,"",{"$f":"IF(A40=\"\",\"\",'Dados Cadastrais'!R88)","v":""},"","","","",null,null,17,"",{"$error":"#VALUE!"},{"$error":"#VALUE!"},{"$error":"#VALUE!"}]
["","",{"$f":"IF(A41=\"\",\"\",'Mem agricultura'!E$84)","v":""},{"$f":"IF(A41=\"\",\"\",'Mem agricultura'!$C$105+'Mem piscicultura-apicultura'!$E$61+'Mem pecuaria'!$M$97+'Mem pecuaria'!$M$111+'Mem despesas fixas'!$C$42)","v":""},"",null,"",{"$f":"IF(A41=\"\",\"\",'Dados Cadastrais'!R89)","v":""},{"$f":"IF(A41=\"\",\"\",$AD24)","v":""},"","","",null,null,18,"",{"$error":"#VALUE!"},{"$error":"#VALUE!"},{"$error":"#VALUE!"}]
["","",{"$f":"IF(A42=\"\",\"\",'Mem agricultura'!G$84)","v":""},{"$f":"IF(A42=\"\",\"\",'Mem agricultura'!$D$105+'Mem piscicultura-apicultura'!$E$61+'Mem pecuaria'!$M$97+'Mem pecuaria'!$M$111+'Mem despesas fixas'!$C$42)","v":""},"",null,"",{"$f":"IF(A42=\"\",\"\",'Dados Cadastrais'!R90)","v":""},"","","","",null,null,19,"",{"$error":"#VALUE!"},{"$error":"#VALUE!"},{"$error":"#VALUE!"}]
["","",{"$f":"IF(A43=\"\",\"\",'Mem agricultura'!I$84)","v":""},{"$f":"IF(A43=\"\",\"\",'Mem agricultura'!$E$105+'Mem piscicultura-apicultura'!$E$61+'Mem pecuaria'!$M$97+'Mem pecuaria'!$M$111+'Mem despesas fixas'!$C$42)","v":""},"",null,"",{"$f":"IF(A43=\"\",\"\",'Dados Cadastrais'!R91)","v":""},"","","","",null,null,20,"",{"$error":"#VALUE!"},{"$error":"#VALUE!"},{"$error":"#VALUE!"}]
[]
["34. Indicadores Econômicos",null,null,null,null,null,null,null,null,null,null,null,null,null,null,null,null,null,null,null,null,null,null,null,null,null,null,null,null,null,null,{"$f":"IF(OR(AF36=\"\",AF36>=$S$13),\"\",IF($S$12=\"mensal\",EOMONTH(AF36,1),IF($S$12=\"bimestral\",EOMONTH(AF36,2),IF($S$12=\"trimestral\",EOMONTH(AF36,3),IF($S$12=\"quadrimestral\",EOMONTH(AF36,4),IF($S$12=\"semestral\",EOMONTH(AF36,6),IF($S$12=\"anual\",EOMONTH(AF36,12),\"\")))))))","v":""},"",{"$f":"IF(OR(AH36=\"\",AH36>=$T$13),\"\",IF($T$12=\"mensal\",EOMONTH(AH36,1),IF($T$12=\"bimestral\",EOMONTH(AH36,2),IF($T$12=\"trimestral\",EOMONTH(AH36,3),IF($T$12=\"quadrimestral\",EOMONTH(AH36,4),IF($T$12=\"semestral\",EOMONTH(AH36,6),IF($T$12=\"anual\",EOMONTH(AH36,12),\"\")))))))","v":""},"",{"$f":"IF(OR(AJ36=\"\",AJ36>=$U$13),\"\",IF($U$12=\"mensal\",EOMONTH(AJ36,1),IF($U$12=\"bimestral\",EOMONTH(AJ36,2),IF($U$12=\"trimestral\",EOMONTH(AJ36,3),IF($U$12=\"quadrimestral\",EOMONTH(AJ36,4),IF($U$12=\"semestral\",EOMONTH(AJ36,6),IF($U$12=\"anual\",EOMONTH(AJ36,12),\"\")))))))","v":""},"",{"$f":"IF(OR(AL36=\"\",AL36>=$V$13),\"\",IF($V$12=\"mensal\",EOMONTH(AL36,1),IF($V$12=\"bimestral\",EOMONTH(AL36,2),IF($V$12=\"trimestral\",EOMONTH(AL36,3),IF($V$12=\"quadrimestral\",EOMONTH(AL36,4),IF($V$12=\"semestral\",EOMONTH(AL36,6),IF($V$12=\"anual\",EOMONTH(AL36,12),\"\")))))))","v":""},""]
["Indicadores",null,null,null,"Resultado",null,null,null,null,null,"Legenda",null,null,null,null,null,null,null,null,null,null,null,null,null,null,null,null,null,null,null,null,"","","","","","","",""]
["Taxa Interna de Retorno (TIR)",null,null,null,{"$f":"IFERROR(IRR(G23:G43),0)","v":0},null,null,null,null,null,{"$f":"IF(E47>E51,\"Projeto Viável\",\"Projeto Inviável\")","v":"Projeto Inviável"},null,null,null,null,null,null,null,null,null,null,null,null,null,null,null,null,null,null,null,null,"","","","","","","",""]
["Valor Presente Líquido (VPL)",null,null,null,{"$f":"NPV(E51,G23:G43)","v":0},null,null,null,null,null,{"$f":"IF(E48>0,\"Projeto Viável\",\"Projeto Inviável\")","v":"Projeto Inviável"},null,null,null,null,null,null,null,null,null,null,null,null,null,null,null,null,null,null,null,null,"","","","","","","",""]
["Payback simples",null,null,null,{"$f":"IFERROR(DATEDIF(V23,V24,\"y\")&\" ano(s) \" &DATEDIF(V23,V24,\"ym\")&\" mês(s) \" &DATEDIF(V23,V24,\"md\")& \" dia(s)\",\"\")","v":""},null,null,null,null,null,"-",null,null,null,null,null,null,null,null,null,null,null,null,null,null,null,null,null,null,null,null,"","","","","","","",""]
["Payback descontado",null,null,null,{"$f":"IFERROR(DATEDIF(V29,V30,\"y\")&\" ano(s) \" &DATEDIF(V29,V30,\"ym\")&\" mês(s) \" &DATEDIF(V29,V30,\"md\")& \" dia(s)\",\"\")","v":""},null,null,null,null,null,"-",null,null,null,null,null,null,null,null,null,null,null,null,null,null,null,null,null,null,null,null,"","","","","","","",""]
["Taxa Mínima de Atratividade (TMA)",null,null,null,0.12,null,null,null,null,null,"-",null,null,null,null,null,null,null,null,null,null,null,null,null,null,null,null,null,null,null,null,"","","","","","","",""]
["Relação Custo Benefício (B/C)",null,null,null,{"$f":"IFERROR(SUM(B23:B43,C23:C43)/SUM(D23:D43),0)","v":0},null,null,null,null,null,{"$f":"IF(E52>1,\"Projeto Viável\",\"Projeto Inviável\")","v":"Projeto Inviável"},null,null,null,null,null,null,null,null,null,null,null,null,null,null,null,null,null,null,null,null,"","","","","","","",""]
["Índice de Lucratividade (IL)",null,null,null,{"$f":"IFERROR(-U35/G23,0)","v":0},null,null,null,null,null,{"$f":"IF(E53>1,\"Projeto Viável\",\"Projeto Inviável\")","v":"Projeto Inviável"},null,null,null,null,null,null,null,null,null,null,null,null,null,null,null,null,null,null,null,null,"","","","","","","",""]
[]
["35. Cenário 1"]
["Fluxo de Caixa e Capacidade de Pagamento"]
["Ano","Receita Pecuária","Receita Agricola","Custos","Fluxo Operacional","Desembolsos","Fluxo Liquido","Operações em ser","Amortização","Disponibilidade Líquida",null,"Capacidade Pagamento"]
[null,null,null,null,null,null,null,null,null,"Simples","Acumulada",null,null,null,"ANO","FLUXO DE CAIXA","SALDO","FLUXO DESCONTADO","SALDO",null,"Payback Simples",{"$f":"IFERROR(V62-OFFSET(Q59,V62,0)/OFFSET(P59,V62+1,0),\"\")","v":""}]
[0,0,0,0,{"$f":"B59+C59-D59","v":0},{"$f":"O6","v":0},{"$f":"E59-F59","v":0},0,0,{"$f":"IF(B59=\"\",\"\",G59-H59-I59)","v":0},{"$f":"J59","v":0},{"$f":"IFERROR((((C59+B59)-(D59+H59))/I59)-1,\"\")","v":""},null,null,0,{"$f":"G59","v":0},{"$f":"P59","v":0},{"$f":"P59","v":0},{"$f":"R59","v":0},null,"Início do Projeto",{"$f":"$V$23","v":"00:00:00"}]
[{"$f":"IF(A59<ROUNDUP($O$14/12,0),A59+1,\"\")","v":1},{"$f":"IF(A60=\"\",\"\",B24*((K16/100)+1))","v":0},{"$f":"IF(A60=\"\",\"\",C24*(($K$17/100)+1))","v":0},{"$f":"IF(A60=\"\",\"\",D24*(($K$18/100)+1))","v":0},{"$f":"IFERROR(IF(A60=\"\",\"\",B60+C60-D60),\"\")","v":0},null,{"$f":"IFERROR(IF(A60=\"\",\"\",E60-F60),\"\")","v":0},{"$f":"IF(H24=\"\",\"\",H24)","v":0},{"$f":"IF(A60=\"\",\"\",$AD$7)","v":0},{"$f":"IFERROR(IF(B60=\"\",\"\",G60-H60-I60),0)","v":0},{"$f":"IF(A60=\"\",\"\",J60)","v":0},"",null,null,1,0,{"$f":"P60+Q59","v":0},{"$f":"PV($E$86,O60,,-P60)","v":0},{"$f":"R60+S59","v":0},null,"Recuperação do Projeto",{"$f":"IFERROR(V59+V61,\"\")","v":""}]
[{"$f":"IF(A60<ROUNDUP($O$14/12,0),A60+1,\"\")","v":""},{"$f":"IF(A61=\"\",\"\",B25*(($K$16/100)+1))","v":""},"","",{"$f":"IFERROR(IF(A61=\"\",\"\",B61+C61-D61),\"\")","v":""},null,{"$f":"IFERROR(IF(A61=\"\",\"\",E61-F61),\"\")","v":""},"",{"$f":"IF(A61=\"\",\"\",$AD$8)","v":""},{"$f":"IFERROR(IF(B61=\"\",\"\",G61-H61-I61),0)","v":""},{"$f":"IF(A61=\"\",\"\",J61+K60)","v":""},"",null,null,2,"",{"$error":"#VALUE!"},{"$error":"#VALUE!"},{"$error":"#VALUE!"},null,"Dias",{"$f":"IFERROR(V58*365,\"\")","v":""}]
["","","","",{"$f":"IFERROR(IF(A62=\"\",\"\",B62+C62-D62),\"\")","v":""},null,"","",{"$f":"IF(A62=\"\",\"\",$AD$9)","v":""},{"$f":"IFERROR(IF(B62=\"\",\"\",G62-H62-I62),0)","v":""},{"$f":"IF(A62=\"\",\"\",J62+K61)","v":""},"",null,null,3,"",{"$error":"#VALUE!"},{"$error":"#VALUE!"},{"$error":"#VALUE!"},null,"Anos",{"$f":"IFERROR(MATCH(0,Q59:Q79,1)-1,\"\")","v":1}]
["","","","","",null,"","",{"$f":"IF(A63=\"\",\"\",$AD$10)","v":""},{"$f":"IFERROR(IF(B63=\"\",\"\",G63-H63-I63),0)","v":""},"","",null,null,4,"",{"$error":"#VALUE!"},{"$error":"#VALUE!"},{"$error":"#VALUE!"}]
[{"$f":"IF(A63<ROUNDUP($O$14/12,0),A63+1,\"\")","v":""},"","","","",null,{"$f":"IFERROR(IF(A64=\"\",\"\",E64-F64),\"\")","v":""},"",{"$f":"IF(A64=\"\",\"\",$AD$11)","v":""},{"$f":"IFERROR(IF(B64=\"\",\"\",G64-H64-I64),0)","v":""},"","",null,null,5,"",{"$error":"#VALUE!"},{"$error":"#VALUE!"},{"$error":"#VALUE!"},null,"Payback Descontado",{"$f":"IFERROR(V68-OFFSET(S59,V68,0)/OFFSET(R59,V68+1,0),\"\")","v":""}]
["","","","","",null,"","",{"$f":"IF(A65=\"\",\"\",$AD$12)","v":""},{"$f":"IFERROR(IF(B65=\"\",\"\",G65-H65-I65),0)","v":""},"","",null,null,6,"",{"$error":"#VALUE!"},{"$error":"#VALUE!"},{"$error":"#VALUE!"},null,"Início do Projeto",{"$f":"$V$29","v":"00:00:00"}]
["","","","","",null,"","",{"$f":"IF(A66=\"\",\"\",$AD$13)","v":""},"","","",null,null,7,"",{"$error":"#VALUE!"},{"$error":"#VALUE!"},{"$error":"#VALUE!"},null,"Recuperação do Projeto",{"$f":"IFERROR(V65+V67,\"\")","v":""}]
["","","","","",null,"","",{"$f":"IF(A67=\"\",\"\",$AD$14)","v":""},"","","",null,null,8,"",{"$error":"#VALUE!"},{"$error":"#VALUE!"},{"$error":"#VALUE!"},null,"Dias",{"$f":"IFERROR(V64*365,\"\")","v":""}]
["","","","","",null,"","",{"$f":"IF(A68=\"\",\"\",$AD$15)","v":""},"","","",null,null,9,"",{"$error":"#VALUE!"},{"$error":"#VALUE!"},{"$error":"#VALUE!"},null,"Anos",{"$f":"IFERROR(MATCH(0,S59:S79,1)-1,\"\")","v":1}]
["","","","","",null,"","",{"$f":"IF(A69=\"\",\"\",$AD$16)","v":""},"","","",null,null,10,"",{"$error":"#VALUE!"},{"$error":"#VALUE!"},{"$error":"#VALUE!"}]
["","","","",{"$f":"IFERROR(IF(A70=\"\",\"\",B70+C70-D70),\"\")","v":""},null,{"$f":"IFERROR(IF(A70=\"\",\"\",E70-F70),\"\")","v":""},"",{"$f":"IF(A70=\"\",\"\",$AD$17)","v":""},"","","",null,null,11,"",{"$error":"#VALUE!"},{"$error":"#VALUE!"},{"$error":"#VALUE!"},null,"VPentradas"]
["","","","",{"$f":"IFERROR(IF(A71=\"\",\"\",B71+C71-D71),\"\")","v":""},null,{"$f":"IFERROR(IF(A71=\"\",\"\",E71-F71),\"\")","v":""},"",{"$f":"IF(A71=\"\",\"\",$AD$17)","v":""},"","","",null,null,12,{"$f":"G71","v":""},{"$f":"P71+Q70","v":{"$error":"#VALUE!"}},{"$error":"#VALUE!"},{"$f":"R71+S70","v":{"$error":"#VALUE!"}},null,{"$f":"NPV(E86,G60:G79)","v":0}]
["","","","",{"$f":"IFERROR(IF(A72=\"\",\"\",B72+C72-D72),\"\")","v":""},null,"","","","","","",null,null,13,{"$f":"G72","v":""},{"$f":"P72+Q71","v":{"$error":"#VALUE!"}},{"$error":"#VALUE!"},{"$f":"R72+S71","v":{"$error":"#VALUE!"}}]
["","","","","",null,"","","","","","",null,null,14,"",{"$error":"#VALUE!"},{"$error":"#VALUE!"},{"$error":"#VALUE!"}]
["","","","","",null,"","","","","","",null,null,15,"",{"$error":"#VALUE!"},{"$error":"#VALUE!"},{"$error":"#VALUE!"}]
["","","","","",null,"","","","","","",null,null,16,"",{"$error":"#VALUE!"},{"$error":"#VALUE!"},{"$error":"#VALUE!"}]
["","","","","",null,"","","","","","",null,null,17,"",{"$error":"#VALUE!"},{"$error":"#VALUE!"},{"$error":"#VALUE!"}]
["","","","","",null,"","","","","","",null,null,18,"",{"$error":"#VALUE!"},{"$error":"#VALUE!"},{"$error":"#VALUE!"}]
["","","","","",null,"","","","","","",null,null,19,"",{"$error":"#VALUE!"},{"$error":"#VALUE!"},{"$error":"#VALUE!"}]
["","","","","",null,"","","","","","",null,null,20,"",{"$error":"#VALUE!"},{"$error":"#VALUE!"},{"$error":"#VALUE!"}]
["Indicadores Econômicos"]
["Indicadores",null,null,null,"Resultado",null,null,null,null,null,"Legenda"]
["Taxa Interna de Retorno (TIR)",null,null,null,{"$f":"IFERROR(IRR(G59:G79),0)","v":0},null,null,null,null,null,{"$f":"IF(E82>E86,\"Projeto Viável\",\"Projeto Inviável\")","v":"Projeto Inviável"}]
["Valor Presente Líquido (VPL)",null,null,null,{"$f":"NPV(E86,G59:G79)","v":0},null,null,null,null,null,{"$f":"IF(E83>0,\"Projeto Viável\",\"Projeto Inviável\")","v":"Projeto Inviável"}]
["Payback simples",null,null,null,{"$f":"IFERROR(DATEDIF(V59,V60,\"y\")&\" ano(s) \" &DATEDIF(V59,V60,\"ym\")&\" mês(s) \" &DATEDIF(V59,V60,\"md\")& \" dia(s)\",\"\")","v":""},null,null,null,null,null,"-"]
["Payback descontado",null,null,null,{"$f":"IFERROR(DATEDIF(V65,V66,\"y\")&\" ano(s) \" &DATEDIF(V65,V66,\"ym\")&\" mês(s) \" &DATEDIF(V65,V66,\"md\")& \" dia(s)\",\"\")","v":""},null,null,null,null,null,"-"]
["Taxa Mínima de Atratividade (TMA)",null,null,null,{"$f":"E51","v":0.12},null,null,null,null,null,"-"]
["Relação Custo Benefício (B/C)",null,null,null,{"$f":"IFERROR(SUM(B59:B79,C59:C79)/SUM(D59:D79),0)","v":0},null,null,null,null,null,{"$f":"IF(E87>1,\"Projeto Viável\",\"Projeto Inviável\")","v":"Projeto Inviável"}]
["Índice de Lucratividade (IL)",null,null,null,{"$f":"IFERROR(-U71/G59,0)","v":0},null,null,null,null,null,{"$f":"IF(E88>1,\"Projeto Viável\",\"Projeto Inviável\")","v":"Projeto Inviável"}]
[]
["36. Cenário 2"]
["Fluxo de Caixa e Capacidade de Pagamento"]
["Ano","Receita Pecuária","Receita Agricola","Custos","Fluxo Operacional","Desembolsos","Fluxo Liquido","Operações em ser","Amortização","Disponibilidade Líquida",null,"Capacidade Pagamento"]
[null,null,null,null,null,null,null,null,null,"Simples","Acumulada",null,null,null,"ANO","FLUXO DE CAIXA","SALDO","FLUXO DESCONTADO","SALDO",null,"Payback Simples",{"$f":"IFERROR(V97-OFFSET(Q94,V97,0)/OFFSET(P94,V97+1,0),\"\")","v":""},"Payback Descontado",{"$f":"IFERROR(X97-OFFSET(S94,X97,0)/OFFSET(R94,X97+1,0),\"\")","v":""}]
[0,0,0,0,{"$f":"B94+C94-D94","v":0},{"$f":"O6","v":0},{"$f":"E94-F94","v":0},0,0,{"$f":"IF(B94=\"\",\"\",G94-H94-I94)","v":0},{"$f":"J94","v":0},{"$f":"IFERROR((((C94+B94)-(D94+H94))/I94)-1,\"\")","v":""},null,null,0,{"$f":"G94","v":0},{"$f":"P94","v":0},{"$f":"P94","v":0},{"$f":"R94","v":0},null,"Início do Projeto",{"$f":"$V$23","v":"00:00:00"},"Início do Projeto",{"$f":"$V$29","v":"00:00:00"}]
[{"$f":"IF(A94<ROUNDUP($O$14/12,0),A94+1,\"\")","v":1},{"$f":"IF(A95=\"\",\"\",B24*(($L$16/100)+1))","v":0},{"$f":"IF(A95=\"\",\"\",C24*(($L$17/100)+1))","v":0},{"$f":"IF(A95=\"\",\"\",D24*(($L$18/100)+1))","v":0},{"$f":"IFERROR(IF(A95=\"\",\"\",B95+C95-D95),\"\")","v":0},null,{"$f":"IFERROR(IF(A95=\"\",\"\",E95-F95),\"\")","v":0},{"$f":"IF(H24=\"\",\"\",H24)","v":0},{"$f":"IF(A95=\"\",\"\",$AD$7)","v":0},{"$f":"IFERROR(IF(B95=\"\",\"\",G95-H95-I95),0)","v":0},{"$f":"IF(A95=\"\",\"\",J95)","v":0},"",null,null,1,{"$f":"G95","v":0},{"$f":"P95+Q94","v":0},{"$f":"PV($E$121,O95,,-P95)","v":0},{"$f":"R95+S94","v":0},null,"Recuperação do Projeto",{"$f":"IFERROR(V94+V96,\"\")","v":""},"Recuperação do Projeto",{"$f":"IFERROR(X94+X96,\"\")","v":""}]
[{"$f":"IF(A95<ROUNDUP($O$14/12,0),A95+1,\"\")","v":""},"","","",{"$f":"IFERROR(IF(A96=\"\",\"\",B96+C96-D96),\"\")","v":""},null,{"$f":"IFERROR(IF(A96=\"\",\"\",E96-F96),\"\")","v":""},"",{"$f":"IF(A96=\"\",\"\",$AD$8)","v":""},{"$f":"IFERROR(IF(B96=\"\",\"\",G96-H96-I96),0)","v":""},{"$f":"IF(A96=\"\",\"\",J96+K95)","v":""},"",null,null,2,"",{"$error":"#VALUE!"},{"$error":"#VALUE!"},{"$error":"#VALUE!"},null,"Dias",{"$f":"IFERROR(V93*365,\"\")","v":""},"Dias",{"$f":"IFERROR(X93*365,\"\")","v":""}]
["","","","",{"$f":"IFERROR(IF(A97=\"\",\"\",B97+C97-D97),\"\")","v":""},null,"","",{"$f":"IF(A97=\"\",\"\",$AD$9)","v":""},{"$f":"IFERROR(IF(B97=\"\",\"\",G97-H97-I97),0)","v":""},"","",null,null,3,"",{"$error":"#VALUE!"},{"$error":"#VALUE!"},{"$error":"#VALUE!"},null,"Anos",{"$f":"IFERROR(MATCH(0,Q94:Q114,1)-1,\"\")","v":1},"Anos",{"$f":"IFERROR(MATCH(0,S94:S114,1)-1,\"\")","v":1}]
["","","","","",null,"","",{"$f":"IF(A98=\"\",\"\",$AD$10)","v":""},{"$f":"IFERROR(IF(B98=\"\",\"\",G98-H98-I98),0)","v":""},"","",null,null,4,"",{"$error":"#VALUE!"},{"$error":"#VALUE!"},{"$error":"#VALUE!"}]
[{"$f":"IF(A98<ROUNDUP($O$14/12,0),A98+1,\"\")","v":""},"","","","",null,{"$f":"IFERROR(IF(A99=\"\",\"\",E99-F99),\"\")","v":""},"",{"$f":"IF(A99=\"\",\"\",$AD$11)","v":""},{"$f":"IFERROR(IF(B99=\"\",\"\",G99-H99-I99),0)","v":""},"","",null,null,5,"",{"$error":"#VALUE!"},{"$error":"#VALUE!"},{"$error":"#VALUE!"},null,"VPentradas"]
["","","","","",null,"","",{"$f":"IF(A100=\"\",\"\",$AD$12)","v":""},{"$f":"IFERROR(IF(B100=\"\",\"\",G100-H100-I100),0)","v":""},"","",null,null,6,"",{"$error":"#VALUE!"},{"$error":"#VALUE!"},{"$error":"#VALUE!"},null,{"$f":"NPV(E121,G95:G114)","v":0}]
["","","","","",null,"","",{"$f":"IF(A101=\"\",\"\",$AD$13)","v":""},"","","",null,null,7,"",{"$error":"#VALUE!"},{"$error":"#VALUE!"},{"$error":"#VALUE!"}]
["","","","","",null,"","",{"$f":"IF(A102=\"\",\"\",$AD$14)","v":""},"","","",null,null,8,"",{"$error":"#VALUE!"},{"$error":"#VALUE!"},{"$error":"#VALUE!"}]
["","","","","",null,"","",{"$f":"IF(A103=\"\",\"\",$AD$15)","v":""},"","","",null,null,9,"",{"$error":"#VALUE!"},{"$error":"#VALUE!"},{"$error":"#VALUE!"}]
["","","","","",null,"","",{"$f":"IF(A104=\"\",\"\",$AD$16)","v":""},"","","",null,null,10,"",{"$error":"#VALUE!"},{"$error":"#VALUE!"},{"$error":"#VALUE!"}]
["","","","","",null,"","",{"$f":"IF(A105=\"\",\"\",$AD$17)","v":""},"","","",null,null,11,{"$f":"G105","v":""},{"$error":"#VALUE!"},{"$error":"#VALUE!"},{"$error":"#VALUE!"}]
["","","","","",null,"","",{"$f":"IF(A106=\"\",\"\",$AD$17)","v":""},"","","",null,null,12,"",{"$error":"#VALUE!"},{"$error":"#VALUE!"},{"$error":"#VALUE!"}]
["","","","","",null,"","","","","","",null,null,13,{"$f":"G107","v":""},{"$f":"P107+Q106","v":{"$error":"#VALUE!"}},{"$error":"#VALUE!"},{"$f":"R107+S106","v":{"$error":"#VALUE!"}}]
["","","","","",null,"","","","","","",null,null,14,"",{"$error":"#VALUE!"},{"$error":"#VALUE!"},{"$error":"#VALUE!"}]
["","","","","",null,"","","","","","",null,null,15,"",{"$error":"#VALUE!"},{"$error":"#VALUE!"},{"$error":"#VALUE!"}]
["","","","","",null,"","","","","","",null,null,16,"",{"$error":"#VALUE!"},{"$error":"#VALUE!"},{"$error":"#VALUE!"}]
["","","","","",null,"","","","","","",null,null,17,"",{"$error":"#VALUE!"},{"$error":"#VALUE!"},{"$error":"#VALUE!"}]
["","","","","",null,"","","","","","",null,null,18,"",{"$error":"#VALUE!"},{"$error":"#VALUE!"},{"$error":"#VALUE!"}]
["","","","","",null,"","","","","","",null,null,19,"",{"$error":"#VALUE!"},{"$error":"#VALUE!"},{"$error":"#VALUE!"}]
["","","","","",null,"","","","","","",null,null,20,"",{"$error":"#VALUE!"},{"$error":"#VALUE!"},{"$error":"#VALUE!"}]
["Indicadores Econômicos"]
["Indicadores",null,null,null,"Resultado",null,null,null,null,null,"Legenda"]
["Taxa Interna de Retorno (TIR)",null,null,null,{"$f":"IFERROR(IRR(G94:G114),0)","v":0},null,null,null,null,null,{"$f":"IF(E117>E121,\"Projeto Viável\",\"Projeto Inviável\")","v":"Projeto Inviável"}]
["Valor Presente Líquido (VPL)",null,null,null,{"$f":"NPV(E121,G94:G114)","v":0},null,null,null,null,null,{"$f":"IF(E118>0,\"Projeto Viável\",\"Projeto Inviável\")","v":"Projeto Inviável"}]
["Payback simples",null,null,null,{"$f":"IFERROR(DATEDIF(V9,V95,\"y\")&\" ano(s) \" &DATEDIF(V94,V95,\"ym\")&\" mês(s) \" &DATEDIF(V94,V95,\"md\")& \" dia(s)\",\"\")","v":""},null,null,null,null,null,"-"]
["Payback descontado",null,null,null,{"$f":"IFERROR(DATEDIF(X94,X95,\"y\")&\" ano(s) \" &DATEDIF(X94,X95,\"ym\")&\" mês(s) \" &DATEDIF(X94,X95,\"md\")& \" dia(s)\",\"\")","v":""},null,null,null,null,null,"-"]
["Taxa Mínima de Atratividade (TMA)",null,null,null,{"$f":"E86","v":0.12},null,null,null,null,null,"-"]
["Relação Custo Benefício (B/C)",null,null,null,{"$f":"IFERROR(SUM(B94:B114,C94:C114)/SUM(D94:D114),0)","v":0},null,null,null,null,null,{"$f":"IF(E122>1,\"Projeto Viável\",\"Projeto Inviável\")","v":"Projeto Inviável"}]
["Índice de Lucratividade (IL)",null,null,null,{"$f":"IFERROR(-U100/G94,0)","v":0},null,null,null,null,null,{"$f":"IF(E123>1,\"Projeto Viável\",\"Projeto Inviável\")","v":"Projeto Inviável"}]
[]
["37. Compromisso Técnico"]
["Atestamos que este planejamento observa parâmetros técnicos compatíveis com o nível de produtividade previsto e atende aos normativos do crédito rural vigentes. Comprometemo-nos a observar os termos do convênio/ termo de responsabilidade profissional mantido com este agente financeiro e, em especial, comunicar à este mesmo agente financeiro, tempestivamente, qualquer irregularidade detectada. Além disso comprometemo-nos a orientar e seguir as recomendações técnicas emitidas, observando a preservação do meio - ambiente, conforme a legislação em vigor."]
[]
[]
[]
[]
["38. Parecer Técnico do Elaborador do Projeto"]
[]
[]
[]
[]
[]
[]
[]
[]
[]
[]
[]
[]
[]
[]
[]
[]
[]
[]
[]
[]
[]
[null,null,null,null,null,null,null,null,{"$f":"IF('Dados Cadastrais'!E92=\"\",\"\",'Dados Cadastrais'!E92)","v":""}]

{"sheet":"Mem Atividades não financiadas","index":15,"n_rows":47,"n_cols":9,"rows_kept":47,"cut":false,"hidden":true,"merged":[[32,0,34,0],[32,1,32,8],[33,1,33,2],[33,3,33,4],[33,5,33,6],[33,7,33,8],[16,0,18,0],[16,1,16,8],[17,1,17,2],[17,3,17,4],[17,5,17,6],[17,7,17,8],[0,0,2,0],[0,1,0,8],[1,1,1,2],[1,3,1,4],[1,5,1,6],[1,7,1,8]]}
["Produtos Comercializados","Produção"]
[null,"Ano 1",null,"Ano 2",null,"Ano 3",null,"Ano 4"]
[null,"Qtd","Valor","Qtd","Valor","Qtd","Valor","Qtd","Valor"]
[{"$f":"'Atividades não financiadas'!A45","v":""},{"$f":"'Atividades não financiadas'!B5*'Atividades não financiadas'!D5","v":0},{"$f":"B4*'Atividades não financiadas'!B45","v":0},{"$f":"'Atividades não financiadas'!B5*'Atividades não financiadas'!E5","v":0},{"$f":"D4*'Atividades não financiadas'!B45","v":0},{"$f":"'Atividades não financiadas'!B5*'Atividades não financiadas'!F5","v":0},{"$f":"F4*'Atividades não financiadas'!B45","v":0},{"$f":"'Atividades não financiadas'!B5*'Atividades não financiadas'!G5","v":0},{"$f":"H4*'Atividades não financiadas'!B45","v":0}]
[{"$f":"'Atividades não financiadas'!A46","v":""},{"$f":"'Atividades não financiadas'!B6*'Atividades não financiadas'!D6","v":0},{"$f":"B5*'Atividades não financiadas'!B46","v":0},{"$f":"'Atividades não financiadas'!B6*'Atividades não financiadas'!E6","v":0},{"$f":"D5*'Atividades não financiadas'!B46","v":0},{"$f":"'Atividades não financiadas'!B6*'Atividades não financiadas'!F6","v":0},{"$f":"F5*'Atividades não financiadas'!B46","v":0},{"$f":"'Atividades não financiadas'!B6*'Atividades não financiadas'!G6","v":0},{"$f":"H5*'Atividades não financiadas'!B46","v":0}]
[{"$f":"'Atividades não financiadas'!A47","v":""},{"$f":"'Atividades não financiadas'!B7*'Atividades não financiadas'!D7","v":0},{"$f":"B6*'Atividades não financiadas'!B47","v":0},{"$f":"'Atividades não financiadas'!B7*'Atividades não financiadas'!E7","v":0},{"$f":"D6*'Atividades não financiadas'!B47","v":0},{"$f":"'Atividades não financiadas'!B7*'Atividades não financiadas'!F7","v":0},{"$f":"F6*'Atividades não financiadas'!B47","v":0},{"$f":"'Atividades não financiadas'!B7*'Atividades não financiadas'!G7","v":0},{"$f":"H6*'Atividades não financiadas'!B47","v":0}]
[{"$f":"'Atividades não financiadas'!A48","v":""},{"$f":"'Atividades não financiadas'!B8*'Atividades não financiadas'!D8","v":0},{"$f":"B7*'Atividades não financiadas'!B48","v":0},{"$f":"'Atividades não financiadas'!B8*'Atividades não financiadas'!E8","v":0},{"$f":"D7*'Atividades não financiadas'!B48","v":0},{"$f":"'Atividades não financiadas'!B8*'Atividades não financiadas'!F8","v":0},{"$f":"F7*'Atividades não financiadas'!B48","v":0},{"$f":"'Atividades não financiadas'!B8*'Atividades não financiadas'!G8","v":0},{"$f":"H7*'Atividades não financiadas'!B48","v":0}]
[{"$f":"'Atividades não financiadas'!A49","v":""},{"$f":"'Atividades não financiadas'!B9*'Atividades não financiadas'!D9","v":0},{"$f":"B8*'Atividades não financiadas'!B49","v":0},{"$f":"'Atividades não financiadas'!B9*'Atividades não financiadas'!E9","v":0},{"$f":"D8*'Atividades não financiadas'!B49","v":0},{"$f":"'Atividades não financiadas'!B9*'Atividades não financiadas'!F9","v":0},{"$f":"F8*'Atividades não financiadas'!B49","v":0},{"$f":"'Atividades não financiadas'!B9*'Atividades não financiadas'!G9","v":0},{"$f":"H8*'Atividades não financiadas'!B49","v":0}]
[{"$f":"'Atividades não financiadas'!A50","v":""},{"$f":"'Atividades não financiadas'!B10*'Atividades não financiadas'!D10","v":0},{"$f":"B9*'Atividades não financiadas'!B50","v":0},{"$f":"'Atividades não financiadas'!B10*'Atividades não financiadas'!E10","v":0},{"$f":"D9*'Atividades não financiadas'!B50","v":0},{"$f":"'Atividades não financiadas'!B10*'Atividades não financiadas'!F10","v":0},{"$f":"F9*'Atividades não financiadas'!B50","v":0},{"$f":"'Atividades não financiadas'!B10*'Atividades não financiadas'!G10","v":0},{"$f":"H9*'Atividades não financiadas'!B50","v":0}]
[{"$f":"'Atividades não financiadas'!A51","v":""},{"$f":"'Atividades não financiadas'!B11*'Atividades não financiadas'!D11","v":0},{"$f":"B10*'Atividades não financiadas'!B51","v":0},{"$f":"'Atividades não financiadas'!B11*'Atividades não financiadas'!E11","v":0},{"$f":"D10*'Atividades não financiadas'!B51","v":0},{"$f":"'Atividades não financiadas'!B11*'Atividades não financiadas'!F11","v":0},{"$f":"F10*'Atividades não financiadas'!B51","v":0},{"$f":"'Atividades não financiadas'!B11*'Atividades não financiadas'!G11","v":0},{"$f":"H10*'Atividades não financiadas'!B51","v":0}]
[{"$f":"'Atividades não financiadas'!A52","v":""},{"$f":"'Atividades não financiadas'!B12*'Atividades não financiadas'!D12","v":0},{"$f":"B11*'Atividades não financiadas'!B52","v":0},{"$f":"'Atividades não financiadas'!B12*'Atividades não financiadas'!E12","v":0},{"$f":"D11*'Atividades não financiadas'!B52","v":0},{"$f":"'Atividades não financiadas'!B12*'Atividades não financiadas'!F12","v":0},{"$f":"F11*'Atividades não financiadas'!B52","v":0},{"$f":"'Atividades não financiadas'!B12*'Atividades não financiadas'!G12","v":0},{"$f":"H11*'Atividades não financiadas'!B52","v":0}]
[{"$f":"'Atividades não financiadas'!A53","v":""},{"$f":"'Atividades não financiadas'!B13*'Atividades não financiadas'!D13","v":0},{"$f":"B12*'Atividades não financiadas'!B53","v":0},{"$f":"'Atividades não financiadas'!B13*'Atividades não financiadas'!E13","v":0},{"$f":"D12*'Atividades não financiadas'!B53","v":0},{"$f":"'Atividades não financiadas'!B13*'Atividades não financiadas'!F13","v":0},{"$f":"F12*'Atividades não financiadas'!B53","v":0},{"$f":"'Atividades não financiadas'!B13*'Atividades não financiadas'!G13","v":0},{"$f":"H12*'Atividades não financiadas'!B53","v":0}]
[{"$f":"'Atividades não financiadas'!A54","v":""},{"$f":"'Atividades não financiadas'!B14*'Atividades não financiadas'!D14","v":0},{"$f":"B13*'Atividades não financiadas'!B54","v":0},{"$f":"'Atividades não financiadas'!B14*'Atividades não financiadas'!E14","v":0},{"$f":"D13*'Atividades não financiadas'!B54","v":0},{"$f":"'Atividades não financiadas'!B14*'Atividades não financiadas'!F14","v":0},{"$f":"F13*'Atividades não financiadas'!B54","v":0},{"$f":"'Atividades não financiadas'!B14*'Atividades não financiadas'!G14","v":0},{"$f":"H13*'Atividades não financiadas'!B54","v":0}]
[{"$f":"'Atividades não financiadas'!A55","v":""},{"$f":"'Atividades não financiadas'!B15*'Atividades não financiadas'!D15","v":0},{"$f":"B14*'Atividades não financiadas'!B55","v":0},{"$f":"'Atividades não financiadas'!B15*'Atividades não financiadas'!E15","v":0},{"$f":"D14*'Atividades não financiadas'!B55","v":0},{"$f":"'Atividades não financiadas'!B15*'Atividades não financiadas'!F15","v":0},{"$f":"F14*'Atividades não financiadas'!B55","v":0},{"$f":"'Atividades não financiadas'!B15*'Atividades não financiadas'!G15","v":0},{"$f":"H14*'Atividades não financiadas'!B55","v":0}]
["Total",null,{"$f":"SUM(C4:C14)","v":0},null,{"$f":"SUM(E4:E14)","v":0},null,{"$f":"SUM(G4:G14)","v":0},null,{"$f":"SUM(I4:I14)","v":0}]
[]
["Produtos Comercializados","Produção"]
[null,"Ano 5",null,"Ano 6",null,"Ano 7",null,"Ano 8"]
[null,"Qtd","Valor","Qtd","Valor","Qtd","Valor","Qtd","Valor"]
[{"$f":"'Atividades não financiadas'!A45","v":""},{"$f":"'Atividades não financiadas'!B18*'Atividades não financiadas'!D18","v":0},{"$f":"B20*'Atividades não financiadas'!B45","v":0},{"$f":"'Atividades não financiadas'!B18*'Atividades não financiadas'!E18","v":0},{"$f":"D20*'Atividades não financiadas'!B45","v":0},{"$f":"'Atividades não financiadas'!B18*'Atividades não financiadas'!F18","v":0},{"$f":"F20*'Atividades não financiadas'!B45","v":0},{"$f":"'Atividades não financiadas'!B18*'Atividades não financiadas'!G18","v":0},{"$f":"H20*'Atividades não financiadas'!B45","v":0}]
[{"$f":"'Atividades não financiadas'!A46","v":""},{"$f":"'Atividades não financiadas'!B19*'Atividades não financiadas'!D19","v":0},{"$f":"B21*'Atividades não financiadas'!B46","v":0},{"$f":"'Atividades não financiadas'!B19*'Atividades não financiadas'!E19","v":0},{"$f":"D21*'Atividades não financiadas'!B46","v":0},{"$f":"'Atividades não financiadas'!B19*'Atividades não financiadas'!F19","v":0},{"$f":"F21*'Atividades não financiadas'!B46","v":0},{"$f":"'Atividades não financiadas'!B19*'Atividades não financiadas'!G19","v":0},{"$f":"H21*'Atividades não financiadas'!B46","v":0}]
[{"$f":"'Atividades não financiadas'!A47","v":""},{"$f":"'Atividades não financiadas'!B20*'Atividades não financiadas'!D20","v":0},{"$f":"B22*'Atividades não financiadas'!B47","v":0},{"$f":"'Atividades não financiadas'!B20*'Atividades não financiadas'!E20","v":0},{"$f":"D22*'Atividades não financiadas'!B47","v":0},{"$f":"'Atividades não financiadas'!B20*'Atividades não financiadas'!F20","v":0},{"$f":"F22*'Atividades não financiadas'!B47","v":0},{"$f":"'Atividades não financiadas'!B20*'Atividades não financiadas'!G20","v":0},{"$f":"H22*'Atividades não financiadas'!B47","v":0}]
[{"$f":"'Atividades não financiadas'!A48","v":""},{"$f":"'Atividades não financiadas'!B21*'Atividades não financiadas'!D21","v":0},{"$f":"B23*'Atividades não financiadas'!B48","v":0},{"$f":"'Atividades não financiadas'!B21*'Atividades não financiadas'!E21","v":0},{"$f":"D23*'Atividades não financiadas'!B48","v":0},{"$f":"'Atividades não financiadas'!B21*'Atividades não financiadas'!F21","v":0},{"$f":"F23*'Atividades não financiadas'!B48","v":0},{"$f":"'Atividades não financiadas'!B21*'Atividades não financiadas'!G21","v":0},{"$f":"H23*'Atividades não financiadas'!B48","v":0}]
[{"$f":"'Atividades não financiadas'!A49","v":""},{"$f":"'Atividades não financiadas'!B22*'Atividades não financiadas'!D22","v":0},{"$f":"B24*'Atividades não financiadas'!B49","v":0},{"$f":"'Atividades não financiadas'!B22*'Atividades não financiadas'!E22","v":0},{"$f":"D24*'Atividades não financiadas'!B49","v":0},{"$f":"'Atividades não financiadas'!B22*'Atividades não financiadas'!F22","v":0},{"$f":"F24*'Atividades não financiadas'!B49","v":0},{"$f":"'Atividades não financiadas'!B22*'Atividades não financiadas'!G22","v":0},{"$f":"H24*'Atividades não financiadas'!B49","v":0}]
[{"$f":"'Atividades não financiadas'!A50","v":""},{"$f":"'Atividades não financiadas'!B23*'Atividades não financiadas'!D23","v":0},{"$f":"B25*'Atividades não financiadas'!B50","v":0},{"$f":"'Atividades não financiadas'!B23*'Atividades não financiadas'!E23","v":0},{"$f":"D25*'Atividades não financiadas'!B50","v":0},{"$f":"'Atividades não financiadas'!B23*'Atividades não financiadas'!F23","v":0},{"$f":"F25*'Atividades não financiadas'!B50","v":0},{"$f":"'Atividades não financiadas'!B23*'Atividades não financiadas'!G23","v":0},{"$f":"H25*'Atividades não financiadas'!B50","v":0}]
[{"$f":"'Atividades não financiadas'!A51","v":""},{"$f":"'Atividades não financiadas'!B24*'Atividades não financiadas'!D24","v":0},{"$f":"B26*'Atividades não financiadas'!B51","v":0},{"$f":"'Atividades não financiadas'!B24*'Atividades não financiadas'!E24","v":0},{"$f":"D26*'Atividades não financiadas'!B51","v":0},{"$f":"'Atividades não financiadas'!B24*'Atividades não financiadas'!F24","v":0},{"$f":"F26*'Atividades não financiadas'!B51","v":0},{"$f":"'Atividades não financiadas'!B24*'Atividades não financiadas'!G24","v":0},{"$f":"H26*'Atividades não financiadas'!B51","v":0}]
[{"$f":"'Atividades não financiadas'!A52","v":""},{"$f":"'Atividades não financiadas'!B25*'Atividades não financiadas'!D25","v":0},{"$f":"B27*'Atividades não financiadas'!B52","v":0},{"$f":"'Atividades não financiadas'!B25*'Atividades não financiadas'!E25","v":0},{"$f":"D27*'Atividades não financiadas'!B52","v":0},{"$f":"'Atividades não financiadas'!B25*'Atividades não financiadas'!F25","v":0},{"$f":"F27*'Atividades não financiadas'!B52","v":0},{"$f":"'Atividades não financiadas'!B25*'Atividades não financiadas'!G25","v":0},{"$f":"H27*'Atividades não financiadas'!B52","v":0}]
[{"$f":"'Atividades não financiadas'!A53","v":""},{"$f":"'Atividades não financiadas'!B26*'Atividades não financiadas'!D26","v":0},{"$f":"B28*'Atividades não financiadas'!B53","v":0},{"$f":"'Atividades não financiadas'!B26*'Atividades não financiadas'!E26","v":0},{"$f":"D28*'Atividades não financiadas'!B53","v":0},{"$f":"'Atividades não financiadas'!B26*'Atividades não financiadas'!F26","v":0},{"$f":"F28*'Atividades não financiadas'!B53","v":0},{"$f":"'Atividades não financiadas'!B26*'Atividades não financiadas'!G26","v":0},{"$f":"H28*'Atividades não financiadas'!B53","v":0}]
[{"$f":"'Atividades não financiadas'!A54","v":""},{"$f":"'Atividades não financiadas'!B27*'Atividades não financiadas'!D27","v":0},{"$f":"B29*'Atividades não financiadas'!B54","v":0},{"$f":"'Atividades não financiadas'!B27*'Atividades não financiadas'!E27","v":0},{"$f":"D29*'Atividades não financiadas'!B54","v":0},{"$f":"'Atividades não financiadas'!B27*'Atividades não financiadas'!F27","v":0},{"$f":"F29*'Atividades não financiadas'!B54","v":0},{"$f":"'Atividades não financiadas'!B27*'Atividades não financiadas'!G27","v":0},{"$f":"H29*'Atividades não financiadas'!B54","v":0}]
[{"$f":"'Atividades não financiadas'!A55","v":""},{"$f":"'Atividades não financiadas'!B28*'Atividades não financiadas'!D28","v":0},{"$f":"B30*'Atividades não financiadas'!B55","v":0},{"$f":"'Atividades não financiadas'!B28*'Atividades não financiadas'!E28","v":0},{"$f":"D30*'Atividades não financiadas'!B55","v":0},{"$f":"'Atividades não financiadas'!B28*'Atividades não financiadas'!F28","v":0},{"$f":"F30*'Atividades não financiadas'!B55","v":0},{"$f":"'Atividades não financiadas'!B28*'Atividades não financiadas'!G28","v":0},{"$f":"H30*'Atividades não financiadas'!B55","v":0}]
["Total",null,{"$f":"SUM(C20:C30)","v":0},null,{"$f":"SUM(E20:E30)","v":0},null,{"$f":"SUM(G20:G30)","v":0},null,{"$f":"SUM(I20:I30)","v":0}]
[]
["Produtos Comercializados","Produção"]
[null,"Ano 9",null,"Ano 10",null,"Ano 11",null,"Ano 12"]
[null,"Qtd","Valor","Qtd","Valor","Qtd","Valor","Qtd","Valor"]
[{"$f":"'Atividades não financiadas'!A45","v":""},{"$f":"'Atividades não financiadas'!B31*'Atividades não financiadas'!D31","v":0},{"$f":"B36*'Atividades não financiadas'!B45","v":0},{"$f":"'Atividades não financiadas'!B31*'Atividades não financiadas'!E31","v":0},{"$f":"D36*'Atividades não financiadas'!B45","v":0},{"$f":"'Atividades não financiadas'!B31*'Atividades não financiadas'!F31","v":0},{"$f":"F36*'Atividades não financiadas'!B45","v":0},{"$f":"'Atividades não financiadas'!B31*'Atividades não financiadas'!G31","v":0},{"$f":"H36*'Atividades não financiadas'!B45","v":0}]
[{"$f":"'Atividades não financiadas'!A46","v":""},{"$f":"'Atividades não financiadas'!B32*'Atividades não financiadas'!D32","v":0},{"$f":"B37*'Atividades não financiadas'!B46","v":0},{"$f":"'Atividades não financiadas'!B32*'Atividades não financiadas'!E32","v":0},{"$f":"D37*'Atividades não financiadas'!B46","v":0},{"$f":"'Atividades não financiadas'!B32*'Atividades não financiadas'!F32","v":0},{"$f":"F37*'Atividades não financiadas'!B46","v":0},{"$f":"'Atividades não financiadas'!B32*'Atividades não financiadas'!G32","v":0},{"$f":"H37*'Atividades não financiadas'!B46","v":0}]
[{"$f":"'Atividades não financiadas'!A47","v":""},{"$f":"'Atividades não financiadas'!B33*'Atividades não financiadas'!D33","v":0},{"$f":"B38*'Atividades não financiadas'!B47","v":0},{"$f":"'Atividades não financiadas'!B33*'Atividades não financiadas'!E33","v":0},{"$f":"D38*'Atividades não financiadas'!B47","v":0},{"$f":"'Atividades não financiadas'!B33*'Atividades não financiadas'!F33","v":0},{"$f":"F38*'Atividades não financiadas'!B47","v":0},{"$f":"'Atividades não financiadas'!B33*'Atividades não financiadas'!G33","v":0},{"$f":"H38*'Atividades não financiadas'!B47","v":0}]
[{"$f":"'Atividades não financiadas'!A48","v":""},{"$f":"'Atividades não financiadas'!B34*'Atividades não financiadas'!D34","v":0},{"$f":"B39*'Atividades não financiadas'!B48","v":0},{"$f":"'Atividades não financiadas'!B34*'Atividades não financiadas'!E34","v":0},{"$f":"D39*'Atividades não financiadas'!B48","v":0},{"$f":"'Atividades não financiadas'!B34*'Atividades não financiadas'!F34","v":0},{"$f":"F39*'Atividades não financiadas'!B48","v":0},{"$f":"'Atividades não financiadas'!B34*'Atividades não financiadas'!G34","v":0},{"$f":"H39*'Atividades não financiadas'!B48","v":0}]
[{"$f":"'Atividades não financiadas'!A49","v":""},{"$f":"'Atividades não financiadas'!B35*'Atividades não financiadas'!D35","v":0},{"$f":"B40*'Atividades não financiadas'!B49","v":0},{"$f":"'Atividades não financiadas'!B35*'Atividades não financiadas'!E35","v":0},{"$f":"D40*'Atividades não financiadas'!B49","v":0},{"$f":"'Atividades não financiadas'!B35*'Atividades não financiadas'!F35","v":0},{"$f":"F40*'Atividades não financiadas'!B49","v":0},{"$f":"'Atividades não financiadas'!B35*'Atividades não financiadas'!G35","v":0},{"$f":"H40*'Atividades não financiadas'!B49","v":0}]
[{"$f":"'Atividades não financiadas'!A50","v":""},{"$f":"'Atividades não financiadas'!B36*'Atividades não financiadas'!D36","v":0},{"$f":"B41*'Atividades não financiadas'!B50","v":0},{"$f":"'Atividades não financiadas'!B36*'Atividades não financiadas'!E36","v":0},{"$f":"D41*'Atividades não financiadas'!B50","v":0},{"$f":"'Atividades não financiadas'!B36*'Atividades não financiadas'!F36","v":0},{"$f":"F41*'Atividades não financiadas'!B50","v":0},{"$f":"'Atividades não financiadas'!B36*'Atividades não financiadas'!G36","v":0},{"$f":"H41*'Atividades não financiadas'!B50","v":0}]
[{"$f":"'Atividades não financiadas'!A51","v":""},{"$f":"'Atividades não financiadas'!B37*'Atividades não financiadas'!D37","v":0},{"$f":"B42*'Atividades não financiadas'!B51","v":0},{"$f":"'Atividades não financiadas'!B37*'Atividades não financiadas'!E37","v":0},{"$f":"D42*'Atividades não financiadas'!B51","v":0},{"$f":"'Atividades não financiadas'!B37*'Atividades não financiadas'!F37","v":0},{"$f":"F42*'Atividades não financiadas'!B51","v":0},{"$f":"'Atividades não financiadas'!B37*'Atividades não financiadas'!G37","v":0},{"$f":"H42*'Atividades não financiadas'!B51","v":0}]
[{"$f":"'Atividades não financiadas'!A52","v":""},{"$f":"'Atividades não financiadas'!B38*'Atividades não financiadas'!D38","v":0},{"$f":"B43*'Atividades não financiadas'!B52","v":0},{"$f":"'Atividades não financiadas'!B38*'Atividades não financiadas'!E38","v":0},{"$f":"D43*'Atividades não financiadas'!B52","v":0},{"$f":"'Atividades não financiadas'!B38*'Atividades não financiadas'!F38","v":0},{"$f":"F43*'Atividades não financiadas'!B52","v":0},{"$f":"'Atividades não financiadas'!B38*'Atividades não financiadas'!G38","v":0},{"$f":"H43*'Atividades não financiadas'!B52","v":0}]
[{"$f":"'Atividades não financiadas'!A53","v":""},{"$f":"'Atividades não financiadas'!B39*'Atividades não financiadas'!D39","v":0},{"$f":"B44*'Atividades não financiadas'!B53","v":0},{"$f":"'Atividades não financiadas'!B39*'Atividades não financiadas'!E39","v":0},{"$f":"D44*'Atividades não financiadas'!B53","v":0},{"$f":"'Atividades não financiadas'!B39*'Atividades não financiadas'!F39","v":0},{"$f":"F44*'Atividades não financiadas'!B53","v":0},{"$f":"'Atividades não financiadas'!B39*'Atividades não financiadas'!G39","v":0},{"$f":"H44*'Atividades não financiadas'!B53","v":0}]
[{"$f":"'Atividades não financiadas'!A54","v":""},{"$f":"'Atividades não financiadas'!B40*'Atividades não financiadas'!D40","v":0},{"$f":"B45*'Atividades não financiadas'!B54","v":0},{"$f":"'Atividades não financiadas'!B40*'Atividades não financiadas'!E40","v":0},{"$f":"D45*'Atividades não financiadas'!B54","v":0},{"$f":"'Atividades não financiadas'!B40*'Atividades não financiadas'!F40","v":0},{"$f":"F45*'Atividades não financiadas'!B54","v":0},{"$f":"'Atividades não financiadas'!B40*'Atividades não financiadas'!G40","v":0},{"$f":"H45*'Atividades não financiadas'!B54","v":0}]
[{"$f":"'Atividades não financiadas'!A55","v":""},{"$f":"'Atividades não financiadas'!B41*'Atividades não financiadas'!D41","v":0},{"$f":"B46*'Atividades não financiadas'!B55","v":0},{"$f":"'Atividades não financiadas'!B41*'Atividades não financiadas'!E41","v":0},{"$f":"D46*'Atividades não financiadas'!B55","v":0},{"$f":"'Atividades não financiadas'!B41*'Atividades não financiadas'!F41","v":0},{"$f":"F46*'Atividades não financiadas'!B55","v":0},{"$f":"'Atividades não financiadas'!B41*'Atividades não financiadas'!G41","v":0},{"$f":"H46*'Atividades não financiadas'!B55","v":0}]
["Total",null,{"$f":"SUM(C36:C46)","v":0},null,{"$f":"SUM(E36:E46)","v":0},null,{"$f":"SUM(G36:G46)","v":0},null,{"$f":"SUM(I36:I46)","v":0}]

{"sheet":"Mem agricultura","index":16,"n_rows":105,"n_cols":9,"rows_kept":105,"cut":false,"hidden":true,"merged":[[99,0,100,0],[99,1,99,8],[68,0,70,0],[68,1,68,8],[69,1,69,2],[69,3,69,4],[69,5,69,6],[69,7,69,8],[85,0,86,0],[85,1,85,8],[92,0,93,0],[92,1,92,8],[34,0,36,0],[34,1,34,8],[35,1,35,2],[35,3,35,4],[35,5,35,6],[35,7,35,8],[51,0,53,0],[51,1,51,8],[52,1,52,2],[52,3,52,4],[52,5,52,6],[52,7,52,8],[17,0,19,0],[17,1,17,8],[18,1,18,2],[18,3,18,4],[18,5,18,6],[18,7,18,8],[0,0,2,0],[0,1,0,8],[1,1,1,2],[1,3,1,4],[1,5,1,6],[1,7,1,8]]}
["Produtos Comercializados","Produção"]
[null,"Ano 1",null,"Ano 2",null,"Ano 3",null,"Ano 4"]
[null,"Qtd","Valor","Qtd","Valor","Qtd","Valor","Qtd","Valor"]
[{"$f":"Agricultura!A76","v":""},{"$f":"Agricultura!B5*Agricultura!D5","v":0},{"$f":"B4*Agricultura!B76","v":0},{"$f":"Agricultura!B5*Agricultura!E5","v":0},{"$f":"D4*Agricultura!$B$76","v":0},{"$f":"Agricultura!B5*Agricultura!F5","v":0},{"$f":"F4*Agricultura!$B$76","v":0},{"$f":"Agricultura!B5*Agricultura!G5","v":0},{"$f":"H4*Agricultura!$B$76","v":0}]
[{"$f":"Agricultura!A77","v":""},{"$f":"Agricultura!B6*Agricultura!D6","v":0},{"$f":"B5*Agricultura!B77","v":0},{"$f":"Agricultura!B6*Agricultura!E6","v":0},{"$f":"D5*Agricultura!$B$77","v":0},{"$f":"Agricultura!B6*Agricultura!F6","v":0},{"$f":"F5*Agricultura!$B$77","v":0},{"$f":"Agricultura!B6*Agricultura!G6","v":0},{"$f":"H5*Agricultura!$B$77","v":0}]
[{"$f":"Agricultura!A78","v":""},{"$f":"Agricultura!B7*Agricultura!D7","v":0},{"$f":"B6*Agricultura!B78","v":0},{"$f":"Agricultura!B7*Agricultura!E7","v":0},{"$f":"D6*Agricultura!$B$78","v":0},{"$f":"Agricultura!B7*Agricultura!F7","v":0},{"$f":"F6*Agricultura!$B$78","v":0},{"$f":"Agricultura!B7*Agricultura!G7","v":0},{"$f":"H6*Agricultura!$B$78","v":0}]
[{"$f":"Agricultura!A79","v":""},{"$f":"Agricultura!B8*Agricultura!D8","v":0},{"$f":"B7*Agricultura!B79","v":0},{"$f":"Agricultura!B8*Agricultura!E8","v":0},{"$f":"D7*Agricultura!$B$79","v":0},{"$f":"Agricultura!B8*Agricultura!F8","v":0},{"$f":"F7*Agricultura!$B$79","v":0},{"$f":"Agricultura!B8*Agricultura!G8","v":0},{"$f":"H7*Agricultura!$B$79","v":0}]
[{"$f":"Agricultura!A80","v":""},{"$f":"Agricultura!B9*Agricultura!D9","v":0},{"$f":"B8*Agricultura!B80","v":0},{"$f":"Agricultura!B9*Agricultura!E9","v":0},{"$f":"D8*Agricultura!$B$80","v":0},{"$f":"Agricultura!B9*Agricultura!F9","v":0},{"$f":"F8*Agricultura!$B$80","v":0},{"$f":"Agricultura!B9*Agricultura!G9","v":0},{"$f":"H8*Agricultura!$B$80","v":0}]
[{"$f":"Agricultura!A81","v":""},{"$f":"Agricultura!B10*Agricultura!D10","v":0},{"$f":"B9*Agricultura!B81","v":0},{"$f":"Agricultura!B10*Agricultura!E10","v":0},{"$f":"D9*Agricultura!$B$81","v":0},{"$f":"Agricultura!B10*Agricultura!F10","v":0},{"$f":"F9*Agricultura!$B$81","v":0},{"$f":"Agricultura!B10*Agricultura!G10","v":0},{"$f":"H9*Agricultura!$B$81","v":0}]
[{"$f":"Agricultura!A82","v":""},{"$f":"Agricultura!B11*Agricultura!D11","v":0},{"$f":"B10*Agricultura!B82","v":0},{"$f":"Agricultura!B11*Agricultura!E11","v":0},{"$f":"D10*Agricultura!$B$82","v":0},{"$f":"Agricultura!B11*Agricultura!F11","v":0},{"$f":"F10*Agricultura!$B$82","v":0},{"$f":"Agricultura!B11*Agricultura!G11","v":0},{"$f":"H10*Agricultura!$B$82","v":0}]
[{"$f":"Agricultura!A83","v":""},{"$f":"Agricultura!B12*Agricultura!D12","v":0},{"$f":"B11*Agricultura!B83","v":0},{"$f":"Agricultura!B12*Agricultura!E12","v":0},{"$f":"D11*Agricultura!$B$83","v":0},{"$f":"Agricultura!B12*Agricultura!F12","v":0},{"$f":"F11*Agricultura!$B$83","v":0},{"$f":"Agricultura!B12*Agricultura!G12","v":0},{"$f":"H11*Agricultura!$B$83","v":0}]
[{"$f":"Agricultura!A84","v":""},{"$f":"Agricultura!B13*Agricultura!D13","v":0},{"$f":"B12*Agricultura!B84","v":0},{"$f":"Agricultura!B13*Agricultura!E13","v":0},{"$f":"D12*Agricultura!$B$84","v":0},{"$f":"Agricultura!B13*Agricultura!F13","v":0},{"$f":"F12*Agricultura!$B$84","v":0},{"$f":"Agricultura!B13*Agricultura!G13","v":0},{"$f":"H12*Agricultura!$B$84","v":0}]
[{"$f":"Agricultura!A85","v":""},{"$f":"Agricultura!B14*Agricultura!D14","v":0},{"$f":"B13*Agricultura!B85","v":0},{"$f":"Agricultura!B14*Agricultura!E14","v":0},{"$f":"D13*Agricultura!$B$85","v":0},{"$f":"Agricultura!B14*Agricultura!F14","v":0},{"$f":"F13*Agricultura!$B$85","v":0},{"$f":"Agricultura!B14*Agricultura!G14","v":0},{"$f":"H13*Agricultura!$B$85","v":0}]
[{"$f":"Agricultura!A86","v":""},{"$f":"Agricultura!B15*Agricultura!D15","v":0},{"$f":"B14*Agricultura!B86","v":0},{"$f":"Agricultura!B15*Agricultura!E15","v":0},{"$f":"D14*Agricultura!$B$86","v":0},{"$f":"Agricultura!B15*Agricultura!F15","v":0},{"$f":"F14*Agricultura!$B$86","v":0},{"$f":"Agricultura!B15*Agricultura!G15","v":0},{"$f":"H14*Agricultura!$B$86","v":0}]
[{"$f":"Agricultura!A87","v":""},{"$f":"Agricultura!B16*Agricultura!D16","v":0},{"$f":"B15*Agricultura!B87","v":0},{"$f":"Agricultura!B16*Agricultura!E16","v":0},{"$f":"D15*Agricultura!$B$87","v":0},{"$f":"Agricultura!B16*Agricultura!F16","v":0},{"$f":"F15*Agricultura!$B$87","v":0},{"$f":"Agricultura!B16*Agricultura!G16","v":0},{"$f":"H15*Agricultura!$B$87","v":0}]
["Total",null,{"$f":"SUM(C4:C15)","v":0},null,{"$f":"SUM(E4:E15)","v":0},null,{"$f":"SUM(G4:G15)","v":0},null,{"$f":"SUM(I4:I15)","v":0}]
[]
["Produtos Comercializados","Produção"]
[null,"Ano 5",null,"Ano 6",null,"Ano 7",null,"Ano 8"]
[null,"Qtd","Valor","Qtd","Valor","Qtd","Valor","Qtd","Valor"]
[{"$f":"Agricultura!A76","v":""},{"$f":"Agricultura!$B$19*Agricultura!D19","v":0},{"$f":"B21*Agricultura!$B$76","v":0},{"$f":"Agricultura!$B19*Agricultura!E19","v":0},{"$f":"D21*Agricultura!$B$76","v":0},{"$f":"Agricultura!$B19*Agricultura!F19","v":0},{"$f":"F21*Agricultura!$B$76","v":0},{"$f":"Agricultura!$B19*Agricultura!G19","v":0},{"$f":"H21*Agricultura!$B$76","v":0}]
[{"$f":"Agricultura!A77","v":""},{"$f":"Agricultura!$B$20*Agricultura!D20","v":0},{"$f":"B22*Agricultura!$B$77","v":0},{"$f":"Agricultura!$B20*Agricultura!E20","v":0},{"$f":"D22*Agricultura!$B$77","v":0},{"$f":"Agricultura!$B20*Agricultura!F20","v":0},{"$f":"F22*Agricultura!$B$77","v":0},{"$f":"Agricultura!$B20*Agricultura!G20","v":0},{"$f":"H22*Agricultura!$B$77","v":0}]
[{"$f":"Agricultura!A78","v":""},{"$f":"Agricultura!$B$21*Agricultura!D21","v":0},{"$f":"B23*Agricultura!$B$78","v":0},{"$f":"Agricultura!$B21*Agricultura!E21","v":0},{"$f":"D23*Agricultura!$B$78","v":0},{"$f":"Agricultura!$B21*Agricultura!F21","v":0},{"$f":"F23*Agricultura!$B$78","v":0},{"$f":"Agricultura!$B21*Agricultura!G21","v":0},{"$f":"H23*Agricultura!$B$78","v":0}]
[{"$f":"Agricultura!A79","v":""},{"$f":"Agricultura!$B$22*Agricultura!D22","v":0},{"$f":"B24*Agricultura!$B$79","v":0},{"$f":"Agricultura!$B22*Agricultura!E22","v":0},{"$f":"D24*Agricultura!$B$79","v":0},{"$f":"Agricultura!$B22*Agricultura!F22","v":0},{"$f":"F24*Agricultura!$B$79","v":0},{"$f":"Agricultura!$B22*Agricultura!G22","v":0},{"$f":"H24*Agricultura!$B$79","v":0}]
[{"$f":"Agricultura!A80","v":""},{"$f":"Agricultura!$B$23*Agricultura!D23","v":0},{"$f":"B25*Agricultura!$B$80","v":0},{"$f":"Agricultura!$B23*Agricultura!E23","v":0},{"$f":"D25*Agricultura!$B$80","v":0},{"$f":"Agricultura!$B23*Agricultura!F23","v":0},{"$f":"F25*Agricultura!$B$80","v":0},{"$f":"Agricultura!$B23*Agricultura!G23","v":0},{"$f":"H25*Agricultura!$B$80","v":0}]
[{"$f":"Agricultura!A81","v":""},{"$f":"Agricultura!$B$24*Agricultura!D24","v":0},{"$f":"B26*Agricultura!$B$81","v":0},{"$f":"Agricultura!$B24*Agricultura!E24","v":0},{"$f":"D26*Agricultura!$B$81","v":0},{"$f":"Agricultura!$B24*Agricultura!F24","v":0},{"$f":"F26*Agricultura!$B$81","v":0},{"$f":"Agricultura!$B24*Agricultura!G24","v":0},{"$f":"H26*Agricultura!$B$81","v":0}]
[{"$f":"Agricultura!A82","v":""},{"$f":"Agricultura!$B$25*Agricultura!D25","v":0},{"$f":"B27*Agricultura!$B$82","v":0},{"$f":"Agricultura!$B25*Agricultura!E25","v":0},{"$f":"D27*Agricultura!$B$82","v":0},{"$f":"Agricultura!$B25*Agricultura!F25","v":0},{"$f":"F27*Agricultura!$B$82","v":0},{"$f":"Agricultura!$B25*Agricultura!G25","v":0},{"$f":"H27*Agricultura!$B$82","v":0}]
[{"$f":"Agricultura!A83","v":""},{"$f":"Agricultura!$B$26*Agricultura!D26","v":0},{"$f":"B28*Agricultura!$B$83","v":0},{"$f":"Agricultura!$B26*Agricultura!E26","v":0},{"$f":"D28*Agricultura!$B$83","v":0},{"$f":"Agricultura!$B26*Agricultura!F26","v":0},{"$f":"F28*Agricultura!$B$83","v":0},{"$f":"Agricultura!$B26*Agricultura!G26","v":0},{"$f":"H28*Agricultura!$B$83","v":0}]
[{"$f":"Agricultura!A84","v":""},{"$f":"Agricultura!$B$27*Agricultura!D27","v":0},{"$f":"B29*Agricultura!$B$84","v":0},{"$f":"Agricultura!$B27*Agricultura!E27","v":0},{"$f":"D29*Agricultura!$B$84","v":0},{"$f":"Agricultura!$B27*Agricultura!F27","v":0},{"$f":"F29*Agricultura!$B$84","v":0},{"$f":"Agricultura!$B27*Agricultura!G27","v":0},{"$f":"H29*Agricultura!$B$84","v":0}]
[{"$f":"Agricultura!A85","v":""},{"$f":"Agricultura!$B$28*Agricultura!D28","v":0},{"$f":"B30*Agricultura!$B$85","v":0},{"$f":"Agricultura!$B28*Agricultura!E28","v":0},{"$f":"D30*Agricultura!$B$85","v":0},{"$f":"Agricultura!$B28*Agricultura!F28","v":0},{"$f":"F30*Agricultura!$B$85","v":0},{"$f":"Agricultura!$B28*Agricultura!G28","v":0},{"$f":"H30*Agricultura!$B$85","v":0}]
[{"$f":"Agricultura!A86","v":""},{"$f":"Agricultura!$B$29*Agricultura!D29","v":0},{"$f":"B31*Agricultura!$B$86","v":0},{"$f":"Agricultura!$B29*Agricultura!E29","v":0},{"$f":"D31*Agricultura!$B$86","v":0},{"$f":"Agricultura!$B29*Agricultura!F29","v":0},{"$f":"F31*Agricultura!$B$86","v":0},{"$f":"Agricultura!$B29*Agricultura!G29","v":0},{"$f":"H31*Agricultura!$B$86","v":0}]
[{"$f":"Agricultura!A87","v":""},{"$f":"Agricultura!$B$30*Agricultura!D30","v":0},{"$f":"B32*Agricultura!$B$87","v":0},{"$f":"Agricultura!$B30*Agricultura!E30","v":0},{"$f":"D32*Agricultura!$B$87","v":0},{"$f":"Agricultura!$B30*Agricultura!F30","v":0},{"$f":"F32*Agricultura!$B$87","v":0},{"$f":"Agricultura!$B30*Agricultura!G30","v":0},{"$f":"H32*Agricultura!$B$87","v":0}]
["Total",null,{"$f":"SUM(C21:C32)","v":0},null,{"$f":"SUM(E21:E32)","v":0},null,{"$f":"SUM(G21:G32)","v":0},null,{"$f":"SUM(I21:I32)","v":0}]
[]
["Produtos Comercializados","Produção"]
[null,"Ano 9",null,"Ano 10",null,"Ano 11",null,"Ano 12"]
[null,"Qtd","Valor","Qtd","Valor","Qtd","Valor","Qtd","Valor"]
[{"$f":"Agricultura!A76","v":""},{"$f":"Agricultura!$B$33*Agricultura!D33","v":0},{"$f":"B38*Agricultura!$B$76","v":0},{"$f":"Agricultura!$B33*Agricultura!E33","v":0},{"$f":"D38*Agricultura!$B$76","v":0},{"$f":"Agricultura!$B33*Agricultura!F33","v":0},{"$f":"F38*Agricultura!$B$76","v":0},{"$f":"Agricultura!$B33*Agricultura!G33","v":0},{"$f":"H38*Agricultura!$B$76","v":0}]
[{"$f":"Agricultura!A77","v":""},{"$f":"Agricultura!$B$34*Agricultura!D34","v":0},{"$f":"B39*Agricultura!$B$77","v":0},{"$f":"Agricultura!$B34*Agricultura!E34","v":0},{"$f":"D39*Agricultura!$B$77","v":0},{"$f":"Agricultura!$B34*Agricultura!F34","v":0},{"$f":"F39*Agricultura!$B$77","v":0},{"$f":"Agricultura!$B34*Agricultura!G34","v":0},{"$f":"H39*Agricultura!$B$77","v":0}]
[{"$f":"Agricultura!A78","v":""},{"$f":"Agricultura!$B$35*Agricultura!D35","v":0},{"$f":"B40*Agricultura!$B$78","v":0},{"$f":"Agricultura!$B35*Agricultura!E35","v":0},{"$f":"D40*Agricultura!$B$78","v":0},{"$f":"Agricultura!$B35*Agricultura!F35","v":0},{"$f":"F40*Agricultura!$B$78","v":0},{"$f":"Agricultura!$B35*Agricultura!G35","v":0},{"$f":"H40*Agricultura!$B$78","v":0}]
[{"$f":"Agricultura!A79","v":""},{"$f":"Agricultura!$B$36*Agricultura!D36","v":0},{"$f":"B41*Agricultura!$B$79","v":0},{"$f":"Agricultura!$B36*Agricultura!E36","v":0},{"$f":"D41*Agricultura!$B$79","v":0},{"$f":"Agricultura!$B36*Agricultura!F36","v":0},{"$f":"F41*Agricultura!$B$79","v":0},{"$f":"Agricultura!$B36*Agricultura!G36","v":0},{"$f":"H41*Agricultura!$B$79","v":0}]
[{"$f":"Agricultura!A80","v":""},{"$f":"Agricultura!$B$37*Agricultura!D37","v":0},{"$f":"B42*Agricultura!$B$80","v":0},{"$f":"Agricultura!$B37*Agricultura!E37","v":0},{"$f":"D42*Agricultura!$B$80","v":0},{"$f":"Agricultura!$B37*Agricultura!F37","v":0},{"$f":"F42*Agricultura!$B$80","v":0},{"$f":"Agricultura!$B37*Agricultura!G37","v":0},{"$f":"H42*Agricultura!$B$80","v":0}]
[{"$f":"Agricultura!A81","v":""},{"$f":"Agricultura!$B$38*Agricultura!D38","v":0},{"$f":"B43*Agricultura!$B$81","v":0},{"$f":"Agricultura!$B38*Agricultura!E38","v":0},{"$f":"D43*Agricultura!$B$81","v":0},{"$f":"Agricultura!$B38*Agricultura!F38","v":0},{"$f":"F43*Agricultura!$B$81","v":0},{"$f":"Agricultura!$B38*Agricultura!G38","v":0},{"$f":"H43*Agricultura!$B$81","v":0}]
[{"$f":"Agricultura!A82","v":""},{"$f":"Agricultura!$B$39*Agricultura!D39","v":0},{"$f":"B44*Agricultura!$B$82","v":0},{"$f":"Agricultura!$B39*Agricultura!E39","v":0},{"$f":"D44*Agricultura!$B$82","v":0},{"$f":"Agricultura!$B39*Agricultura!F39","v":0},{"$f":"F44*Agricultura!$B$82","v":0},{"$f":"Agricultura!$B39*Agricultura!G39","v":0},{"$f":"H44*Agricultura!$B$82","v":0}]
[{"$f":"Agricultura!A83","v":""},{"$f":"Agricultura!$B$40*Agricultura!D40","v":0},{"$f":"B45*Agricultura!$B$83","v":0},{"$f":"Agricultura!$B40*Agricultura!E40","v":0},{"$f":"D45*Agricultura!$B$83","v":0},{"$f":"Agricultura!$B40*Agricultura!F40","v":0},{"$f":"F45*Agricultura!$B$83","v":0},{"$f":"Agricultura!$B40*Agricultura!G40","v":0},{"$f":"H45*Agricultura!$B$83","v":0}]
[{"$f":"Agricultura!A84","v":""},{"$f":"Agricultura!$B$41*Agricultura!D41","v":0},{"$f":"B46*Agricultura!$B$84","v":0},{"$f":"Agricultura!$B41*Agricultura!E41","v":0},{"$f":"D46*Agricultura!$B$84","v":0},{"$f":"Agricultura!$B41*Agricultura!F41","v":0},{"$f":"F46*Agricultura!$B$84","v":0},{"$f":"Agricultura!$B41*Agricultura!G41","v":0},{"$f":"H46*Agricultura!$B$84","v":0}]
[{"$f":"Agricultura!A85","v":""},{"$f":"Agricultura!$B$42*Agricultura!D42","v":0},{"$f":"B47*Agricultura!$B$85","v":0},{"$f":"Agricultura!$B42*Agricultura!E42","v":0},{"$f":"D47*Agricultura!$B$85","v":0},{"$f":"Agricultura!$B42*Agricultura!F42","v":0},{"$f":"F47*Agricultura!$B$85","v":0},{"$f":"Agricultura!$B42*Agricultura!G42","v":0},{"$f":"H47*Agricultura!$B$85","v":0}]
[{"$f":"Agricultura!A86","v":""},{"$f":"Agricultura!$B$43*Agricultura!D43","v":0},{"$f":"B48*Agricultura!$B$86","v":0},{"$f":"Agricultura!$B43*Agricultura!E43","v":0},{"$f":"D48*Agricultura!$B$86","v":0},{"$f":"Agricultura!$B43*Agricultura!F43","v":0},{"$f":"F48*Agricultura!$B$86","v":0},{"$f":"Agricultura!$B43*Agricultura!G43","v":0},{"$f":"H48*Agricultura!$B$86","v":0}]
[{"$f":"Agricultura!A87","v":""},{"$f":"Agricultura!$B$44*Agricultura!D44","v":0},{"$f":"B49*Agricultura!$B$87","v":0},{"$f":"Agricultura!$B44*Agricultura!E44","v":0},{"$f":"D49*Agricultura!$B$87","v":0},{"$f":"Agricultura!$B44*Agricultura!F44","v":0},{"$f":"F49*Agricultura!$B$87","v":0},{"$f":"Agricultura!$B44*Agricultura!G44","v":0},{"$f":"H49*Agricultura!$B$87","v":0}]
["Total",null,{"$f":"SUM(C38:C49)","v":0},null,{"$f":"SUM(E38:E49)","v":0},null,{"$f":"SUM(G38:G49)","v":0},null,{"$f":"SUM(I38:I49)","v":0}]
[]
["Produtos Comercializados","Produção"]
[null,"Ano 13",null,"Ano 14",null,"Ano 15",null,"Ano 16"]
[null,"Qtd","Valor","Qtd","Valor","Qtd","Valor","Qtd","Valor"]
[{"$f":"Agricultura!A76","v":""},{"$f":"Agricultura!$B47*Agricultura!D47","v":0},{"$f":"B55*Agricultura!$B$76","v":0},{"$f":"Agricultura!$B47*Agricultura!E47","v":0},{"$f":"D55*Agricultura!$B$76","v":0},{"$f":"Agricultura!$B47*Agricultura!F47","v":0},{"$f":"F55*Agricultura!$B$76","v":0},{"$f":"Agricultura!$B47*Agricultura!G47","v":0},{"$f":"H55*Agricultura!$B$76","v":0}]
[{"$f":"Agricultura!A77","v":""},{"$f":"Agricultura!$B48*Agricultura!D48","v":0},{"$f":"B56*Agricultura!$B$77","v":0},{"$f":"Agricultura!$B48*Agricultura!E48","v":0},{"$f":"D56*Agricultura!$B$77","v":0},{"$f":"Agricultura!$B48*Agricultura!F48","v":0},{"$f":"F56*Agricultura!$B$77","v":0},{"$f":"Agricultura!$B48*Agricultura!G48","v":0},{"$f":"H56*Agricultura!$B$77","v":0}]
[{"$f":"Agricultura!A78","v":""},{"$f":"Agricultura!$B49*Agricultura!D49","v":0},{"$f":"B57*Agricultura!$B$78","v":0},{"$f":"Agricultura!$B49*Agricultura!E49","v":0},{"$f":"D57*Agricultura!$B$78","v":0},{"$f":"Agricultura!$B49*Agricultura!F49","v":0},{"$f":"F57*Agricultura!$B$78","v":0},{"$f":"Agricultura!$B49*Agricultura!G49","v":0},{"$f":"H57*Agricultura!$B$78","v":0}]
[{"$f":"Agricultura!A79","v":""},{"$f":"Agricultura!$B50*Agricultura!D50","v":0},{"$f":"B58*Agricultura!$B$79","v":0},{"$f":"Agricultura!$B50*Agricultura!E50","v":0},{"$f":"D58*Agricultura!$B$79","v":0},{"$f":"Agricultura!$B50*Agricultura!F50","v":0},{"$f":"F58*Agricultura!$B$79","v":0},{"$f":"Agricultura!$B50*Agricultura!G50","v":0},{"$f":"H58*Agricultura!$B$79","v":0}]
[{"$f":"Agricultura!A80","v":""},{"$f":"Agricultura!$B51*Agricultura!D51","v":0},{"$f":"B59*Agricultura!$B$80","v":0},{"$f":"Agricultura!$B51*Agricultura!E51","v":0},{"$f":"D59*Agricultura!$B$80","v":0},{"$f":"Agricultura!$B51*Agricultura!F51","v":0},{"$f":"F59*Agricultura!$B$80","v":0},{"$f":"Agricultura!$B51*Agricultura!G51","v":0},{"$f":"H59*Agricultura!$B$80","v":0}]
[{"$f":"Agricultura!A81","v":""},{"$f":"Agricultura!$B52*Agricultura!D52","v":0},{"$f":"B60*Agricultura!$B$81","v":0},{"$f":"Agricultura!$B52*Agricultura!E52","v":0},{"$f":"D60*Agricultura!$B$81","v":0},{"$f":"Agricultura!$B52*Agricultura!F52","v":0},{"$f":"F60*Agricultura!$B$81","v":0},{"$f":"Agricultura!$B52*Agricultura!G52","v":0},{"$f":"H60*Agricultura!$B$81","v":0}]
[{"$f":"Agricultura!A82","v":""},{"$f":"Agricultura!$B53*Agricultura!D53","v":0},{"$f":"B61*Agricultura!$B$82","v":0},{"$f":"Agricultura!$B53*Agricultura!E53","v":0},{"$f":"D61*Agricultura!$B$82","v":0},{"$f":"Agricultura!$B53*Agricultura!F53","v":0},{"$f":"F61*Agricultura!$B$82","v":0},{"$f":"Agricultura!$B53*Agricultura!G53","v":0},{"$f":"H61*Agricultura!$B$82","v":0}]
[{"$f":"Agricultura!A83","v":""},{"$f":"Agricultura!$B54*Agricultura!D54","v":0},{"$f":"B62*Agricultura!$B$83","v":0},{"$f":"Agricultura!$B54*Agricultura!E54","v":0},{"$f":"D62*Agricultura!$B$83","v":0},{"$f":"Agricultura!$B54*Agricultura!F54","v":0},{"$f":"F62*Agricultura!$B$83","v":0},{"$f":"Agricultura!$B54*Agricultura!G54","v":0},{"$f":"H62*Agricultura!$B$83","v":0}]
[{"$f":"Agricultura!A84","v":""},{"$f":"Agricultura!$B55*Agricultura!D55","v":0},{"$f":"B63*Agricultura!$B$84","v":0},{"$f":"Agricultura!$B55*Agricultura!E55","v":0},{"$f":"D63*Agricultura!$B$84","v":0},{"$f":"Agricultura!$B55*Agricultura!F55","v":0},{"$f":"F63*Agricultura!$B$84","v":0},{"$f":"Agricultura!$B55*Agricultura!G55","v":0},{"$f":"H63*Agricultura!$B$84","v":0}]
[{"$f":"Agricultura!A85","v":""},{"$f":"Agricultura!$B56*Agricultura!D56","v":0},{"$f":"B64*Agricultura!$B$85","v":0},{"$f":"Agricultura!$B56*Agricultura!E56","v":0},{"$f":"D64*Agricultura!$B$85","v":0},{"$f":"Agricultura!$B56*Agricultura!F56","v":0},{"$f":"F64*Agricultura!$B$85","v":0},{"$f":"Agricultura!$B56*Agricultura!G56","v":0},{"$f":"H64*Agricultura!$B$85","v":0}]
[{"$f":"Agricultura!A86","v":""},{"$f":"Agricultura!$B57*Agricultura!D57","v":0},{"$f":"B65*Agricultura!$B$86","v":0},{"$f":"Agricultura!$B57*Agricultura!E57","v":0},{"$f":"D65*Agricultura!$B$86","v":0},{"$f":"Agricultura!$B57*Agricultura!F57","v":0},{"$f":"F65*Agricultura!$B$86","v":0},{"$f":"Agricultura!$B57*Agricultura!G57","v":0},{"$f":"H65*Agricultura!$B$86","v":0}]
[{"$f":"Agricultura!A87","v":""},{"$f":"Agricultura!$B58*Agricultura!D58","v":0},{"$f":"B66*Agricultura!$B$87","v":0},{"$f":"Agricultura!$B58*Agricultura!E58","v":0},{"$f":"D66*Agricultura!$B$87","v":0},{"$f":"Agricultura!$B58*Agricultura!F58","v":0},{"$f":"F66*Agricultura!$B$87","v":0},{"$f":"Agricultura!$B58*Agricultura!G58","v":0},{"$f":"H66*Agricultura!$B$87","v":0}]
["Total",null,{"$f":"SUM(C55:C66)","v":0},null,{"$f":"SUM(E55:E66)","v":0},null,{"$f":"SUM(G55:G66)","v":0},null,{"$f":"SUM(I55:I66)","v":0}]
[]
["Produtos Comercializados","Produção"]
[null,"Ano 17",null,"Ano 18",null,"Ano 19",null,"Ano 20"]
[null,"Qtd","Valor","Qtd","Valor","Qtd","Valor","Qtd","Valor"]
[{"$f":"Agricultura!A76","v":""},{"$f":"Agricultura!$B61*Agricultura!D61","v":0},{"$f":"B72*Agricultura!$B$76","v":0},{"$f":"Agricultura!$B61*Agricultura!E61","v":0},{"$f":"D72*Agricultura!$B$76","v":0},{"$f":"Agricultura!$B61*Agricultura!F61","v":0},{"$f":"F72*Agricultura!$B$76","v":0},{"$f":"Agricultura!$B61*Agricultura!G61","v":0},{"$f":"H72*Agricultura!$B$76","v":0}]
[{"$f":"Agricultura!A77","v":""},{"$f":"Agricultura!$B62*Agricultura!D62","v":0},{"$f":"B73*Agricultura!$B$77","v":0},{"$f":"Agricultura!$B62*Agricultura!E62","v":0},{"$f":"D73*Agricultura!$B$77","v":0},{"$f":"Agricultura!$B62*Agricultura!F62","v":0},{"$f":"F73*Agricultura!$B$77","v":0},{"$f":"Agricultura!$B62*Agricultura!G62","v":0},{"$f":"H73*Agricultura!$B$77","v":0}]
[{"$f":"Agricultura!A78","v":""},{"$f":"Agricultura!$B63*Agricultura!D63","v":0},{"$f":"B74*Agricultura!$B$78","v":0},{"$f":"Agricultura!$B63*Agricultura!E63","v":0},{"$f":"D74*Agricultura!$B$78","v":0},{"$f":"Agricultura!$B63*Agricultura!F63","v":0},{"$f":"F74*Agricultura!$B$78","v":0},{"$f":"Agricultura!$B63*Agricultura!G63","v":0},{"$f":"H74*Agricultura!$B$78","v":0}]
[{"$f":"Agricultura!A79","v":""},{"$f":"Agricultura!$B64*Agricultura!D64","v":0},{"$f":"B75*Agricultura!$B$79","v":0},{"$f":"Agricultura!$B64*Agricultura!E64","v":0},{"$f":"D75*Agricultura!$B$79","v":0},{"$f":"Agricultura!$B64*Agricultura!F64","v":0},{"$f":"F75*Agricultura!$B$79","v":0},{"$f":"Agricultura!$B64*Agricultura!G64","v":0},{"$f":"H75*Agricultura!$B$79","v":0}]
[{"$f":"Agricultura!A80","v":""},{"$f":"Agricultura!$B65*Agricultura!D65","v":0},{"$f":"B76*Agricultura!$B$80","v":0},{"$f":"Agricultura!$B65*Agricultura!E65","v":0},{"$f":"D76*Agricultura!$B$80","v":0},{"$f":"Agricultura!$B65*Agricultura!F65","v":0},{"$f":"F76*Agricultura!$B$80","v":0},{"$f":"Agricultura!$B65*Agricultura!G65","v":0},{"$f":"H76*Agricultura!$B$80","v":0}]
[{"$f":"Agricultura!A81","v":""},{"$f":"Agricultura!$B66*Agricultura!D66","v":0},{"$f":"B77*Agricultura!$B$81","v":0},{"$f":"Agricultura!$B66*Agricultura!E66","v":0},{"$f":"D77*Agricultura!$B$81","v":0},{"$f":"Agricultura!$B66*Agricultura!F66","v":0},{"$f":"F77*Agricultura!$B$81","v":0},{"$f":"Agricultura!$B66*Agricultura!G66","v":0},{"$f":"H77*Agricultura!$B$81","v":0}]
[{"$f":"Agricultura!A82","v":""},{"$f":"Agricultura!$B67*Agricultura!D67","v":0},{"$f":"B78*Agricultura!$B$82","v":0},{"$f":"Agricultura!$B67*Agricultura!E67","v":0},{"$f":"D78*Agricultura!$B$82","v":0},{"$f":"Agricultura!$B67*Agricultura!F67","v":0},{"$f":"F78*Agricultura!$B$82","v":0},{"$f":"Agricultura!$B67*Agricultura!G67","v":0},{"$f":"H78*Agricultura!$B$82","v":0}]
[{"$f":"Agricultura!A83","v":""},{"$f":"Agricultura!$B68*Agricultura!D68","v":0},{"$f":"B79*Agricultura!$B$83","v":0},{"$f":"Agricultura!$B68*Agricultura!E68","v":0},{"$f":"D79*Agricultura!$B$83","v":0},{"$f":"Agricultura!$B68*Agricultura!F68","v":0},{"$f":"F79*Agricultura!$B$83","v":0},{"$f":"Agricultura!$B68*Agricultura!G68","v":0},{"$f":"H79*Agricultura!$B$83","v":0}]
[{"$f":"Agricultura!A84","v":""},{"$f":"Agricultura!$B69*Agricultura!D69","v":0},{"$f":"B80*Agricultura!$B$84","v":0},{"$f":"Agricultura!$B69*Agricultura!E69","v":0},{"$f":"D80*Agricultura!$B$84","v":0},{"$f":"Agricultura!$B69*Agricultura!F69","v":0},{"$f":"F80*Agricultura!$B$84","v":0},{"$f":"Agricultura!$B69*Agricultura!G69","v":0},{"$f":"H80*Agricultura!$B$84","v":0}]
[{"$f":"Agricultura!A85","v":""},{"$f":"Agricultura!$B70*Agricultura!D70","v":0},{"$f":"B81*Agricultura!$B$85","v":0},{"$f":"Agricultura!$B70*Agricultura!E70","v":0},{"$f":"D81*Agricultura!$B$85","v":0},{"$f":"Agricultura!$B70*Agricultura!F70","v":0},{"$f":"F81*Agricultura!$B$85","v":0},{"$f":"Agricultura!$B70*Agricultura!G70","v":0},{"$f":"H81*Agricultura!$B$85","v":0}]
[{"$f":"Agricultura!A86","v":""},{"$f":"Agricultura!$B71*Agricultura!D71","v":0},{"$f":"B82*Agricultura!$B$86","v":0},{"$f":"Agricultura!$B71*Agricultura!E71","v":0},{"$f":"D82*Agricultura!$B$86","v":0},{"$f":"Agricultura!$B71*Agricultura!F71","v":0},{"$f":"F82*Agricultura!$B$86","v":0},{"$f":"Agricultura!$B71*Agricultura!G71","v":0},{"$f":"H82*Agricultura!$B$86","v":0}]
[{"$f":"Agricultura!A87","v":""},{"$f":"Agricultura!$B72*Agricultura!D72","v":0},{"$f":"B83*Agricultura!$B$87","v":0},{"$f":"Agricultura!$B72*Agricultura!E72","v":0},{"$f":"D83*Agricultura!$B$87","v":0},{"$f":"Agricultura!$B72*Agricultura!F72","v":0},{"$f":"F83*Agricultura!$B$87","v":0},{"$f":"Agricultura!$B72*Agricultura!G72","v":0},{"$f":"H83*Agricultura!$B$87","v":0}]
["Total",null,{"$f":"SUM(C72:C83)","v":0},null,{"$f":"SUM(E72:E83)","v":0},null,{"$f":"SUM(G72:G83)","v":0},null,{"$f":"SUM(I72:I83)","v":0}]
[]
["Especificação","Custo Operacional - Despesas não Financiadas"]
[null,"Ano 1","Ano 2","Ano 3","Ano 4","Ano 5","Ano 6","Ano 7","Ano 8"]
["Insumos ",{"$f":"SUM(IF(Agricultura!G94=1,Agricultura!F98,0)+IF(Agricultura!G100=1,Agricultura!F111,0)+IF(Agricultura!G113=1,SUM(Agricultura!F117),0))","v":0},{"$f":"SUM(IF(Agricultura!$G$94<=2,Agricultura!$F$98,0)+IF(Agricultura!$G$100<=2,Agricultura!$F$111,0)+IF(Agricultura!$G$113<=2,Agricultura!$F$117,0))","v":0},{"$f":"SUM(IF(Agricultura!$G$94<=3,Agricultura!$F$98,0)+IF(Agricultura!$G$100<=3,Agricultura!$F$111,0)+IF(Agricultura!$G$113<=3,Agricultura!$F$117,0))","v":0},{"$f":"SUM(IF(Agricultura!$G$94<=4,Agricultura!$F$98,0)+IF(Agricultura!$G$100<=4,Agricultura!$F$111,0)+IF(Agricultura!$G$113<=4,Agricultura!$F$117,0))","v":0},{"$f":"SUM(IF(Agricultura!$G$94<=5,Agricultura!$F$98,0)+IF(Agricultura!$G$100<=5,Agricultura!$F$111,0)+IF(Agricultura!$G$113<=5,Agricultura!$F$117,0))","v":0},{"$f":"SUM(IF(Agricultura!$G$94<=6,Agricultura!$F$98,0)+IF(Agricultura!$G$100<=6,Agricultura!$F$111,0)+IF(Agricultura!$G$113<=6,Agricultura!$F$117,0))","v":0},{"$f":"SUM(IF(Agricultura!$G$94<=7,Agricultura!$F$98,0)+IF(Agricultura!$G$100<=7,Agricultura!$F$111,0)+IF(Agricultura!$G$113<=7,Agricultura!$F$117,0))","v":0},{"$f":"SUM(IF(Agricultura!$G$94<=8,Agricultura!$F$98,0)+IF(Agricultura!$G$100<=8,Agricultura!$F$111,0)+IF(Agricultura!$G$113<=8,Agricultura!$F$117,0))","v":0}]
["Serviços",{"$f":"SUM(IF(Agricultura!G120=1,Agricultura!F124,0)+IF(Agricultura!G126=1,Agricultura!F137,0)+IF(Agricultura!G139=1,Agricultura!F143,0))","v":0},{"$f":"SUM(IF(Agricultura!G120<=2,Agricultura!F124,0)+IF(Agricultura!G126<=2,Agricultura!F137,0)+IF(Agricultura!G139<=2,Agricultura!F143,0))","v":0},{"$f":"SUM(IF(Agricultura!G120<=3,Agricultura!F124,0)+IF(Agricultura!G126<=3,Agricultura!F137,0)+IF(Agricultura!G139<=3,Agricultura!F143,0))","v":0},{"$f":"SUM(IF(Agricultura!$G$120<=4,Agricultura!$F$124,0)+IF(Agricultura!$G$126<=4,Agricultura!$F$137,0)+IF(Agricultura!$G$139<=4,Agricultura!$F$143,0))","v":0},{"$f":"SUM(IF(Agricultura!$G$120<=5,Agricultura!$F$124,0)+IF(Agricultura!$G$126<=5,Agricultura!$F$137,0)+IF(Agricultura!$G$139<=5,Agricultura!$F$143,0))","v":0},{"$f":"SUM(IF(Agricultura!$G$120<=6,Agricultura!$F$124,0)+IF(Agricultura!$G$126<=6,Agricultura!$F$137,0)+IF(Agricultura!$G$139<=6,Agricultura!$F$143,0))","v":0},{"$f":"SUM(IF(Agricultura!$G$120<=7,Agricultura!$F$124,0)+IF(Agricultura!$G$126<=7,Agricultura!$F$137,0)+IF(Agricultura!$G$139<=7,Agricultura!$F$143,0))","v":0},{"$f":"SUM(IF(Agricultura!$G$120<=8,Agricultura!$F$124,0)+IF(Agricultura!$G$126<=8,Agricultura!$F$137,0)+IF(Agricultura!$G$139<=8,Agricultura!$F$143,0))","v":0}]
["Outros Desembolsos",{"$f":"IF(Agricultura!G145=1,Agricultura!F149,0)","v":0},{"$f":"IF(Agricultura!$G$145<=2,Agricultura!$F$149,0)","v":0},{"$f":"IF(Agricultura!$G$145<=3,Agricultura!$F$149,0)","v":0},{"$f":"IF(Agricultura!$G$145<=4,Agricultura!$F$149,0)","v":0},{"$f":"IF(Agricultura!$G$145<=5,Agricultura!$F$149,0)","v":0},{"$f":"IF(Agricultura!$G$145<=6,Agricultura!$F$149,0)","v":0},{"$f":"IF(Agricultura!$G$145<=7,Agricultura!$F$149,0)","v":0},{"$f":"IF(Agricultura!$G$145<=8,Agricultura!$F$149,0)","v":0}]
["Total",{"$f":"SUM(B88:B90)","v":0},{"$f":"SUM(C88:C90)","v":0},0,0,0,0,0,0]
[]
["Especificação","Custo Operacional - Despesas não Financiadas"]
[null,"Ano 9","Ano 10","Ano 11","Ano 12","Ano 13","Ano 14","Ano 15","Ano 16"]
["Insumos ",{"$f":"SUM(IF(Agricultura!$G$94<=9,Agricultura!$F$98,0)+IF(Agricultura!$G$100<=9,Agricultura!$F$111,0)+IF(Agricultura!$G$113<=9,Agricultura!$F$117,0))","v":0},{"$f":"SUM(IF(Agricultura!$G$94<=10,Agricultura!$F$98,0)+IF(Agricultura!$G$100<=10,Agricultura!$F$111,0)+IF(Agricultura!$G$113<=10,Agricultura!$F$117,0))","v":0},{"$f":"SUM(IF(Agricultura!$G$94<=11,Agricultura!$F$98,0)+IF(Agricultura!$G$100<=11,Agricultura!$F$111,0)+IF(Agricultura!$G$113<=11,Agricultura!$F$117,0))","v":0},{"$f":"SUM(IF(Agricultura!$G$94<=12,Agricultura!$F$98,0)+IF(Agricultura!$G$100<=12,Agricultura!$F$111,0)+IF(Agricultura!$G$113<=12,Agricultura!$F$117,0))","v":0},{"$f":"SUM(IF(Agricultura!$G$94<=13,Agricultura!$F$98,0)+IF(Agricultura!$G$100<=13,Agricultura!$F$111,0)+IF(Agricultura!$G$113<=13,Agricultura!$F$117,0))","v":0},{"$f":"SUM(IF(Agricultura!$G$94<=14,Agricultura!$F$98,0)+IF(Agricultura!$G$100<=14,Agricultura!$F$111,0)+IF(Agricultura!$G$113<=14,Agricultura!$F$117,0))","v":0},{"$f":"SUM(IF(Agricultura!$G$94<=15,Agricultura!$F$98,0)+IF(Agricultura!$G$100<=15,Agricultura!$F$111,0)+IF(Agricultura!$G$113<=15,Agricultura!$F$117,0))","v":0},{"$f":"SUM(IF(Agricultura!$G$94<=16,Agricultura!$F$98,0)+IF(Agricultura!$G$100<=16,Agricultura!$F$111,0)+IF(Agricultura!$G$113<=16,Agricultura!$F$117,0))","v":0}]
["Serviços",{"$f":"SUM(IF(Agricultura!$G$120<=9,Agricultura!$F$124,0)+IF(Agricultura!$G$126<=9,Agricultura!$F$137,0)+IF(Agricultura!$G$139<=9,Agricultura!$F$143,0))","v":0},{"$f":"SUM(IF(Agricultura!$G$120<=10,Agricultura!$F$124,0)+IF(Agricultura!$G$126<=10,Agricultura!$F$137,0)+IF(Agricultura!$G$139<=10,Agricultura!$F$143,0))","v":0},{"$f":"SUM(IF(Agricultura!$G$120<=11,Agricultura!$F$124,0)+IF(Agricultura!$G$126<=11,Agricultura!$F$137,0)+IF(Agricultura!$G$139<=11,Agricultura!$F$143,0))","v":0},{"$f":"SUM(IF(Agricultura!$G$120<=12,Agricultura!$F$124,0)+IF(Agricultura!$G$126<=12,Agricultura!$F$137,0)+IF(Agricultura!$G$139<=12,Agricultura!$F$143,0))","v":0},{"$f":"SUM(IF(Agricultura!$G$120<=13,Agricultura!$F$124,0)+IF(Agricultura!$G$126<=13,Agricultura!$F$137,0)+IF(Agricultura!$G$139<=13,Agricultura!$F$143,0))","v":0},{"$f":"SUM(IF(Agricultura!$G$120<=14,Agricultura!$F$124,0)+IF(Agricultura!$G$126<=14,Agricultura!$F$137,0)+IF(Agricultura!$G$139<=14,Agricultura!$F$143,0))","v":0},{"$f":"SUM(IF(Agricultura!$G$120<=15,Agricultura!$F$124,0)+IF(Agricultura!$G$126<=15,Agricultura!$F$137,0)+IF(Agricultura!$G$139<=15,Agricultura!$F$143,0))","v":0},{"$f":"SUM(IF(Agricultura!$G$120<=16,Agricultura!$F$124,0)+IF(Agricultura!$G$126<=16,Agricultura!$F$137,0)+IF(Agricultura!$G$139<=16,Agricultura!$F$143,0))","v":0}]
["Outros Desembolsos",{"$f":"IF(Agricultura!$G$145<=9,Agricultura!$F$149,0)","v":0},{"$f":"IF(Agricultura!$G$145<=10,Agricultura!$F$149,0)","v":0},{"$f":"IF(Agricultura!$G$145<=11,Agricultura!$F$149,0)","v":0},{"$f":"IF(Agricultura!$G$145<=12,Agricultura!$F$149,0)","v":0},{"$f":"IF(Agricultura!$G$145<=13,Agricultura!$F$149,0)","v":0},{"$f":"IF(Agricultura!$G$145<=14,Agricultura!$F$149,0)","v":0},{"$f":"IF(Agricultura!$G$145<=15,Agricultura!$F$149,0)","v":0},{"$f":"IF(Agricultura!$G$145<=16,Agricultura!$F$149,0)","v":0}]
["Total",{"$f":"SUM(B95:B97)","v":0},{"$f":"SUM(C95:C97)","v":0},{"$f":"SUM(D95:D97)","v":0},{"$f":"SUM(E95:E97)","v":0},{"$f":"SUM(F95:F97)","v":0},0,0,0]
[]
["Especificação","Custo Operacional - Despesas não Financiadas"]
[null,"Ano 17","Ano 18","Ano 19","Ano 20"]
["Insumos ",{"$f":"SUM(IF(Agricultura!$G$94<=17,Agricultura!$F$98,0)+IF(Agricultura!$G$100<=17,Agricultura!$F$111,0)+IF(Agricultura!$G$113<=17,Agricultura!$F$117,0))","v":0},{"$f":"SUM(IF(Agricultura!$G$94<=18,Agricultura!$F$98,0)+IF(Agricultura!$G$100<=18,Agricultura!$F$111,0)+IF(Agricultura!$G$113<=18,Agricultura!$F$117,0))","v":0},{"$f":"SUM(IF(Agricultura!$G$94<=19,Agricultura!$F$98,0)+IF(Agricultura!$G$100<=19,Agricultura!$F$111,0)+IF(Agricultura!$G$113<=19,Agricultura!$F$117,0))","v":0},{"$f":"SUM(IF(Agricultura!$G$94<=20,Agricultura!$F$98,0)+IF(Agricultura!$G$100<=20,Agricultura!$F$111,0)+IF(Agricultura!$G$113<=20,Agricultura!$F$117,0))","v":0}]
["Serviços",{"$f":"SUM(IF(Agricultura!$G$120<=17,Agricultura!$F$124,0)+IF(Agricultura!$G$126<=17,Agricultura!$F$137,0)+IF(Agricultura!$G$139<=17,Agricultura!$F$143,0))","v":0},{"$f":"SUM(IF(Agricultura!$G$120<=18,Agricultura!$F$124,0)+IF(Agricultura!$G$126<=18,Agricultura!$F$137,0)+IF(Agricultura!$G$139<=18,Agricultura!$F$143,0))","v":0},{"$f":"SUM(IF(Agricultura!$G$120<=19,Agricultura!$F$124,0)+IF(Agricultura!$G$126<=19,Agricultura!$F$137,0)+IF(Agricultura!$G$139<=19,Agricultura!$F$143,0))","v":0},{"$f":"SUM(IF(Agricultura!$G$120<=20,Agricultura!$F$124,0)+IF(Agricultura!$G$126<=20,Agricultura!$F$137,0)+IF(Agricultura!$G$139<=20,Agricultura!$F$143,0))","v":0}]
["Outros Desembolsos",{"$f":"IF(Agricultura!$G$145<=17,Agricultura!$F$149,0)","v":0},{"$f":"IF(Agricultura!$G$145<=18,Agricultura!$F$149,0)","v":0},{"$f":"IF(Agricultura!$G$145<=19,Agricultura!$F$149,0)","v":0},{"$f":"IF(Agricultura!$G$145<=20,Agricultura!$F$149,0)","v":0}]
["Total",{"$f":"SUM(B102:B104)","v":0},{"$f":"SUM(C102:C104)","v":0},{"$f":"SUM(D102:D104)","v":0},{"$f":"SUM(E102:E104)","v":0}]

{"sheet":"Mem piscicultura-apicultura","index":17,"n_rows":61,"n_cols":9,"rows_kept":61,"cut":false,"hidden":true,"merged":[[48,0,49,0],[48,1,48,8],[55,0,56,0],[55,1,55,8],[32,0,34,0],[32,1,32,8],[33,1,33,2],[33,3,33,4],[33,5,33,6],[33,7,33,8],[16,0,18,0],[16,1,16,8],[17,1,17,2],[17,3,17,4],[17,5,17,6],[17,7,17,8],[0,0,2,0],[0,1,0,8],[1,1,1,2],[1,3,1,4],[1,5,1,6],[1,7,1,8]]}
["Produtos Comercializados","Produção"]
[null,"Ano 1",null,"Ano 2",null,"Ano 3",null,"Ano 4"]
[null,"Qtd","Valor","Qtd","Valor","Qtd","Valor","Qtd","Valor"]
[{"$f":"'Piscicultura-Apicultura'!A45","v":""},{"$f":"'Piscicultura-Apicultura'!B5*'Piscicultura-Apicultura'!D5","v":0},{"$f":"B4*'Piscicultura-Apicultura'!B45","v":0},{"$f":"'Piscicultura-Apicultura'!B5*'Piscicultura-Apicultura'!E5","v":0},{"$f":"D4*'Piscicultura-Apicultura'!B45","v":0},{"$f":"'Piscicultura-Apicultura'!B5*'Piscicultura-Apicultura'!F5","v":0},{"$f":"F4*'Piscicultura-Apicultura'!B45","v":0},{"$f":"'Piscicultura-Apicultura'!B5*'Piscicultura-Apicultura'!G5","v":0},{"$f":"H4*'Piscicultura-Apicultura'!B45","v":0}]
[{"$f":"'Piscicultura-Apicultura'!A46","v":""},{"$f":"'Piscicultura-Apicultura'!B6*'Piscicultura-Apicultura'!D6","v":0},{"$f":"B5*'Piscicultura-Apicultura'!B46","v":0},{"$f":"'Piscicultura-Apicultura'!B6*'Piscicultura-Apicultura'!E6","v":0},{"$f":"D5*'Piscicultura-Apicultura'!B46","v":0},{"$f":"'Piscicultura-Apicultura'!B6*'Piscicultura-Apicultura'!F6","v":0},{"$f":"F5*'Piscicultura-Apicultura'!B46","v":0},{"$f":"'Piscicultura-Apicultura'!B6*'Piscicultura-Apicultura'!G6","v":0},{"$f":"H5*'Piscicultura-Apicultura'!B46","v":0}]
[{"$f":"'Piscicultura-Apicultura'!A47","v":""},{"$f":"'Piscicultura-Apicultura'!B7*'Piscicultura-Apicultura'!D7","v":0},{"$f":"B6*'Piscicultura-Apicultura'!B47","v":0},{"$f":"'Piscicultura-Apicultura'!B7*'Piscicultura-Apicultura'!E7","v":0},{"$f":"D6*'Piscicultura-Apicultura'!B47","v":0},{"$f":"'Piscicultura-Apicultura'!B7*'Piscicultura-Apicultura'!F7","v":0},{"$f":"F6*'Piscicultura-Apicultura'!B47","v":0},{"$f":"'Piscicultura-Apicultura'!B7*'Piscicultura-Apicultura'!G7","v":0},{"$f":"H6*'Piscicultura-Apicultura'!B47","v":0}]
[{"$f":"'Piscicultura-Apicultura'!A48","v":""},{"$f":"'Piscicultura-Apicultura'!B8*'Piscicultura-Apicultura'!D8","v":0},{"$f":"B7*'Piscicultura-Apicultura'!B48","v":0},{"$f":"'Piscicultura-Apicultura'!B8*'Piscicultura-Apicultura'!E8","v":0},{"$f":"D7*'Piscicultura-Apicultura'!B48","v":0},{"$f":"'Piscicultura-Apicultura'!B8*'Piscicultura-Apicultura'!F8","v":0},{"$f":"F7*'Piscicultura-Apicultura'!B48","v":0},{"$f":"'Piscicultura-Apicultura'!B8*'Piscicultura-Apicultura'!G8","v":0},{"$f":"H7*'Piscicultura-Apicultura'!B48","v":0}]
[{"$f":"'Piscicultura-Apicultura'!A49","v":""},{"$f":"'Piscicultura-Apicultura'!B9*'Piscicultura-Apicultura'!D9","v":0},{"$f":"B8*'Piscicultura-Apicultura'!B49","v":0},{"$f":"'Piscicultura-Apicultura'!B9*'Piscicultura-Apicultura'!E9","v":0},{"$f":"D8*'Piscicultura-Apicultura'!B49","v":0},{"$f":"'Piscicultura-Apicultura'!B9*'Piscicultura-Apicultura'!F9","v":0},{"$f":"F8*'Piscicultura-Apicultura'!B49","v":0},{"$f":"'Piscicultura-Apicultura'!B9*'Piscicultura-Apicultura'!G9","v":0},{"$f":"H8*'Piscicultura-Apicultura'!B49","v":0}]
[{"$f":"'Piscicultura-Apicultura'!A50","v":""},{"$f":"'Piscicultura-Apicultura'!B10*'Piscicultura-Apicultura'!D10","v":0},{"$f":"B9*'Piscicultura-Apicultura'!B50","v":0},{"$f":"'Piscicultura-Apicultura'!B10*'Piscicultura-Apicultura'!E10","v":0},{"$f":"D9*'Piscicultura-Apicultura'!B50","v":0},{"$f":"'Piscicultura-Apicultura'!B10*'Piscicultura-Apicultura'!F10","v":0},{"$f":"F9*'Piscicultura-Apicultura'!B50","v":0},{"$f":"'Piscicultura-Apicultura'!B10*'Piscicultura-Apicultura'!G10","v":0},{"$f":"H9*'Piscicultura-Apicultura'!B50","v":0}]
[{"$f":"'Piscicultura-Apicultura'!A51","v":""},{"$f":"'Piscicultura-Apicultura'!B11*'Piscicultura-Apicultura'!D11","v":0},{"$f":"B10*'Piscicultura-Apicultura'!B51","v":0},{"$f":"'Piscicultura-Apicultura'!B11*'Piscicultura-Apicultura'!E11","v":0},{"$f":"D10*'Piscicultura-Apicultura'!B51","v":0},{"$f":"'Piscicultura-Apicultura'!B11*'Piscicultura-Apicultura'!F11","v":0},{"$f":"F10*'Piscicultura-Apicultura'!B51","v":0},{"$f":"'Piscicultura-Apicultura'!B11*'Piscicultura-Apicultura'!G11","v":0},{"$f":"H10*'Piscicultura-Apicultura'!B51","v":0}]
[{"$f":"'Piscicultura-Apicultura'!A52","v":""},{"$f":"'Piscicultura-Apicultura'!B12*'Piscicultura-Apicultura'!D12","v":0},{"$f":"B11*'Piscicultura-Apicultura'!B52","v":0},{"$f":"'Piscicultura-Apicultura'!B12*'Piscicultura-Apicultura'!E12","v":0},{"$f":"D11*'Piscicultura-Apicultura'!B52","v":0},{"$f":"'Piscicultura-Apicultura'!B12*'Piscicultura-Apicultura'!F12","v":0},{"$f":"F11*'Piscicultura-Apicultura'!B52","v":0},{"$f":"'Piscicultura-Apicultura'!B12*'Piscicultura-Apicultura'!G12","v":0},{"$f":"H11*'Piscicultura-Apicultura'!B52","v":0}]
[{"$f":"'Piscicultura-Apicultura'!A53","v":""},{"$f":"'Piscicultura-Apicultura'!B13*'Piscicultura-Apicultura'!D13","v":0},{"$f":"B12*'Piscicultura-Apicultura'!B53","v":0},{"$f":"'Piscicultura-Apicultura'!B13*'Piscicultura-Apicultura'!E13","v":0},{"$f":"D12*'Piscicultura-Apicultura'!B53","v":0},{"$f":"'Piscicultura-Apicultura'!B13*'Piscicultura-Apicultura'!F13","v":0},{"$f":"F12*'Piscicultura-Apicultura'!B53","v":0},{"$f":"'Piscicultura-Apicultura'!B13*'Piscicultura-Apicultura'!G13","v":0},{"$f":"H12*'Piscicultura-Apicultura'!B53","v":0}]
[{"$f":"'Piscicultura-Apicultura'!A54","v":""},{"$f":"'Piscicultura-Apicultura'!B14*'Piscicultura-Apicultura'!D14","v":0},{"$f":"B13*'Piscicultura-Apicultura'!B54","v":0},{"$f":"'Piscicultura-Apicultura'!B14*'Piscicultura-Apicultura'!E14","v":0},{"$f":"D13*'Piscicultura-Apicultura'!B54","v":0},{"$f":"'Piscicultura-Apicultura'!B14*'Piscicultura-Apicultura'!F14","v":0},{"$f":"F13*'Piscicultura-Apicultura'!B54","v":0},{"$f":"'Piscicultura-Apicultura'!B14*'Piscicultura-Apicultura'!G14","v":0},{"$f":"H13*'Piscicultura-Apicultura'!B54","v":0}]
[{"$f":"'Piscicultura-Apicultura'!A55","v":""},{"$f":"'Piscicultura-Apicultura'!B15*'Piscicultura-Apicultura'!D15","v":0},{"$f":"B14*'Piscicultura-Apicultura'!B55","v":0},{"$f":"'Piscicultura-Apicultura'!B15*'Piscicultura-Apicultura'!E15","v":0},{"$f":"D14*'Piscicultura-Apicultura'!B55","v":0},{"$f":"'Piscicultura-Apicultura'!B15*'Piscicultura-Apicultura'!F15","v":0},{"$f":"F14*'Piscicultura-Apicultura'!B55","v":0},{"$f":"'Piscicultura-Apicultura'!B15*'Piscicultura-Apicultura'!G15","v":0},{"$f":"H14*'Piscicultura-Apicultura'!B55","v":0}]
["Total",null,{"$f":"SUM(C4:C14)","v":0},null,{"$f":"SUM(E4:E14)","v":0},null,{"$f":"SUM(G4:G14)","v":0},null,{"$f":"SUM(I4:I14)","v":0}]
[]
["Produtos Comercializados","Produção"]
[null,"Ano 5",null,"Ano 6",null,"Ano 7",null,"Ano 8"]
[null,"Qtd","Valor","Qtd","Valor","Qtd","Valor","Qtd","Valor"]
[{"$f":"'Piscicultura-Apicultura'!A45","v":""},{"$f":"'Piscicultura-Apicultura'!B18*'Piscicultura-Apicultura'!D18","v":0},{"$f":"B20*'Piscicultura-Apicultura'!B45","v":0},{"$f":"'Piscicultura-Apicultura'!B18*'Piscicultura-Apicultura'!E18","v":0},{"$f":"D20*'Piscicultura-Apicultura'!B45","v":0},{"$f":"'Piscicultura-Apicultura'!B18*'Piscicultura-Apicultura'!F18","v":0},{"$f":"F20*'Piscicultura-Apicultura'!B45","v":0},{"$f":"'Piscicultura-Apicultura'!B18*'Piscicultura-Apicultura'!G18","v":0},{"$f":"H20*'Piscicultura-Apicultura'!B45","v":0}]
[{"$f":"'Piscicultura-Apicultura'!A46","v":""},{"$f":"'Piscicultura-Apicultura'!B19*'Piscicultura-Apicultura'!D19","v":0},{"$f":"B21*'Piscicultura-Apicultura'!B46","v":0},{"$f":"'Piscicultura-Apicultura'!B19*'Piscicultura-Apicultura'!E19","v":0},{"$f":"D21*'Piscicultura-Apicultura'!B46","v":0},{"$f":"'Piscicultura-Apicultura'!B19*'Piscicultura-Apicultura'!F19","v":0},{"$f":"F21*'Piscicultura-Apicultura'!B46","v":0},{"$f":"'Piscicultura-Apicultura'!B19*'Piscicultura-Apicultura'!G19","v":0},{"$f":"H21*'Piscicultura-Apicultura'!B46","v":0}]
[{"$f":"'Piscicultura-Apicultura'!A47","v":""},{"$f":"'Piscicultura-Apicultura'!B20*'Piscicultura-Apicultura'!D20","v":0},{"$f":"B22*'Piscicultura-Apicultura'!B47","v":0},{"$f":"'Piscicultura-Apicultura'!B20*'Piscicultura-Apicultura'!E20","v":0},{"$f":"D22*'Piscicultura-Apicultura'!B47","v":0},{"$f":"'Piscicultura-Apicultura'!B20*'Piscicultura-Apicultura'!F20","v":0},{"$f":"F22*'Piscicultura-Apicultura'!B47","v":0},{"$f":"'Piscicultura-Apicultura'!B20*'Piscicultura-Apicultura'!G20","v":0},{"$f":"H22*'Piscicultura-Apicultura'!B47","v":0}]
[{"$f":"'Piscicultura-Apicultura'!A48","v":""},{"$f":"'Piscicultura-Apicultura'!B21*'Piscicultura-Apicultura'!D21","v":0},{"$f":"B23*'Piscicultura-Apicultura'!B48","v":0},{"$f":"'Piscicultura-Apicultura'!B21*'Piscicultura-Apicultura'!E21","v":0},{"$f":"D23*'Piscicultura-Apicultura'!B48","v":0},{"$f":"'Piscicultura-Apicultura'!B21*'Piscicultura-Apicultura'!F21","v":0},{"$f":"F23*'Piscicultura-Apicultura'!B48","v":0},{"$f":"'Piscicultura-Apicultura'!B21*'Piscicultura-Apicultura'!G21","v":0},{"$f":"H23*'Piscicultura-Apicultura'!B48","v":0}]
[{"$f":"'Piscicultura-Apicultura'!A49","v":""},{"$f":"'Piscicultura-Apicultura'!B22*'Piscicultura-Apicultura'!D22","v":0},{"$f":"B24*'Piscicultura-Apicultura'!B49","v":0},{"$f":"'Piscicultura-Apicultura'!B22*'Piscicultura-Apicultura'!E22","v":0},{"$f":"D24*'Piscicultura-Apicultura'!B49","v":0},{"$f":"'Piscicultura-Apicultura'!B22*'Piscicultura-Apicultura'!F22","v":0},{"$f":"F24*'Piscicultura-Apicultura'!B49","v":0},{"$f":"'Piscicultura-Apicultura'!B22*'Piscicultura-Apicultura'!G22","v":0},{"$f":"H24*'Piscicultura-Apicultura'!B49","v":0}]
[{"$f":"'Piscicultura-Apicultura'!A50","v":""},{"$f":"'Piscicultura-Apicultura'!B23*'Piscicultura-Apicultura'!D23","v":0},{"$f":"B25*'Piscicultura-Apicultura'!B50","v":0},{"$f":"'Piscicultura-Apicultura'!B23*'Piscicultura-Apicultura'!E23","v":0},{"$f":"D25*'Piscicultura-Apicultura'!B50","v":0},{"$f":"'Piscicultura-Apicultura'!B23*'Piscicultura-Apicultura'!F23","v":0},{"$f":"F25*'Piscicultura-Apicultura'!B50","v":0},{"$f":"'Piscicultura-Apicultura'!B23*'Piscicultura-Apicultura'!G23","v":0},{"$f":"H25*'Piscicultura-Apicultura'!B50","v":0}]
[{"$f":"'Piscicultura-Apicultura'!A51","v":""},{"$f":"'Piscicultura-Apicultura'!B24*'Piscicultura-Apicultura'!D24","v":0},{"$f":"B26*'Piscicultura-Apicultura'!B51","v":0},{"$f":"'Piscicultura-Apicultura'!B24*'Piscicultura-Apicultura'!E24","v":0},{"$f":"D26*'Piscicultura-Apicultura'!B51","v":0},{"$f":"'Piscicultura-Apicultura'!B24*'Piscicultura-Apicultura'!F24","v":0},{"$f":"F26*'Piscicultura-Apicultura'!B51","v":0},{"$f":"'Piscicultura-Apicultura'!B24*'Piscicultura-Apicultura'!G24","v":0},{"$f":"H26*'Piscicultura-Apicultura'!B51","v":0}]
[{"$f":"'Piscicultura-Apicultura'!A52","v":""},{"$f":"'Piscicultura-Apicultura'!B25*'Piscicultura-Apicultura'!D25","v":0},{"$f":"B27*'Piscicultura-Apicultura'!B52","v":0},{"$f":"'Piscicultura-Apicultura'!B25*'Piscicultura-Apicultura'!E25","v":0},{"$f":"D27*'Piscicultura-Apicultura'!B52","v":0},{"$f":"'Piscicultura-Apicultura'!B25*'Piscicultura-Apicultura'!F25","v":0},{"$f":"F27*'Piscicultura-Apicultura'!B52","v":0},{"$f":"'Piscicultura-Apicultura'!B25*'Piscicultura-Apicultura'!G25","v":0},{"$f":"H27*'Piscicultura-Apicultura'!B52","v":0}]
[{"$f":"'Piscicultura-Apicultura'!A53","v":""},{"$f":"'Piscicultura-Apicultura'!B26*'Piscicultura-Apicultura'!D26","v":0},{"$f":"B28*'Piscicultura-Apicultura'!B53","v":0},{"$f":"'Piscicultura-Apicultura'!B26*'Piscicultura-Apicultura'!E26","v":0},{"$f":"D28*'Piscicultura-Apicultura'!B53","v":0},{"$f":"'Piscicultura-Apicultura'!B26*'Piscicultura-Apicultura'!F26","v":0},{"$f":"F28*'Piscicultura-Apicultura'!B53","v":0},{"$f":"'Piscicultura-Apicultura'!B26*'Piscicultura-Apicultura'!G26","v":0},{"$f":"H28*'Piscicultura-Apicultura'!B53","v":0}]
[{"$f":"'Piscicultura-Apicultura'!A54","v":""},{"$f":"'Piscicultura-Apicultura'!B27*'Piscicultura-Apicultura'!D27","v":0},{"$f":"B29*'Piscicultura-Apicultura'!B54","v":0},{"$f":"'Piscicultura-Apicultura'!B27*'Piscicultura-Apicultura'!E27","v":0},{"$f":"D29*'Piscicultura-Apicultura'!B54","v":0},{"$f":"'Piscicultura-Apicultura'!B27*'Piscicultura-Apicultura'!F27","v":0},{"$f":"F29*'Piscicultura-Apicultura'!B54","v":0},{"$f":"'Piscicultura-Apicultura'!B27*'Piscicultura-Apicultura'!G27","v":0},{"$f":"H29*'Piscicultura-Apicultura'!B54","v":0}]
[{"$f":"'Piscicultura-Apicultura'!A55","v":""},{"$f":"'Piscicultura-Apicultura'!B28*'Piscicultura-Apicultura'!D28","v":0},{"$f":"B30*'Piscicultura-Apicultura'!B55","v":0},{"$f":"'Piscicultura-Apicultura'!B28*'Piscicultura-Apicultura'!E28","v":0},{"$f":"D30*'Piscicultura-Apicultura'!B55","v":0},{"$f":"'Piscicultura-Apicultura'!B28*'Piscicultura-Apicultura'!F28","v":0},{"$f":"F30*'Piscicultura-Apicultura'!B55","v":0},{"$f":"'Piscicultura-Apicultura'!B28*'Piscicultura-Apicultura'!G28","v":0},{"$f":"H30*'Piscicultura-Apicultura'!B55","v":0}]
["Total",null,{"$f":"SUM(C20:C30)","v":0},null,{"$f":"SUM(E20:E30)","v":0},null,{"$f":"SUM(G20:G30)","v":0},null,{"$f":"SUM(I20:I30)","v":0}]
[]
["Produtos Comercializados","Produção"]
[null,"Ano 9",null,"Ano 10",null,"Ano 11",null,"Ano 12"]
[null,"Qtd","Valor","Qtd","Valor","Qtd","Valor","Qtd","Valor"]
[{"$f":"'Piscicultura-Apicultura'!A45","v":""},{"$f":"'Piscicultura-Apicultura'!B31*'Piscicultura-Apicultura'!D31","v":0},{"$f":"B36*'Piscicultura-Apicultura'!B45","v":0},{"$f":"'Piscicultura-Apicultura'!B31*'Piscicultura-Apicultura'!E31","v":0},{"$f":"D36*'Piscicultura-Apicultura'!B45","v":0},{"$f":"'Piscicultura-Apicultura'!B31*'Piscicultura-Apicultura'!F31","v":0},{"$f":"F36*'Piscicultura-Apicultura'!B45","v":0},{"$f":"'Piscicultura-Apicultura'!B31*'Piscicultura-Apicultura'!G31","v":0},{"$f":"H36*'Piscicultura-Apicultura'!B45","v":0}]
[{"$f":"'Piscicultura-Apicultura'!A46","v":""},{"$f":"'Piscicultura-Apicultura'!B32*'Piscicultura-Apicultura'!D32","v":0},{"$f":"B37*'Piscicultura-Apicultura'!B46","v":0},{"$f":"'Piscicultura-Apicultura'!B32*'Piscicultura-Apicultura'!E32","v":0},{"$f":"D37*'Piscicultura-Apicultura'!B46","v":0},{"$f":"'Piscicultura-Apicultura'!B32*'Piscicultura-Apicultura'!F32","v":0},{"$f":"F37*'Piscicultura-Apicultura'!B46","v":0},{"$f":"'Piscicultura-Apicultura'!B32*'Piscicultura-Apicultura'!G32","v":0},{"$f":"H37*'Piscicultura-Apicultura'!B46","v":0}]
[{"$f":"'Piscicultura-Apicultura'!A47","v":""},{"$f":"'Piscicultura-Apicultura'!B33*'Piscicultura-Apicultura'!D33","v":0},{"$f":"B38*'Piscicultura-Apicultura'!B47","v":0},{"$f":"'Piscicultura-Apicultura'!B33*'Piscicultura-Apicultura'!E33","v":0},{"$f":"D38*'Piscicultura-Apicultura'!B47","v":0},{"$f":"'Piscicultura-Apicultura'!B33*'Piscicultura-Apicultura'!F33","v":0},{"$f":"F38*'Piscicultura-Apicultura'!B47","v":0},{"$f":"'Piscicultura-Apicultura'!B33*'Piscicultura-Apicultura'!G33","v":0},{"$f":"H38*'Piscicultura-Apicultura'!B47","v":0}]
[{"$f":"'Piscicultura-Apicultura'!A48","v":""},{"$f":"'Piscicultura-Apicultura'!B34*'Piscicultura-Apicultura'!D34","v":0},{"$f":"B39*'Piscicultura-Apicultura'!B48","v":0},{"$f":"'Piscicultura-Apicultura'!B34*'Piscicultura-Apicultura'!E34","v":0},{"$f":"D39*'Piscicultura-Apicultura'!B48","v":0},{"$f":"'Piscicultura-Apicultura'!B34*'Piscicultura-Apicultura'!F34","v":0},{"$f":"F39*'Piscicultura-Apicultura'!B48","v":0},{"$f":"'Piscicultura-Apicultura'!B34*'Piscicultura-Apicultura'!G34","v":0},{"$f":"H39*'Piscicultura-Apicultura'!B48","v":0}]
[{"$f":"'Piscicultura-Apicultura'!A49","v":""},{"$f":"'Piscicultura-Apicultura'!B35*'Piscicultura-Apicultura'!D35","v":0},{"$f":"B40*'Piscicultura-Apicultura'!B49","v":0},{"$f":"'Piscicultura-Apicultura'!B35*'Piscicultura-Apicultura'!E35","v":0},{"$f":"D40*'Piscicultura-Apicultura'!B49","v":0},{"$f":"'Piscicultura-Apicultura'!B35*'Piscicultura-Apicultura'!F35","v":0},{"$f":"F40*'Piscicultura-Apicultura'!B49","v":0},{"$f":"'Piscicultura-Apicultura'!B35*'Piscicultura-Apicultura'!G35","v":0},{"$f":"H40*'Piscicultura-Apicultura'!B49","v":0}]
[{"$f":"'Piscicultura-Apicultura'!A50","v":""},{"$f":"'Piscicultura-Apicultura'!B36*'Piscicultura-Apicultura'!D36","v":0},{"$f":"B41*'Piscicultura-Apicultura'!B50","v":0},{"$f":"'Piscicultura-Apicultura'!B36*'Piscicultura-Apicultura'!E36","v":0},{"$f":"D41*'Piscicultura-Apicultura'!B50","v":0},{"$f":"'Piscicultura-Apicultura'!B36*'Piscicultura-Apicultura'!F36","v":0},{"$f":"F41*'Piscicultura-Apicultura'!B50","v":0},{"$f":"'Piscicultura-Apicultura'!B36*'Piscicultura-Apicultura'!G36","v":0},{"$f":"H41*'Piscicultura-Apicultura'!B50","v":0}]
[{"$f":"'Piscicultura-Apicultura'!A51","v":""},{"$f":"'Piscicultura-Apicultura'!B37*'Piscicultura-Apicultura'!D37","v":0},{"$f":"B42*'Piscicultura-Apicultura'!B51","v":0},{"$f":"'Piscicultura-Apicultura'!B37*'Piscicultura-Apicultura'!E37","v":0},{"$f":"D42*'Piscicultura-Apicultura'!B51","v":0},{"$f":"'Piscicultura-Apicultura'!B37*'Piscicultura-Apicultura'!F37","v":0},{"$f":"F42*'Piscicultura-Apicultura'!B51","v":0},{"$f":"'Piscicultura-Apicultura'!B37*'Piscicultura-Apicultura'!G37","v":0},{"$f":"H42*'Piscicultura-Apicultura'!B51","v":0}]
[{"$f":"'Piscicultura-Apicultura'!A52","v":""},{"$f":"'Piscicultura-Apicultura'!B38*'Piscicultura-Apicultura'!D38","v":0},{"$f":"B43*'Piscicultura-Apicultura'!B52","v":0},{"$f":"'Piscicultura-Apicultura'!B38*'Piscicultura-Apicultura'!E38","v":0},{"$f":"D43*'Piscicultura-Apicultura'!B52","v":0},{"$f":"'Piscicultura-Apicultura'!B38*'Piscicultura-Apicultura'!F38","v":0},{"$f":"F43*'Piscicultura-Apicultura'!B52","v":0},{"$f":"'Piscicultura-Apicultura'!B38*'Piscicultura-Apicultura'!G38","v":0},{"$f":"H43*'Piscicultura-Apicultura'!B52","v":0}]
[{"$f":"'Piscicultura-Apicultura'!A53","v":""},{"$f":"'Piscicultura-Apicultura'!B39*'Piscicultura-Apicultura'!D39","v":0},{"$f":"B44*'Piscicultura-Apicultura'!B53","v":0},{"$f":"'Piscicultura-Apicultura'!B39*'Piscicultura-Apicultura'!E39","v":0},{"$f":"D44*'Piscicultura-Apicultura'!B53","v":0},{"$f":"'Piscicultura-Apicultura'!B39*'Piscicultura-Apicultura'!F39","v":0},{"$f":"F44*'Piscicultura-Apicultura'!B53","v":0},{"$f":"'Piscicultura-Apicultura'!B39*'Piscicultura-Apicultura'!G39","v":0},{"$f":"H44*'Piscicultura-Apicultura'!B53","v":0}]
[{"$f":"'Piscicultura-Apicultura'!A54","v":""},{"$f":"'Piscicultura-Apicultura'!B40*'Piscicultura-Apicultura'!D40","v":0},{"$f":"B45*'Piscicultura-Apicultura'!B54","v":0},{"$f":"'Piscicultura-Apicultura'!B40*'Piscicultura-Apicultura'!E40","v":0},{"$f":"D45*'Piscicultura-Apicultura'!B54","v":0},{"$f":"'Piscicultura-Apicultura'!B40*'Piscicultura-Apicultura'!F40","v":0},{"$f":"F45*'Piscicultura-Apicultura'!B54","v":0},{"$f":"'Piscicultura-Apicultura'!B40*'Piscicultura-Apicultura'!G40","v":0},{"$f":"H45*'Piscicultura-Apicultura'!B54","v":0}]
[{"$f":"'Piscicultura-Apicultura'!A55","v":""},{"$f":"'Piscicultura-Apicultura'!B41*'Piscicultura-Apicultura'!D41","v":0},{"$f":"B46*'Piscicultura-Apicultura'!B55","v":0},{"$f":"'Piscicultura-Apicultura'!B41*'Piscicultura-Apicultura'!E41","v":0},{"$f":"D46*'Piscicultura-Apicultura'!B55","v":0},{"$f":"'Piscicultura-Apicultura'!B41*'Piscicultura-Apicultura'!F41","v":0},{"$f":"F46*'Piscicultura-Apicultura'!B55","v":0},{"$f":"'Piscicultura-Apicultura'!B41*'Piscicultura-Apicultura'!G41","v":0},{"$f":"H46*'Piscicultura-Apicultura'!B55","v":0}]
["Total",null,{"$f":"SUM(C36:C46)","v":0},null,{"$f":"SUM(E36:E46)","v":0},null,{"$f":"SUM(G36:G46)","v":0},null,{"$f":"SUM(I36:I46)","v":0}]
[]
["Especificação","Custo Operacional - Despesas não Financiadas"]
[null,"Ano 1","Ano 2","Ano 3","Ano 4","Ano 5","Ano 6","Ano 7","Ano 8"]
["Insumos ",{"$f":"SUM(IF('Piscicultura-Apicultura'!G62=1,'Piscicultura-Apicultura'!F66,0)+IF('Piscicultura-Apicultura'!G68=1,'Piscicultura-Apicultura'!F72,0)+IF('Piscicultura-Apicultura'!G74=1,SUM('Piscicultura-Apicultura'!F78),0))","v":0},{"$f":"SUM(IF('Piscicultura-Apicultura'!$G$62<=2,'Piscicultura-Apicultura'!$F$66,0)+IF('Piscicultura-Apicultura'!$G$68<=2,'Piscicultura-Apicultura'!$F$72,0)+IF('Piscicultura-Apicultura'!$G$74<=2,'Piscicultura-Apicultura'!$F$78,0))","v":0},{"$f":"SUM(IF('Piscicultura-Apicultura'!$G$62<=3,'Piscicultura-Apicultura'!$F$66,0)+IF('Piscicultura-Apicultura'!$G$68<=3,'Piscicultura-Apicultura'!$F$72,0)+IF('Piscicultura-Apicultura'!$G$74<=3,'Piscicultura-Apicultura'!$F$78,0))","v":0},{"$f":"SUM(IF('Piscicultura-Apicultura'!$G$62<=4,'Piscicultura-Apicultura'!$F$66,0)+IF('Piscicultura-Apicultura'!$G$68<=4,'Piscicultura-Apicultura'!$F$72,0)+IF('Piscicultura-Apicultura'!$G$74<=4,'Piscicultura-Apicultura'!$F$78,0))","v":0},{"$f":"SUM(IF('Piscicultura-Apicultura'!$G$62<=5,'Piscicultura-Apicultura'!$F$66,0)+IF('Piscicultura-Apicultura'!$G$68<=5,'Piscicultura-Apicultura'!$F$72,0)+IF('Piscicultura-Apicultura'!$G$74<=5,'Piscicultura-Apicultura'!$F$78,0))","v":0},{"$f":"SUM(IF('Piscicultura-Apicultura'!$G$62<=6,'Piscicultura-Apicultura'!$F$66,0)+IF('Piscicultura-Apicultura'!$G$68<=6,'Piscicultura-Apicultura'!$F$72,0)+IF('Piscicultura-Apicultura'!$G$74<=6,'Piscicultura-Apicultura'!$F$78,0))","v":0},{"$f":"SUM(IF('Piscicultura-Apicultura'!$G$62<=7,'Piscicultura-Apicultura'!$F$66,0)+IF('Piscicultura-Apicultura'!$G$68<=7,'Piscicultura-Apicultura'!$F$72,0)+IF('Piscicultura-Apicultura'!$G$74<=7,'Piscicultura-Apicultura'!$F$78,0))","v":0},{"$f":"SUM(IF('Piscicultura-Apicultura'!$G$62<=8,'Piscicultura-Apicultura'!$F$66,0)+IF('Piscicultura-Apicultura'!$G$68<=8,'Piscicultura-Apicultura'!$F$72,0)+IF('Piscicultura-Apicultura'!$G$74<=8,'Piscicultura-Apicultura'!$F$78,0))","v":0}]
["Serviços",{"$f":"SUM(IF('Piscicultura-Apicultura'!G81=1,'Piscicultura-Apicultura'!F85,0)+IF('Piscicultura-Apicultura'!G87=1,'Piscicultura-Apicultura'!F91,0)+IF('Piscicultura-Apicultura'!G93=1,'Piscicultura-Apicultura'!F97,0))","v":0},{"$f":"SUM(IF('Piscicultura-Apicultura'!G81<=2,'Piscicultura-Apicultura'!F85,0)+IF('Piscicultura-Apicultura'!G87<=2,'Piscicultura-Apicultura'!F91,0)+IF('Piscicultura-Apicultura'!G93<=2,'Piscicultura-Apicultura'!F97,0))","v":0},{"$f":"SUM(IF('Piscicultura-Apicultura'!G81<=3,'Piscicultura-Apicultura'!F85,0)+IF('Piscicultura-Apicultura'!G87<=3,'Piscicultura-Apicultura'!F91,0)+IF('Piscicultura-Apicultura'!G93<=3,'Piscicultura-Apicultura'!F97,0))","v":0},{"$f":"SUM(IF('Piscicultura-Apicultura'!$G$81<=4,'Piscicultura-Apicultura'!$F$85,0)+IF('Piscicultura-Apicultura'!$G$87<=4,'Piscicultura-Apicultura'!$F$91,0)+IF('Piscicultura-Apicultura'!$G$93<=4,'Piscicultura-Apicultura'!$F$97,0))","v":0},{"$f":"SUM(IF('Piscicultura-Apicultura'!$G$81<=5,'Piscicultura-Apicultura'!$F$85,0)+IF('Piscicultura-Apicultura'!$G$87<=5,'Piscicultura-Apicultura'!$F$91,0)+IF('Piscicultura-Apicultura'!$G$93<=5,'Piscicultura-Apicultura'!$F$97,0))","v":0},{"$f":"SUM(IF('Piscicultura-Apicultura'!$G$81<=6,'Piscicultura-Apicultura'!$F$85,0)+IF('Piscicultura-Apicultura'!$G$87<=6,'Piscicultura-Apicultura'!$F$91,0)+IF('Piscicultura-Apicultura'!$G$93<=6,'Piscicultura-Apicultura'!$F$97,0))","v":0},{"$f":"SUM(IF('Piscicultura-Apicultura'!$G$81<=7,'Piscicultura-Apicultura'!$F$85,0)+IF('Piscicultura-Apicultura'!$G$87<=7,'Piscicultura-Apicultura'!$F$91,0)+IF('Piscicultura-Apicultura'!$G$93<=7,'Piscicultura-Apicultura'!$F$97,0))","v":0},{"$f":"SUM(IF('Piscicultura-Apicultura'!$G$81<=8,'Piscicultura-Apicultura'!$F$85,0)+IF('Piscicultura-Apicultura'!$G$87<=8,'Piscicultura-Apicultura'!$F$91,0)+IF('Piscicultura-Apicultura'!$G$93<=8,'Piscicultura-Apicultura'!$F$97,0))","v":0}]
["Outros Desembolsos",{"$f":"IF('Piscicultura-Apicultura'!G99=1,'Piscicultura-Apicultura'!F103,0)","v":0},{"$f":"IF('Piscicultura-Apicultura'!$G$99<=2,'Piscicultura-Apicultura'!$F$103,0)","v":0},{"$f":"IF('Piscicultura-Apicultura'!$G$99<=3,'Piscicultura-Apicultura'!$F$103,0)","v":0},{"$f":"IF('Piscicultura-Apicultura'!$G$99<=4,'Piscicultura-Apicultura'!$F$103,0)","v":0},{"$f":"IF('Piscicultura-Apicultura'!$G$99<=5,'Piscicultura-Apicultura'!$F$103,0)","v":0},{"$f":"IF('Piscicultura-Apicultura'!$G$99<=6,'Piscicultura-Apicultura'!$F$103,0)","v":0},{"$f":"IF('Piscicultura-Apicultura'!$G$99<=7,'Piscicultura-Apicultura'!$F$103,0)","v":0},{"$f":"IF('Piscicultura-Apicultura'!$G$99<=8,'Piscicultura-Apicultura'!$F$103,0)","v":0}]
["Total",{"$f":"SUM(B51:B53)","v":0},{"$f":"SUM(C51:C53)","v":0},0,0,0,0,0,0]
[]
["Especificação","Custo Operacional - Despesas não Financiadas"]
[null,"Ano 9","Ano 10","Ano 11","Ano 12","Ano 13","Ano 14","Ano 15","Ano 16"]
["Insumos ",{"$f":"SUM(IF('Piscicultura-Apicultura'!$G$62<=9,'Piscicultura-Apicultura'!$F$66,0)+IF('Piscicultura-Apicultura'!$G$68<=9,'Piscicultura-Apicultura'!$F$72,0)+IF('Piscicultura-Apicultura'!$G$74<=9,'Piscicultura-Apicultura'!$F$78,0))","v":0},{"$f":"SUM(IF('Piscicultura-Apicultura'!$G$62<=10,'Piscicultura-Apicultura'!$F$66,0)+IF('Piscicultura-Apicultura'!$G$68<=10,'Piscicultura-Apicultura'!$F$72,0)+IF('Piscicultura-Apicultura'!$G$74<=10,'Piscicultura-Apicultura'!$F$78,0))","v":0},{"$f":"SUM(IF('Piscicultura-Apicultura'!$G$62<=11,'Piscicultura-Apicultura'!$F$66,0)+IF('Piscicultura-Apicultura'!$G$68<=11,'Piscicultura-Apicultura'!$F$72,0)+IF('Piscicultura-Apicultura'!$G$74<=11,'Piscicultura-Apicultura'!$F$78,0))","v":0},{"$f":"SUM(IF('Piscicultura-Apicultura'!$G$62<=12,'Piscicultura-Apicultura'!$F$66,0)+IF('Piscicultura-Apicultura'!$G$68<=12,'Piscicultura-Apicultura'!$F$72,0)+IF('Piscicultura-Apicultura'!$G$74<=12,'Piscicultura-Apicultura'!$F$78,0))","v":0}]
["Serviços",{"$f":"SUM(IF('Piscicultura-Apicultura'!$G$81<=9,'Piscicultura-Apicultura'!$F$85,0)+IF('Piscicultura-Apicultura'!$G$87<=9,'Piscicultura-Apicultura'!$F$91,0)+IF('Piscicultura-Apicultura'!$G$93<=9,'Piscicultura-Apicultura'!$F$97,0))","v":0},{"$f":"SUM(IF('Piscicultura-Apicultura'!$G$81<=10,'Piscicultura-Apicultura'!$F$85,0)+IF('Piscicultura-Apicultura'!$G$87<=10,'Piscicultura-Apicultura'!$F$91,0)+IF('Piscicultura-Apicultura'!$G$93<=10,'Piscicultura-Apicultura'!$F$97,0))","v":0},{"$f":"SUM(IF('Piscicultura-Apicultura'!$G$81<=11,'Piscicultura-Apicultura'!$F$85,0)+IF('Piscicultura-Apicultura'!$G$87<=11,'Piscicultura-Apicultura'!$F$91,0)+IF('Piscicultura-Apicultura'!$G$93<=11,'Piscicultura-Apicultura'!$F$97,0))","v":0},{"$f":"SUM(IF('Piscicultura-Apicultura'!$G$81<=12,'Piscicultura-Apicultura'!$F$85,0)+IF('Piscicultura-Apicultura'!$G$87<=12,'Piscicultura-Apicultura'!$F$91,0)+IF('Piscicultura-Apicultura'!$G$93<=12,'Piscicultura-Apicultura'!$F$97,0))","v":0}]
["Outros Desembolsos",{"$f":"IF('Piscicultura-Apicultura'!$G$99<=9,'Piscicultura-Apicultura'!$F$103,0)","v":0},{"$f":"IF('Piscicultura-Apicultura'!$G$99<=10,'Piscicultura-Apicultura'!$F$103,0)","v":0},{"$f":"IF('Piscicultura-Apicultura'!$G$99<=11,'Piscicultura-Apicultura'!$F$103,0)","v":0},{"$f":"IF('Piscicultura-Apicultura'!$G$99<=12,'Piscicultura-Apicultura'!$F$103,0)","v":0}]
["Total",{"$f":"SUM(B58:B60)","v":0},{"$f":"SUM(C58:C60)","v":0},0,{"$f":"SUM(E58:E60)","v":0},0,0,0,0]

{"sheet":"Enquadramento","index":18,"n_rows":14,"n_cols":7,"rows_kept":14,"cut":false,"hidden":true,"merged":[[9,1,9,6],[0,0,0,6],[1,0,2,0],[1,2,1,6]]}
["Receita Bruta Total"]
["Receita Projetada","IRPF/IRPJ/CAF/DAP","Projetadas"]
[null,"Ano anterior","Ano1 ","Ano 2","Ano 3","Ano 4","Ano 5"]
["Receitas Bruta Agropecuária Anual ",{"$f":"IFERROR(LARGE('Dados Cadastrais'!$E$53:$J$53,1),0)","v":0},{"$f":"'Mem agricultura'!C16+'Mem piscicultura-apicultura'!C15+'Mem pecuaria'!C17+'Mem pecuaria'!C52+'Mem Atividades não financiadas'!C15","v":0},{"$f":"'Mem agricultura'!E16+'Mem piscicultura-apicultura'!E15+'Mem pecuaria'!E17+'Mem pecuaria'!E52+'Mem Atividades não financiadas'!E15","v":0},{"$f":"'Mem agricultura'!G16+'Mem piscicultura-apicultura'!G15+'Mem pecuaria'!G17+'Mem pecuaria'!G52+'Mem Atividades não financiadas'!G15","v":0},{"$f":"'Mem agricultura'!I16+'Mem piscicultura-apicultura'!I15+'Mem pecuaria'!I17+'Mem pecuaria'!I52+'Mem Atividades não financiadas'!I15","v":0},{"$f":"'Mem agricultura'!C33+'Mem piscicultura-apicultura'!C31+'Mem pecuaria'!K17+'Mem pecuaria'!K52+'Mem Atividades não financiadas'!C31","v":0}]
["Receita Bruta não Agropecuária Anual",{"$f":"IFERROR(HLOOKUP(B4,'Dados Cadastrais'!$E$53:$J$54,2,FALSE),0)","v":0},{"$f":"B5","v":0},{"$f":"C5","v":0},0,0,0]
["Receita Bruta Total",{"$f":"SUM(B4:B5)","v":0},{"$f":"SUM(C4:C4)","v":0},{"$f":"SUM(D4:D4)","v":0},{"$f":"SUM(E4:E4)","v":0},{"$f":"SUM(F4:F4)","v":0},{"$f":"SUM(G4:G4)","v":0}]
["% de Renda da Atividade Agropecuária",{"$f":"IFERROR(B4/B6,0)","v":0},0,0,0,0,0]
["% de Renda da Atividade não Agropecuária",{"$f":"IFERROR(B5/B6,0)","v":0},{"$f":"IFERROR(C5/C6,0)","v":0},0,0,0,0]
[]
["Porte do Cliente",{"$f":"IF(AND('Dados Cadastrais'!E3=\"pronaf\",Enquadramento!B4<=Enquadramento!C12,B4>0),Enquadramento!A12,IF(AND('Dados Cadastrais'!E3=\"pronamp\",B4<=C13,B8<=20%,B4>0),A13,IF(AND(OR(B4>C14,B8>20%),B4>0),A14,IF(AND(B4=0,LARGE(C4:G4,1)>0,'Dados Cadastrais'!E73=Informações!BO6,'Dados Cadastrais'!E77=Informações!BP6),F12,\"\"))))","v":""}]
[]
["Pequeno Produtor","ATÉ",500000,null,{"$f":"LARGE(C7:G7,1)","v":0},{"$f":"IF(AND(E12<=C12,E13<=20%),A12,IF(AND(E12<=C13,E13<=20%),A13,IF(OR(E12>C14,E13>20%),A14,\"\")))","v":"Pequeno Produtor"}]
["Médio Produtor","ATÉ",3500000,null,{"$f":"LARGE(C8:G8,1)","v":0}]
["Grande Produtor","MAIOR",3500000]

{"sheet":"Suporte forrageiro","index":19,"n_rows":52,"n_cols":9,"rows_kept":52,"cut":false,"hidden":true,"merged":[[26,7,26,8],[13,7,13,8],[0,0,1,0],[0,1,0,2],[0,3,0,4],[0,5,0,6],[0,7,0,8],[39,2,39,3],[13,0,14,0],[13,1,13,2],[13,3,13,4],[13,5,13,6],[26,0,27,0],[26,1,26,2],[26,3,26,4],[26,5,26,6]]}
["Categoria","Ano 1",null,"Ano 2",null,"Ano 3",null,"Ano 4"]
[null,"Área (ha)","Capacidade  (UA)","Área (ha)","Capacidade  (UA)","Área (ha)","Capacidade  (UA)","Área (ha)","Capacidade  (UA)"]
["Mecanizado - Sistema Rotacionado Intensivo",{"$f":"IF($A3=\"\",\"\",Pecuária!$B63)","v":0},{"$f":"IF($A3=\"\",\"\",'Suporte forrageiro'!B3*Pecuária!$D63)","v":0},{"$f":"IF($A3=\"\",\"\",Pecuária!$C63)","v":0},{"$f":"IF($A3=\"\",\"\",'Suporte forrageiro'!D3*Pecuária!$E63)","v":0},{"$f":"IF($A3=\"\",\"\",Pecuária!$C63)","v":0},{"$f":"IF($A3=\"\",\"\",'Suporte forrageiro'!F3*Pecuária!$E63)","v":0},{"$f":"IF($A3=\"\",\"\",Pecuária!$C63)","v":0},{"$f":"IF($A3=\"\",\"\",'Suporte forrageiro'!H3*Pecuária!$E63)","v":0}]
["Mecanizado - Tradicional",{"$f":"IF($A4=\"\",\"\",Pecuária!$B64)","v":0},{"$f":"IF($A4=\"\",\"\",'Suporte forrageiro'!B4*Pecuária!$D64)","v":0},{"$f":"IF($A4=\"\",\"\",Pecuária!$C64)","v":0},{"$f":"IF($A4=\"\",\"\",'Suporte forrageiro'!D4*Pecuária!$E64)","v":0},{"$f":"IF($A4=\"\",\"\",Pecuária!$C64)","v":0},{"$f":"IF($A4=\"\",\"\",'Suporte forrageiro'!F4*Pecuária!$E64)","v":0},{"$f":"IF($A4=\"\",\"\",Pecuária!$C64)","v":0},{"$f":"IF($A4=\"\",\"\",'Suporte forrageiro'!H4*Pecuária!$E64)","v":0}]
["Não Mecanizado ",{"$f":"IF($A5=\"\",\"\",Pecuária!$B65)","v":0},{"$f":"IF($A5=\"\",\"\",'Suporte forrageiro'!B5*Pecuária!$D65)","v":0},{"$f":"IF($A5=\"\",\"\",Pecuária!$C65)","v":0},{"$f":"IF($A5=\"\",\"\",'Suporte forrageiro'!D5*Pecuária!$E65)","v":0},{"$f":"IF($A5=\"\",\"\",Pecuária!$C65)","v":0},{"$f":"IF($A5=\"\",\"\",'Suporte forrageiro'!F5*Pecuária!$E65)","v":0},{"$f":"IF($A5=\"\",\"\",Pecuária!$C65)","v":0},{"$f":"IF($A5=\"\",\"\",'Suporte forrageiro'!H5*Pecuária!$E65)","v":0}]
["Capineira",{"$f":"IF($A6=\"\",\"\",Pecuária!$B66)","v":0},{"$f":"IF($A6=\"\",\"\",'Suporte forrageiro'!B6*Pecuária!$D66)","v":0},{"$f":"IF($A6=\"\",\"\",Pecuária!$C66)","v":0},{"$f":"IF($A6=\"\",\"\",'Suporte forrageiro'!D6*Pecuária!$E66)","v":0},{"$f":"IF($A6=\"\",\"\",Pecuária!$C66)","v":0},{"$f":"IF($A6=\"\",\"\",'Suporte forrageiro'!F6*Pecuária!$E66)","v":0},{"$f":"IF($A6=\"\",\"\",Pecuária!$C66)","v":0},{"$f":"IF($A6=\"\",\"\",'Suporte forrageiro'!H6*Pecuária!$E66)","v":0}]
["Pastagens Degradadas",{"$f":"IF($A7=\"\",\"\",Pecuária!$B67)","v":0},{"$f":"IF($A7=\"\",\"\",'Suporte forrageiro'!B7*Pecuária!$D67)","v":0},{"$f":"IF($A7=\"\",\"\",Pecuária!$C67)","v":0},{"$f":"IF($A7=\"\",\"\",'Suporte forrageiro'!D7*Pecuária!$E67)","v":0},{"$f":"IF($A7=\"\",\"\",Pecuária!$C67)","v":0},{"$f":"IF($A7=\"\",\"\",'Suporte forrageiro'!F7*Pecuária!$E67)","v":0},{"$f":"IF($A7=\"\",\"\",Pecuária!$C67)","v":0},{"$f":"IF($A7=\"\",\"\",'Suporte forrageiro'!H7*Pecuária!$E67)","v":0}]
["Pastagens Nativas",{"$f":"IF($A8=\"\",\"\",Pecuária!$B68)","v":0},{"$f":"IF($A8=\"\",\"\",'Suporte forrageiro'!B8*Pecuária!$D68)","v":0},{"$f":"IF($A8=\"\",\"\",Pecuária!$C68)","v":0},{"$f":"IF($A8=\"\",\"\",'Suporte forrageiro'!D8*Pecuária!$E68)","v":0},{"$f":"IF($A8=\"\",\"\",Pecuária!$C68)","v":0},{"$f":"IF($A8=\"\",\"\",'Suporte forrageiro'!F8*Pecuária!$E68)","v":0},{"$f":"IF($A8=\"\",\"\",Pecuária!$C68)","v":0},{"$f":"IF($A8=\"\",\"\",'Suporte forrageiro'!H8*Pecuária!$E68)","v":0}]
["Total",{"$f":"SUM(B3:B8)","v":0},{"$f":"SUM(C3:C8)","v":0},{"$f":"SUM(D3:D8)","v":0},0,0,0,0,0]
["Uso do Suporte Forrageiro -Rebanho de Corte",null,{"$f":"IFERROR(('Evolução rebanho'!I14)/'Suporte forrageiro'!C9,0)","v":0},null,{"$f":"IFERROR(('Evolução rebanho'!Q14)/'Suporte forrageiro'!E9,0)","v":0},null,{"$f":"IFERROR(('Evolução rebanho'!I28)/'Suporte forrageiro'!G9,0)","v":0},null,{"$f":"IFERROR(('Evolução rebanho'!Q28)/'Suporte forrageiro'!I9,0)","v":0}]
["Uso do Suporte Forrageiro - Rebanho de Leite",null,{"$f":"IFERROR(('Evolução rebanho'!I98)/'Suporte forrageiro'!C9,0)","v":0},null,{"$f":"IFERROR(('Evolução rebanho'!Q98)/'Suporte forrageiro'!E9,0)","v":0},null,{"$f":"IFERROR(('Evolução rebanho'!I112)/'Suporte forrageiro'!G9,0)","v":0},null,{"$f":"IFERROR(('Evolução rebanho'!Q112)/'Suporte forrageiro'!I9,0)","v":0}]
["Uso do Suporte Forrageiro - Total",null,{"$f":"SUM(C10:C11)","v":0},null,{"$f":"SUM(E10:E11)","v":0},null,{"$f":"SUM(G10:G11)","v":0},null,{"$f":"SUM(I10:I11)","v":0}]
[]
["Categoria","Ano 5",null,"Ano 6",null,"Ano 7",null,"Ano 8"]
[null,"Área (ha)","Capacidade  (ha)","Área (ha)","Capacidade  (ha)","Área (ha)","Capacidade  (ha)","Área (ha)","Capacidade  (UA)"]
["Mecanizado - Sistema Rotacionado Intensivo",{"$f":"IF($A16=\"\",\"\",Pecuária!$C63)","v":0},{"$f":"IF($A16=\"\",\"\",'Suporte forrageiro'!B16*Pecuária!$E63)","v":0},{"$f":"IF($A16=\"\",\"\",Pecuária!$C63)","v":0},{"$f":"IF($A16=\"\",\"\",'Suporte forrageiro'!D16*Pecuária!$E63)","v":0},{"$f":"IF($A16=\"\",\"\",Pecuária!$C63)","v":0},{"$f":"IF($A16=\"\",\"\",'Suporte forrageiro'!F16*Pecuária!$E63)","v":0},{"$f":"IF($A16=\"\",\"\",Pecuária!$C63)","v":0},{"$f":"IF($A16=\"\",\"\",'Suporte forrageiro'!H16*Pecuária!$E63)","v":0}]
["Mecanizado - Tradicional",{"$f":"IF($A17=\"\",\"\",Pecuária!$C64)","v":0},{"$f":"IF($A17=\"\",\"\",'Suporte forrageiro'!B17*Pecuária!$E64)","v":0},{"$f":"IF($A17=\"\",\"\",Pecuária!$C64)","v":0},{"$f":"IF($A17=\"\",\"\",'Suporte forrageiro'!D17*Pecuária!$E64)","v":0},{"$f":"IF($A17=\"\",\"\",Pecuária!$C64)","v":0},{"$f":"IF($A17=\"\",\"\",'Suporte forrageiro'!F17*Pecuária!$E64)","v":0},{"$f":"IF($A17=\"\",\"\",Pecuária!$C64)","v":0},{"$f":"IF($A17=\"\",\"\",'Suporte forrageiro'!H17*Pecuária!$E64)","v":0}]
["Não Mecanizado ",{"$f":"IF($A18=\"\",\"\",Pecuária!$C65)","v":0},{"$f":"IF($A18=\"\",\"\",'Suporte forrageiro'!B18*Pecuária!$E65)","v":0},{"$f":"IF($A18=\"\",\"\",Pecuária!$C65)","v":0},{"$f":"IF($A18=\"\",\"\",'Suporte forrageiro'!D18*Pecuária!$E65)","v":0},{"$f":"IF($A18=\"\",\"\",Pecuária!$C65)","v":0},{"$f":"IF($A18=\"\",\"\",'Suporte forrageiro'!F18*Pecuária!$E65)","v":0},{"$f":"IF($A18=\"\",\"\",Pecuária!$C65)","v":0},{"$f":"IF($A18=\"\",\"\",'Suporte forrageiro'!H18*Pecuária!$E65)","v":0}]
["Capineira",{"$f":"IF($A19=\"\",\"\",Pecuária!$C66)","v":0},{"$f":"IF($A19=\"\",\"\",'Suporte forrageiro'!B19*Pecuária!$E66)","v":0},{"$f":"IF($A19=\"\",\"\",Pecuária!$C66)","v":0},{"$f":"IF($A19=\"\",\"\",'Suporte forrageiro'!D19*Pecuária!$E66)","v":0},{"$f":"IF($A19=\"\",\"\",Pecuária!$C66)","v":0},{"$f":"IF($A19=\"\",\"\",'Suporte forrageiro'!F19*Pecuária!$E66)","v":0},{"$f":"IF($A19=\"\",\"\",Pecuária!$C66)","v":0},{"$f":"IF($A19=\"\",\"\",'Suporte forrageiro'!H19*Pecuária!$E66)","v":0}]
["Pastagens Degradadas",{"$f":"IF($A20=\"\",\"\",Pecuária!$C67)","v":0},{"$f":"IF($A20=\"\",\"\",'Suporte forrageiro'!B20*Pecuária!$E67)","v":0},{"$f":"IF($A20=\"\",\"\",Pecuária!$C67)","v":0},{"$f":"IF($A20=\"\",\"\",'Suporte forrageiro'!D20*Pecuária!$E67)","v":0},{"$f":"IF($A20=\"\",\"\",Pecuária!$C67)","v":0},{"$f":"IF($A20=\"\",\"\",'Suporte forrageiro'!F20*Pecuária!$E67)","v":0},{"$f":"IF($A20=\"\",\"\",Pecuária!$C67)","v":0},{"$f":"IF($A20=\"\",\"\",'Suporte forrageiro'!H20*Pecuária!$E67)","v":0}]
["Pastagens Nativas",{"$f":"IF($A21=\"\",\"\",Pecuária!$C68)","v":0},{"$f":"IF($A21=\"\",\"\",'Suporte forrageiro'!B21*Pecuária!$E68)","v":0},{"$f":"IF($A21=\"\",\"\",Pecuária!$C68)","v":0},{"$f":"IF($A21=\"\",\"\",'Suporte forrageiro'!D21*Pecuária!$E68)","v":0},{"$f":"IF($A21=\"\",\"\",Pecuária!$C68)","v":0},{"$f":"IF($A21=\"\",\"\",'Suporte forrageiro'!F21*Pecuária!$E68)","v":0},{"$f":"IF($A21=\"\",\"\",Pecuária!$C68)","v":0},{"$f":"IF($A21=\"\",\"\",'Suporte forrageiro'!H21*Pecuária!$E68)","v":0}]
["Total",{"$f":"SUM(B16:B21)","v":0},{"$f":"SUM(C16:C21)","v":0},{"$f":"SUM(D16:D21)","v":0},{"$f":"SUM(E16:E21)","v":0},{"$f":"SUM(F16:F21)","v":0},{"$f":"SUM(G16:G21)","v":0},{"$f":"SUM(H16:H21)","v":0},{"$f":"SUM(I16:I21)","v":0}]
["Uso do Suporte Forrageiro -Rebanho de Corte",null,{"$f":"IFERROR(('Evolução rebanho'!I42)/'Suporte forrageiro'!C22,0)","v":0},null,{"$f":"IFERROR(('Evolução rebanho'!Q42)/'Suporte forrageiro'!E22,0)","v":0},null,{"$f":"IFERROR(('Evolução rebanho'!I56)/'Suporte forrageiro'!G22,0)","v":0},null,{"$f":"IFERROR(('Evolução rebanho'!Q56)/'Suporte forrageiro'!I22,0)","v":0}]
["Uso do Suporte Forrageiro - Rebanho de Leite",null,{"$f":"IFERROR(('Evolução rebanho'!I126)/'Suporte forrageiro'!C22,0)","v":0},null,{"$f":"IFERROR(('Evolução rebanho'!Q126)/'Suporte forrageiro'!E22,0)","v":0},null,{"$f":"IFERROR(('Evolução rebanho'!I140)/'Suporte forrageiro'!G22,0)","v":0},null,{"$f":"IFERROR(('Evolução rebanho'!Q140)/'Suporte forrageiro'!I22,0)","v":0}]
["Uso do Suporte Forrageiro - Total",null,{"$f":"SUM(C23:C24)","v":0},null,{"$f":"SUM(E23:E24)","v":0},null,{"$f":"SUM(G23:G24)","v":0},null,{"$f":"SUM(I23:I24)","v":0}]
[]
["Categoria","Ano 9",null,"Ano 10",null,"Ano 11",null,"Ano 12"]
[null,"Área (ha)","Capacidade  (UA)","Área (ha)","Capacidade  (UA)","Área (ha)","Capacidade  (UA)","Área (ha)","Capacidade  (UA)"]
["Mecanizado - Sistema Rotacionado Intensivo",{"$f":"IF($A29=\"\",\"\",Pecuária!$C63)","v":0},{"$f":"IF($A29=\"\",\"\",'Suporte forrageiro'!B29*Pecuária!$E63)","v":0},{"$f":"IF($A29=\"\",\"\",Pecuária!$C63)","v":0},{"$f":"IF($A29=\"\",\"\",'Suporte forrageiro'!D29*Pecuária!$E63)","v":0},{"$f":"IF($A29=\"\",\"\",Pecuária!$C63)","v":0},{"$f":"IF($A29=\"\",\"\",'Suporte forrageiro'!F29*Pecuária!$E63)","v":0},{"$f":"IF($A29=\"\",\"\",Pecuária!$C63)","v":0},{"$f":"IF($A29=\"\",\"\",'Suporte forrageiro'!H29*Pecuária!$E63)","v":0}]
["Mecanizado - Tradicional",{"$f":"IF($A30=\"\",\"\",Pecuária!$C64)","v":0},{"$f":"IF($A30=\"\",\"\",'Suporte forrageiro'!B30*Pecuária!$E64)","v":0},{"$f":"IF($A30=\"\",\"\",Pecuária!$C64)","v":0},{"$f":"IF($A30=\"\",\"\",'Suporte forrageiro'!D30*Pecuária!$E64)","v":0},{"$f":"IF($A30=\"\",\"\",Pecuária!$C64)","v":0},{"$f":"IF($A30=\"\",\"\",'Suporte forrageiro'!F30*Pecuária!$E64)","v":0},{"$f":"IF($A30=\"\",\"\",Pecuária!$C64)","v":0},{"$f":"IF($A30=\"\",\"\",'Suporte forrageiro'!H30*Pecuária!$E64)","v":0}]
["Não Mecanizado ",{"$f":"IF($A31=\"\",\"\",Pecuária!$C65)","v":0},{"$f":"IF($A31=\"\",\"\",'Suporte forrageiro'!B31*Pecuária!$E65)","v":0},{"$f":"IF($A31=\"\",\"\",Pecuária!$C65)","v":0},{"$f":"IF($A31=\"\",\"\",'Suporte forrageiro'!D31*Pecuária!$E65)","v":0},{"$f":"IF($A31=\"\",\"\",Pecuária!$C65)","v":0},{"$f":"IF($A31=\"\",\"\",'Suporte forrageiro'!F31*Pecuária!$E65)","v":0},{"$f":"IF($A31=\"\",\"\",Pecuária!$C65)","v":0},{"$f":"IF($A31=\"\",\"\",'Suporte forrageiro'!H31*Pecuária!$E65)","v":0}]
["Capineira",{"$f":"IF($A32=\"\",\"\",Pecuária!$C66)","v":0},{"$f":"IF($A32=\"\",\"\",'Suporte forrageiro'!B32*Pecuária!$E66)","v":0},{"$f":"IF($A32=\"\",\"\",Pecuária!$C66)","v":0},{"$f":"IF($A32=\"\",\"\",'Suporte forrageiro'!D32*Pecuária!$E66)","v":0},{"$f":"IF($A32=\"\",\"\",Pecuária!$C66)","v":0},{"$f":"IF($A32=\"\",\"\",'Suporte forrageiro'!F32*Pecuária!$E66)","v":0},{"$f":"IF($A32=\"\",\"\",Pecuária!$C66)","v":0},{"$f":"IF($A32=\"\",\"\",'Suporte forrageiro'!H32*Pecuária!$E66)","v":0}]
["Pastagens Degradadas",{"$f":"IF($A33=\"\",\"\",Pecuária!$C67)","v":0},{"$f":"IF($A33=\"\",\"\",'Suporte forrageiro'!B33*Pecuária!$E67)","v":0},{"$f":"IF($A33=\"\",\"\",Pecuária!$C67)","v":0},{"$f":"IF($A33=\"\",\"\",'Suporte forrageiro'!D33*Pecuária!$E67)","v":0},{"$f":"IF($A33=\"\",\"\",Pecuária!$C67)","v":0},{"$f":"IF($A33=\"\",\"\",'Suporte forrageiro'!F33*Pecuária!$E67)","v":0},{"$f":"IF($A33=\"\",\"\",Pecuária!$C67)","v":0},{"$f":"IF($A33=\"\",\"\",'Suporte forrageiro'!H33*Pecuária!$E67)","v":0}]
["Pastagens Nativas",{"$f":"IF($A34=\"\",\"\",Pecuária!$C68)","v":0},{"$f":"IF($A34=\"\",\"\",'Suporte forrageiro'!B34*Pecuária!$E68)","v":0},{"$f":"IF($A34=\"\",\"\",Pecuária!$C68)","v":0},{"$f":"IF($A34=\"\",\"\",'Suporte forrageiro'!D34*Pecuária!$E68)","v":0},{"$f":"IF($A34=\"\",\"\",Pecuária!$C68)","v":0},{"$f":"IF($A34=\"\",\"\",'Suporte forrageiro'!F34*Pecuária!$E68)","v":0},{"$f":"IF($A34=\"\",\"\",Pecuária!$C68)","v":0},{"$f":"IF($A34=\"\",\"\",'Suporte forrageiro'!H34*Pecuária!$E68)","v":0}]
["Total",{"$f":"SUM(B29:B34)","v":0},{"$f":"SUM(C29:C34)","v":0},{"$f":"SUM(D29:D34)","v":0},{"$f":"SUM(E29:E34)","v":0},{"$f":"SUM(F29:F34)","v":0},{"$f":"SUM(G29:G34)","v":0},{"$f":"SUM(H29:H34)","v":0},{"$f":"SUM(I29:I34)","v":0}]
["Uso do Suporte Forrageiro -Rebanho de Corte",null,{"$f":"IFERROR(('Evolução rebanho'!I70)/'Suporte forrageiro'!C35,0)","v":0},null,{"$f":"IFERROR(('Evolução rebanho'!Q70)/'Suporte forrageiro'!E35,0)","v":0},null,{"$f":"IFERROR(('Evolução rebanho'!I83)/'Suporte forrageiro'!G35,0)","v":0},null,{"$f":"IFERROR(('Evolução rebanho'!Q83)/'Suporte forrageiro'!I35,0)","v":0}]
["Uso do Suporte Forrageiro - Rebanho de Leite",null,{"$f":"IFERROR(('Evolução rebanho'!I154)/'Suporte forrageiro'!C35,0)","v":0},null,{"$f":"IFERROR(('Evolução rebanho'!Q154)/'Suporte forrageiro'!E35,0)","v":0},null,{"$f":"IFERROR(('Evolução rebanho'!I168)/'Suporte forrageiro'!G35,0)","v":0},null,{"$f":"IFERROR(('Evolução rebanho'!Q168)/'Suporte forrageiro'!I35,0)","v":0}]
["Uso do Suporte Forrageiro - Total",null,{"$f":"SUM(C36:C37)","v":0},null,{"$f":"SUM(E36:E37)","v":0},null,{"$f":"SUM(G36:G37)","v":0},null,{"$f":"SUM(I36:I37)","v":0}]
[]
[null,"Ano","Consumo/Disponibilidade",null,"UA","%"]
[null,1,{"$f":"REPT(\"|\",(C12*100))","v":""},{"$f":"IF(C12>100%,\"Suporte Estourado\",REPT(\"|\",(100-(C12*100))))","v":"||||||||||||||||||||||||||||||||||||||||||||||||||||||||||||||||||||||||||||||||||||||||||||||||||||"},{"$f":"'Evolução rebanho'!I14+'Evolução rebanho'!I98","v":0},{"$f":"C12","v":0}]
[null,2,{"$f":"REPT(\"|\",(E12*100))","v":""},{"$f":"IF(E12>100%,\"Suporte Estourado\",REPT(\"|\",(100-(E12*100))))","v":"||||||||||||||||||||||||||||||||||||||||||||||||||||||||||||||||||||||||||||||||||||||||||||||||||||"},{"$f":"'Evolução rebanho'!Q14+'Evolução rebanho'!Q98","v":0},{"$f":"E12","v":0}]
[null,3,{"$f":"REPT(\"|\",(G12*100))","v":""},{"$f":"IF(G12>100%,\"Suporte Estourado\",REPT(\"|\",(100-(G12*100))))","v":"||||||||||||||||||||||||||||||||||||||||||||||||||||||||||||||||||||||||||||||||||||||||||||||||||||"},{"$f":"'Evolução rebanho'!I28+'Evolução rebanho'!I112","v":0},{"$f":"G12","v":0}]
[null,4,{"$f":"REPT(\"|\",(I12*100))","v":""},{"$f":"IF(I12>100%,\"Suporte Estourado\",REPT(\"|\",(100-(I12*100))))","v":"||||||||||||||||||||||||||||||||||||||||||||||||||||||||||||||||||||||||||||||||||||||||||||||||||||"},{"$f":"'Evolução rebanho'!Q28+'Evolução rebanho'!Q112","v":0},{"$f":"I12","v":0}]
[null,5,{"$f":"REPT(\"|\",(C25*100))","v":""},{"$f":"IF(C25>100%,\"Suporte Estourado\",REPT(\"|\",(100-(C25*100))))","v":"||||||||||||||||||||||||||||||||||||||||||||||||||||||||||||||||||||||||||||||||||||||||||||||||||||"},{"$f":"'Evolução rebanho'!I42+'Evolução rebanho'!I126","v":0},{"$f":"C25","v":0}]
[null,6,{"$f":"REPT(\"|\",(E25*100))","v":""},{"$f":"IF(E25>100%,\"Suporte Estourado\",REPT(\"|\",(100-(E25*100))))","v":"||||||||||||||||||||||||||||||||||||||||||||||||||||||||||||||||||||||||||||||||||||||||||||||||||||"},{"$f":"'Evolução rebanho'!Q42+'Evolução rebanho'!Q126","v":0},{"$f":"E25","v":0}]
[null,7,{"$f":"REPT(\"|\",(G25*100))","v":""},{"$f":"IF(G25>100%,\"Suporte Estourado\",REPT(\"|\",(100-(G25*100))))","v":"||||||||||||||||||||||||||||||||||||||||||||||||||||||||||||||||||||||||||||||||||||||||||||||||||||"},{"$f":"'Evolução rebanho'!I56+'Evolução rebanho'!I140","v":0},{"$f":"G25","v":0}]
[null,8,{"$f":"REPT(\"|\",(I25*100))","v":""},{"$f":"IF(I25>100%,\"Suporte Estourado\",REPT(\"|\",(100-(I25*100))))","v":"||||||||||||||||||||||||||||||||||||||||||||||||||||||||||||||||||||||||||||||||||||||||||||||||||||"},{"$f":"'Evolução rebanho'!Q56+'Evolução rebanho'!Q140","v":0},{"$f":"I25","v":0}]
[null,9,{"$f":"REPT(\"|\",(C38*100))","v":""},{"$f":"IF(C38>100%,\"Suporte Estourado\",REPT(\"|\",(100-(C38*100))))","v":"||||||||||||||||||||||||||||||||||||||||||||||||||||||||||||||||||||||||||||||||||||||||||||||||||||"},{"$f":"'Evolução rebanho'!I70+'Evolução rebanho'!I154","v":0},{"$f":"C38","v":0}]
[null,10,{"$f":"REPT(\"|\",(C38*100))","v":""},{"$f":"IF(E38>100%,\"Suporte Estourado\",REPT(\"|\",(100-(E38*100))))","v":"||||||||||||||||||||||||||||||||||||||||||||||||||||||||||||||||||||||||||||||||||||||||||||||||||||"},{"$f":"'Evolução rebanho'!Q70+'Evolução rebanho'!Q154","v":0},{"$f":"E38","v":0}]
[null,11,{"$f":"REPT(\"|\",(G38*100))","v":""},{"$f":"IF(G38>100%,\"Suporte Estourado\",REPT(\"|\",(100-(G38*100))))","v":"||||||||||||||||||||||||||||||||||||||||||||||||||||||||||||||||||||||||||||||||||||||||||||||||||||"},{"$f":"'Evolução rebanho'!I83+'Evolução rebanho'!I168","v":0},{"$f":"G38","v":0}]
[null,12,{"$f":"REPT(\"|\",(I38*100))","v":""},{"$f":"IF(I38>100%,\"Suporte Estourado\",REPT(\"|\",(100-(I38*100))))","v":"||||||||||||||||||||||||||||||||||||||||||||||||||||||||||||||||||||||||||||||||||||||||||||||||||||"},{"$f":"'Evolução rebanho'!Q83+'Evolução rebanho'!Q168","v":0},{"$f":"I38","v":0}]

{"sheet":"Evolução rebanho","index":20,"n_rows":168,"n_cols":17,"rows_kept":168,"cut":false,"hidden":true,"merged":[[141,0,143,0],[141,1,141,8],[141,9,141,16],[142,7,142,8],[142,15,142,16],[155,0,157,0],[155,1,155,8],[155,9,155,16],[156,7,156,8],[156,15,156,16],[113,0,115,0],[113,1,113,8],[113,9,113,16],[114,7,114,8],[114,15,114,16],[127,0,129,0],[127,1,127,8],[127,9,127,16],[128,7,128,8],[128,15,128,16],[85,0,87,0],[85,1,85,8],[85,9,85,16],[86,7,86,8],[86,15,86,16],[99,0,101,0],[99,1,99,8],[99,9,99,16],[100,7,100,8],[100,15,100,16],[84,0,84,16],[43,0,45,0],[43,1,43,8],[43,9,43,16],[44,7,44,8],[44,15,44,16],[57,0,59,0],[57,1,57,8],[57,9,57,16],[58,7,58,8],[58,15,58,16],[70,0,72,0],[70,1,70,8],[70,9,70,16],[71,7,71,8],[71,15,71,16],[15,0,17,0],[15,1,15,8],[15,9,15,16],[16,7,16,8],[16,15,16,16],[29,0,31,0],[29,1,29,8],[29,9,29,16],[30,7,30,8],[30,15,30,16],[0,0,0,16],[1,0,3,0],[1,1,1,8],[1,9,1,16],[2,7,2,8],[2,15,2,16]]}
["Evolução do Rebanho de Corte"]
["Categoria","Ano 1",null,null,null,null,null,null,null,"Ano 2"]
[null,"Qtd Inicial ","Aquis.","Nasc.","Perda","Venda","Qtd Final","Qtd Média",null,"Qtd Inicial ","Aquis.","Nasc.","Perda","Venda","Qtd Final","Qtd Média"]
[null,"(cab.)","(cab.)","(cab.)","(cab.)","(cab.)","(cab.)","(cab.)","(UA)","(cab.)","(cab.)","(cab.)","(cab.)","(cab.)","(cab.)","(cab.)","(UA)"]
["Reprodutores",{"$f":"Pecuária!B5","v":0},{"$f":"Pecuária!C5+Pecuária!C19","v":0},null,{"$f":"ROUND((B5+C5)*Pecuária!$C$47,0)","v":0},{"$f":"ROUND((B5+C5-E5)*Pecuária!$C$84,0)","v":0},{"$f":"ROUND(B5+C5-E5-F5,0)","v":0},{"$f":"ROUND(SUM(B5,C5)-SUM(E5,F5)/2,0)","v":0},{"$f":"ROUND(H5*Pecuária!$C$72,0)","v":0},{"$f":"G5","v":0},{"$f":"Pecuária!D19","v":0},null,{"$f":"ROUND((J5+K5)*Pecuária!$C$47,0)","v":0},{"$f":"ROUND((J5+K5-M5)*Pecuária!$C$84,0)","v":0},{"$f":"ROUND(J5+K5-M5-N5,0)","v":0},{"$f":"ROUND(SUM(J5,K5)-SUM(M5,N5)/2,0)","v":0},{"$f":"ROUND(P5*Pecuária!$C$72,0)","v":0}]
["Matrizes",{"$f":"Pecuária!B6","v":0},{"$f":"Pecuária!C6+Pecuária!C20","v":0},null,{"$f":"ROUND((B6+C6)*Pecuária!$C$47,0)","v":0},{"$f":"ROUND((B6+C6-E6)*Pecuária!$C$85,0)","v":0},{"$f":"ROUND(B6+C6-E6-F6,0)","v":0},{"$f":"ROUND(SUM(B6,C6)-SUM(E6,F6)/2,0)","v":0},{"$f":"ROUND(H6*Pecuária!$C$73,0)","v":0},{"$f":"G6+G9","v":0},{"$f":"Pecuária!D20","v":0},null,{"$f":"ROUND((J6+K6)*Pecuária!$C$47,0)","v":0},{"$f":"ROUND((J6+K6-M6)*Pecuária!$C$85,0)","v":0},0,{"$f":"ROUND(SUM(J6,K6)-SUM(M6,N6)/2,0)","v":0},{"$f":"ROUND(P6*Pecuária!$C$73,0)","v":0}]
["Bois",{"$f":"Pecuária!B7","v":0},{"$f":"Pecuária!C7+Pecuária!C21","v":0},null,{"$f":"ROUND((B7+C7)*Pecuária!$C$47,0)","v":0},{"$f":"IF(OR(Pecuária!$C$86=\"bois\",Pecuária!$C$87=\"bois\"),ROUND((B7+C7-E7)*100%,0),\"0\")","v":"0"},0,{"$f":"ROUND(SUM(B7,C7)-E7/2,0)","v":0},{"$f":"ROUND(H7*Pecuária!$C$74,0)","v":0},{"$f":"G7+G8","v":0},{"$f":"Pecuária!D21","v":0},null,{"$f":"ROUND((J7+K7)*Pecuária!$C$47,0)","v":0},{"$f":"IF(OR(Pecuária!$C$86=\"bois\",Pecuária!$C$87=\"bois\"),ROUND((J7+K7-M7)*100%,0),\"0\")","v":"0"},0,{"$f":"ROUND(SUM(J7,K7)-M7/2,0)","v":0},{"$f":"ROUND(P7*Pecuária!$C$74,0)","v":0}]
["Novilhos",{"$f":"Pecuária!B8","v":0},{"$f":"Pecuária!C8+Pecuária!C22","v":0},null,{"$f":"ROUND((B8+C8)*Pecuária!$C$46,0)","v":0},{"$f":"IF(OR(Pecuária!$C$86=\"novilho\",Pecuária!$C$87=\"novilho\"),ROUND((B8+C8-E8)*100%,0),\"0\")","v":"0"},0,{"$f":"ROUND(SUM(B8,C8)-E8/2,0)","v":0},{"$f":"ROUND(H8*Pecuária!$C$75,0)","v":0},{"$f":"G10","v":0},{"$f":"Pecuária!D22","v":0},null,{"$f":"ROUND((J8+K8)*Pecuária!$C$46,0)","v":0},{"$f":"IF(OR(Pecuária!$C$86=\"novilho\",Pecuária!$C$87=\"novilho\"),ROUND((J8+K8-M8)*100%,0),\"0\")","v":"0"},0,{"$f":"ROUND(SUM(J8,K8)-M8/2,0)","v":0},{"$f":"ROUND(P8*Pecuária!$C$75,0)","v":0}]
["Novilhas ",{"$f":"Pecuária!B9","v":0},{"$f":"Pecuária!C9+Pecuária!C23","v":0},null,{"$f":"ROUND((B9+C9)*Pecuária!$C$46,0)","v":0},{"$f":"IF(OR(Pecuária!$C$88=\"novilha\",Pecuária!$C$89=\"novilha\"),ROUND((B9+C9-E9)*100%,0),\"0\")","v":"0"},0,{"$f":"ROUND(SUM(B9,C9)-E9/2,0)","v":0},{"$f":"ROUND(H9*Pecuária!$C$76,0)","v":0},{"$f":"G11","v":0},{"$f":"Pecuária!D23","v":0},null,{"$f":"ROUND((J9+K9)*Pecuária!$C$46,0)","v":0},{"$f":"IF(OR(Pecuária!$C$88=\"novilha\",Pecuária!$C$89=\"novilha\"),ROUND((J9+K9-M9)*100%,0),\"0\")","v":"0"},0,{"$f":"ROUND(SUM(J9,K9)-M9/2,0)","v":0},{"$f":"ROUND(P9*Pecuária!$C$76,0)","v":0}]
["Garrotes",{"$f":"Pecuária!B10","v":0},{"$f":"Pecuária!C10+Pecuária!C24","v":0},null,{"$f":"ROUND((B10+C10)*Pecuária!$C$45,0)","v":0},{"$f":"IF(OR(Pecuária!$C$86=\"garrote\",Pecuária!$C$87=\"garrote\"),ROUND((B10+C10-E10)*100%,0),\"0\")","v":"0"},0,{"$f":"ROUND(SUM(B10,C10)-E10/2,0)","v":0},{"$f":"ROUND(H10*Pecuária!$C$77,0)","v":0},{"$f":"G12","v":0},{"$f":"Pecuária!D24","v":0},null,{"$f":"ROUND((J10+K10)*Pecuária!$C$45,0)","v":0},{"$f":"IF(OR(Pecuária!$C$86=\"garrote\",Pecuária!$C$87=\"garrote\"),ROUND((J10+K10-M10)*100%,0),\"0\")","v":"0"},0,{"$f":"ROUND(SUM(J10,K10)-M10/2,0)","v":0},{"$f":"ROUND(P10*Pecuária!$C$77,0)","v":0}]
["Garrotas ",{"$f":"Pecuária!B11","v":0},{"$f":"Pecuária!C11+Pecuária!C25","v":0},null,{"$f":"ROUND((B11+C11)*Pecuária!$C$45,0)","v":0},{"$f":"IF(OR(Pecuária!$C$88=\"garrota\",Pecuária!$C$89=\"garrota\"),ROUND((B11+C11-E11)*100%,0),\"0\")","v":"0"},0,{"$f":"ROUND(SUM(B11,C11)-E11/2,0)","v":0},{"$f":"ROUND(H11*Pecuária!$C$78,0)","v":0},{"$f":"G13","v":0},{"$f":"Pecuária!D25","v":0},null,{"$f":"ROUND((J11+K11)*Pecuária!$C$45,0)","v":0},{"$f":"IF(OR(Pecuária!$C$88=\"garrota\",Pecuária!$C$89=\"garrota\"),ROUND((J11+K11-M11)*100%,0),\"0\")","v":"0"},0,{"$f":"ROUND(SUM(J11,K11)-M11/2,0)","v":0},{"$f":"ROUND(P11*Pecuária!$C$78,0)","v":0}]
["Bezerros ",{"$f":"Pecuária!B12","v":0},{"$f":"Pecuária!C12+Pecuária!C26","v":0},{"$f":"$B$6*Pecuária!$C$43*50%+$C$6*Pecuária!$C$43/2*50%","v":0},{"$f":"ROUND((B12+C12+D12)*Pecuária!$C$44,0)","v":0},{"$f":"IF(OR(Pecuária!$C$86=\"bezerro\",Pecuária!$C$87=\"bezerro\"),(B12+C12+D12-E12)*100%,0)","v":0},{"$f":"ROUND(B12+C12+D12-E12-F12,0)","v":0},{"$f":"ROUND(SUM(B12,C12)+D12/2-E12/2,0)","v":0},{"$f":"ROUND(H12*Pecuária!$C$79,0)","v":0},null,{"$f":"Pecuária!D26","v":0},{"$f":"$J$6*Pecuária!C43*50%+$K$6*Pecuária!C43/2*50%","v":0},{"$f":"ROUND((J12+K12+L12)*Pecuária!$C$44,0)","v":0},{"$f":"IF(OR(Pecuária!$C$86=\"bezerro\",Pecuária!$C$87=\"bezerro\"),ROUND((J12+K12+L12-M12)*100%,0),\"0\")","v":"0"},{"$f":"ROUND(J12+K12+L12-M12-N12,0)","v":0},{"$f":"ROUND(SUM(J12,K12)+L12/2-M12/2,0)","v":0},{"$f":"ROUND(P12*Pecuária!$C$79,0)","v":0}]
["Bezerras ",{"$f":"Pecuária!B13","v":0},{"$f":"Pecuária!C13+Pecuária!C27","v":0},{"$f":"$B$6*Pecuária!$C$43*50%+$C$6*Pecuária!$C$43/2*50%","v":0},{"$f":"ROUND((B13+C13+D13)*Pecuária!$C$44,0)","v":0},{"$f":"IF(OR(Pecuária!$C$88=\"bezerra\",Pecuária!$C$89=\"bezerra\"),ROUND((B13+C13+D13-E13)*100%,0),\"0\")","v":"0"},{"$f":"ROUND(B13+C13+D13-E13-F13,0)","v":0},{"$f":"ROUND(SUM(B13,C13)+D13/2-E13/2,0)","v":0},{"$f":"ROUND(H13*Pecuária!$C$80,0)","v":0},null,{"$f":"Pecuária!D27","v":0},{"$f":"$J$6*Pecuária!C43*50%+$K$6*Pecuária!C43/2*50%","v":0},{"$f":"ROUND((J13+K13+L13)*Pecuária!$C$44,0)","v":0},{"$f":"IF(OR(Pecuária!$C$88=\"bezerra\",Pecuária!$C$89=\"bezerra\"),ROUND((J13+K13+L13-M13)*100%,0),\"0\")","v":"0"},{"$f":"ROUND(J13+K13+L13-M13-N13,0)","v":0},{"$f":"ROUND(SUM(J13,K13)+L13/2-M13/2,0)","v":0},{"$f":"ROUND(P13*Pecuária!$C$80,0)","v":0}]
["Total",{"$f":"SUM(B5:B13)","v":0},{"$f":"SUM(C5:C13)","v":0},{"$f":"SUM(D12:D13)","v":0},{"$f":"SUM(E5:E13)","v":0},0,0,{"$f":"SUM(H5:H13)","v":0},0,0,0,{"$f":"SUM(L12:L13)","v":0},0,0,0,0,0]
[]
["Categoria","Ano 3",null,null,null,null,null,null,null,"Ano 4"]
[null,"Qtd Inicial ","Aquis.","Nasc.","Perda","Venda","Qtd Final","Qtd Média",null,"Qtd Inicial ","Aquis.","Nasc.","Perda","Venda","Qtd Final","Qtd Média"]
[null,"(cab.)","(cab.)","(cab.)","(cab.)","(cab.)","(cab.)","(cab.)","(UA)","(cab.)","(cab.)","(cab.)","(cab.)","(cab.)","(cab.)","(cab.)","(UA)"]
["Reprodutores",{"$f":"O5","v":0},{"$f":"Pecuária!$E19","v":0},null,{"$f":"ROUND((B19+C19)*Pecuária!$C$47,0)","v":0},{"$f":"ROUND((B19+C19-E19)*Pecuária!$C$84,0)","v":0},{"$f":"ROUND(B19+C19-E19-F19,0)","v":0},{"$f":"ROUND(SUM(B19,C19)-SUM(E19,F19)/2,0)","v":0},{"$f":"ROUND(H19*Pecuária!$C$72,0)","v":0},{"$f":"G19","v":0},{"$f":"Pecuária!$E19","v":0},null,{"$f":"ROUND((J19+K19)*Pecuária!$C$47,0)","v":0},{"$f":"ROUND((J19+K19-M19)*Pecuária!$C$84,0)","v":0},{"$f":"ROUND(J19+K19-M19-N19,0)","v":0},{"$f":"ROUND(SUM(J19,K19)-SUM(M19,N19)/2,0)","v":0},{"$f":"ROUND(P19*Pecuária!$C$72,0)","v":0}]
["Matrizes",{"$f":"O6+O9","v":0},{"$f":"Pecuária!$E20","v":0},null,{"$f":"ROUND((B20+C20)*Pecuária!$C$47,0)","v":0},{"$f":"ROUND((B20+C20-E20)*Pecuária!$C$85,0)","v":0},0,{"$f":"ROUND(SUM(B20,C20)-SUM(E20,F20)/2,0)","v":0},{"$f":"ROUND(H20*Pecuária!$C$73,0)","v":0},{"$f":"G20+G23","v":0},{"$f":"Pecuária!$E20","v":0},null,{"$f":"ROUND((J20+K20)*Pecuária!$C$47,0)","v":0},{"$f":"ROUND((J20+K20-M20)*Pecuária!$C$85,0)","v":0},{"$f":"ROUND(J20+K20-M20-N20,0)","v":0},{"$f":"ROUND(SUM(J20,K20)-SUM(M20,N20)/2,0)","v":0},{"$f":"ROUND(P20*Pecuária!$C$73,0)","v":0}]
["Bois",{"$f":"O7+O8","v":0},{"$f":"Pecuária!$E21","v":0},null,{"$f":"ROUND((B21+C21)*Pecuária!$C$47,0)","v":0},{"$f":"IF(OR(Pecuária!$C$86=\"bois\",Pecuária!$C$87=\"bois\"),ROUND((B21+C21-E21)*100%,0),\"0\")","v":"0"},0,{"$f":"ROUND(SUM(B21,C21)-E21/2,0)","v":0},{"$f":"ROUND(H21*Pecuária!$C$74,0)","v":0},{"$f":"G21+G22","v":0},{"$f":"Pecuária!$E21","v":0},null,{"$f":"ROUND((J21+K21)*Pecuária!$C$47,0)","v":0},{"$f":"IF(OR(Pecuária!$C$86=\"bois\",Pecuária!$C$87=\"bois\"),ROUND((J21+K21-M21)*100%,0),\"0\")","v":"0"},0,{"$f":"ROUND(SUM(J21,K21)-M21/2,0)","v":0},{"$f":"ROUND(P21*Pecuária!$C$74,0)","v":0}]
["Novilhos",{"$f":"O10","v":0},{"$f":"Pecuária!$E22","v":0},null,{"$f":"ROUND((B22+C22)*Pecuária!$C$46,0)","v":0},{"$f":"IF(OR(Pecuária!$C$86=\"novilho\",Pecuária!$C$87=\"novilho\"),ROUND((B22+C22-E22)*100%,0),\"0\")","v":"0"},0,{"$f":"ROUND(SUM(B22,C22)-E22/2,0)","v":0},{"$f":"ROUND(H22*Pecuária!$C$75,0)","v":0},{"$f":"G24","v":0},{"$f":"Pecuária!$E22","v":0},null,{"$f":"ROUND((J22+K22)*Pecuária!$C$46,0)","v":0},{"$f":"IF(OR(Pecuária!$C$86=\"novilho\",Pecuária!$C$87=\"novilho\"),ROUND((J22+K22-M22)*100%,0),\"0\")","v":"0"},0,{"$f":"ROUND(SUM(J22,K22)-M22/2,0)","v":0},{"$f":"ROUND(P22*Pecuária!$C$75,0)","v":0}]
["Novilhas ",{"$f":"O11","v":0},{"$f":"Pecuária!$E23","v":0},null,{"$f":"ROUND((B23+C23)*Pecuária!$C$46,0)","v":0},{"$f":"IF(OR(Pecuária!$C$88=\"novilha\",Pecuária!$C$89=\"novilha\"),ROUND((B23+C23-E23)*100%,0),\"0\")","v":"0"},0,{"$f":"ROUND(SUM(B23,C23)-E23/2,0)","v":0},{"$f":"ROUND(H23*Pecuária!$C$76,0)","v":0},{"$f":"G25","v":0},{"$f":"Pecuária!$E23","v":0},null,{"$f":"ROUND((J23+K23)*Pecuária!$C$46,0)","v":0},{"$f":"IF(OR(Pecuária!$C$88=\"novilha\",Pecuária!$C$89=\"novilha\"),ROUND((J23+K23-M23)*100%,0),\"0\")","v":"0"},0,{"$f":"ROUND(SUM(J23,K23)-M23/2,0)","v":0},{"$f":"ROUND(P23*Pecuária!$C$76,0)","v":0}]
["Garrotes",{"$f":"O12","v":0},{"$f":"Pecuária!$E24","v":0},null,{"$f":"ROUND((B24+C24)*Pecuária!$C$45,0)","v":0},{"$f":"IF(OR(Pecuária!$C$86=\"garrote\",Pecuária!$C$87=\"garrote\"),ROUND((B24+C24-E24)*100%,0),\"0\")","v":"0"},0,{"$f":"ROUND(SUM(B24,C24)-E24/2,0)","v":0},{"$f":"ROUND(H24*Pecuária!$C$77,0)","v":0},{"$f":"G26","v":0},{"$f":"Pecuária!$E24","v":0},null,{"$f":"ROUND((J24+K24)*Pecuária!$C$45,0)","v":0},{"$f":"IF(OR(Pecuária!$C$86=\"garrote\",Pecuária!$C$87=\"garrote\"),ROUND((J24+K24-M24)*100%,0),\"0\")","v":"0"},0,{"$f":"ROUND(SUM(J24,K24)-M24/2,0)","v":0},{"$f":"ROUND(P24*Pecuária!$C$77,0)","v":0}]
["Garrotas ",{"$f":"O13","v":0},{"$f":"Pecuária!$E25","v":0},null,{"$f":"ROUND((B25+C25)*Pecuária!$C$45,0)","v":0},{"$f":"IF(OR(Pecuária!$C$88=\"garrota\",Pecuária!$C$89=\"garrota\"),ROUND((B25+C25-E25)*100%,0),\"0\")","v":"0"},0,{"$f":"ROUND(SUM(B25,C25)-E25/2,0)","v":0},{"$f":"ROUND(H25*Pecuária!$C$78,0)","v":0},{"$f":"G27","v":0},{"$f":"Pecuária!$E25","v":0},null,{"$f":"ROUND((J25+K25)*Pecuária!$C$45,0)","v":0},{"$f":"IF(OR(Pecuária!$C$88=\"garrota\",Pecuária!$C$89=\"garrota\"),ROUND((J25+K25-M25)*100%,0),\"0\")","v":"0"},0,{"$f":"ROUND(SUM(J25,K25)-M25/2,0)","v":0},{"$f":"ROUND(P25*Pecuária!$C$78,0)","v":0}]
["Bezerros ",null,{"$f":"Pecuária!$E26","v":0},{"$f":"$B20*Pecuária!$C$43*50%+$C20*Pecuária!$C$43/2*50%","v":0},{"$f":"ROUND((B26+C26+D26)*Pecuária!$C$44,0)","v":0},{"$f":"IF(OR(Pecuária!$C$86=\"bezerro\",Pecuária!$C$87=\"bezerro\"),ROUND((B26+C26+D26-E26)*100%,0),\"0\")","v":"0"},{"$f":"ROUND(B26+C26+D26-E26-F26,0)","v":0},{"$f":"ROUND(SUM(B26,C26)+D26/2-E26/2,0)","v":0},{"$f":"ROUND(H26*Pecuária!$C$79,0)","v":0},null,{"$f":"Pecuária!$E26","v":0},{"$f":"J20*Pecuária!$C$43*50%+K20*Pecuária!$C$43/2*50%","v":0},{"$f":"ROUND((J26+K26+L26)*Pecuária!$C$44,0)","v":0},{"$f":"IF(OR(Pecuária!$C$86=\"bezerro\",Pecuária!$C$87=\"bezerro\"),ROUND((J26+K26+L26-M26)*100%,0),\"0\")","v":"0"},{"$f":"ROUND(J26+K26+L26-M26-N26,0)","v":0},{"$f":"ROUND(SUM(J26,K26)+L26/2-M26/2,0)","v":0},{"$f":"ROUND(P26*Pecuária!$C$79,0)","v":0}]
["Bezerras ",null,{"$f":"Pecuária!$E27","v":0},{"$f":"$B20*Pecuária!$C$43*50%+$C20*Pecuária!$C$43/2*50%","v":0},{"$f":"ROUND((B27+C27+D27)*Pecuária!$C$44,0)","v":0},{"$f":"IF(OR(Pecuária!$C$88=\"bezerra\",Pecuária!$C$89=\"bezerra\"),ROUND((B27+C27+D27-E27)*100%,0),\"0\")","v":"0"},{"$f":"ROUND(B27+C27+D27-E27-F27,0)","v":0},{"$f":"ROUND(SUM(B27,C27)+D27/2-E27/2,0)","v":0},{"$f":"ROUND(H27*Pecuária!$C$80,0)","v":0},null,{"$f":"Pecuária!$E27","v":0},{"$f":"$J20*Pecuária!$C$43*50%+$K20*Pecuária!$C$43/2*50%","v":0},{"$f":"ROUND((J27+K27+L27)*Pecuária!$C$44,0)","v":0},{"$f":"IF(OR(Pecuária!$C$88=\"bezerra\",Pecuária!$C$89=\"bezerra\"),ROUND((J27+K27+L27-M27)*100%,0),\"0\")","v":"0"},{"$f":"ROUND(J27+K27+L27-M27-N27,0)","v":0},{"$f":"ROUND(SUM(J27,K27)+L27/2-M27/2,0)","v":0},{"$f":"ROUND(P27*Pecuária!$C$80,0)","v":0}]
["Total",{"$f":"SUM(B19:B27)","v":0},0,{"$f":"SUM(D26:D27)","v":0},0,0,0,0,0,{"$f":"SUM(J19:J27)","v":0},{"$f":"SUM(K19:K27)","v":0},{"$f":"SUM(L26:L27)","v":0},0,0,0,0,0]
[]
["Categoria","Ano 5",null,null,null,null,null,null,null,"Ano 6"]
[null,"Qtd Inicial ","Aquis.","Nasc.","Perda","Venda","Qtd Final","Qtd Média",null,"Qtd Inicial ","Aquis.","Nasc.","Perda","Venda","Qtd Final","Qtd Média"]
[null,"(cab.)","(cab.)","(cab.)","(cab.)","(cab.)","(cab.)","(cab.)","(UA)","(cab.)","(cab.)","(cab.)","(cab.)","(cab.)","(cab.)","(cab.)","(UA)"]
["Reprodutores",{"$f":"O19","v":0},{"$f":"Pecuária!$E19","v":0},null,{"$f":"ROUND((B33+C33)*Pecuária!$C$47,0)","v":0},{"$f":"ROUND((B33+C33-E33)*Pecuária!$C$84,0)","v":0},{"$f":"ROUND(B33+C33-E33-F33,0)","v":0},{"$f":"ROUND(SUM(B33,C33)-SUM(E33,F33)/2,0)","v":0},{"$f":"ROUND(H33*Pecuária!$C$72,0)","v":0},{"$f":"G33","v":0},{"$f":"Pecuária!$E19","v":0},null,{"$f":"ROUND((J33+K33)*Pecuária!$C$47,0)","v":0},{"$f":"ROUND((J33+K33-M33)*Pecuária!$C$84,0)","v":0},{"$f":"ROUND(J33+K33-M33-N33,0)","v":0},{"$f":"ROUND(SUM(J33,K33)-SUM(M33,N33)/2,0)","v":0},{"$f":"ROUND(P33*Pecuária!$C$72,0)","v":0}]
["Matrizes",{"$f":"O20+O23","v":0},{"$f":"Pecuária!$E20","v":0},null,{"$f":"ROUND((B34+C34)*Pecuária!$C$47,0)","v":0},{"$f":"ROUND((B34+C34-E34)*Pecuária!$C$85,0)","v":0},0,{"$f":"ROUND(SUM(B34,C34)-SUM(E34,F34)/2,0)","v":0},{"$f":"ROUND(H34*Pecuária!$C$73,0)","v":0},{"$f":"G34+G37","v":0},{"$f":"Pecuária!$E20","v":0},null,{"$f":"ROUND((J34+K34)*Pecuária!$C$47,0)","v":0},{"$f":"ROUND((J34+K34-M34)*Pecuária!$C$85,0)","v":0},0,{"$f":"ROUND(SUM(J34,K34)-SUM(M34,N34)/2,0)","v":0},{"$f":"ROUND(P34*Pecuária!$C$73,0)","v":0}]
["Bois",{"$f":"O21+O22","v":0},{"$f":"Pecuária!$E21","v":0},null,{"$f":"ROUND((B35+C35)*Pecuária!$C$47,0)","v":0},{"$f":"IF(OR(Pecuária!$C$86=\"bois\",Pecuária!$C$87=\"bois\"),ROUND((B35+C35-E35)*100%,0),\"0\")","v":"0"},0,{"$f":"ROUND(SUM(B35,C35)-E35/2,0)","v":0},{"$f":"ROUND(H35*Pecuária!$C$74,0)","v":0},{"$f":"G35+G36","v":0},{"$f":"Pecuária!$E21","v":0},null,{"$f":"ROUND((J35+K35)*Pecuária!$C$47,0)","v":0},{"$f":"IF(OR(Pecuária!$C$86=\"bois\",Pecuária!$C$87=\"bois\"),ROUND((J35+K35-M35)*100%,0),\"0\")","v":"0"},0,{"$f":"ROUND(SUM(J35,K35)-M35/2,0)","v":0},{"$f":"ROUND(P35*Pecuária!$C$74,0)","v":0}]
["Novilhos",{"$f":"O24","v":0},{"$f":"Pecuária!$E22","v":0},null,{"$f":"ROUND((B36+C36)*Pecuária!$C$46,0)","v":0},{"$f":"IF(OR(Pecuária!$C$86=\"novilho\",Pecuária!$C$87=\"novilho\"),ROUND((B36+C36-E36)*100%,0),\"0\")","v":"0"},0,{"$f":"ROUND(SUM(B36,C36)-E36/2,0)","v":0},{"$f":"ROUND(H36*Pecuária!$C$75,0)","v":0},{"$f":"G38","v":0},{"$f":"Pecuária!$E22","v":0},null,{"$f":"ROUND((J36+K36)*Pecuária!$C$46,0)","v":0},{"$f":"IF(OR(Pecuária!$C$86=\"novilho\",Pecuária!$C$87=\"novilho\"),ROUND((J36+K36-M36)*100%,0),\"0\")","v":"0"},0,{"$f":"ROUND(SUM(J36,K36)-M36/2,0)","v":0},{"$f":"ROUND(P36*Pecuária!$C$75,0)","v":0}]
["Novilhas ",{"$f":"O25","v":0},{"$f":"Pecuária!$E23","v":0},null,{"$f":"ROUND((B37+C37)*Pecuária!$C$46,0)","v":0},{"$f":"IF(OR(Pecuária!$C$88=\"novilha\",Pecuária!$C$89=\"novilha\"),ROUND((B37+C37-E37)*100%,0),\"0\")","v":"0"},0,{"$f":"ROUND(SUM(B37,C37)-E37/2,0)","v":0},{"$f":"ROUND(H37*Pecuária!$C$76,0)","v":0},{"$f":"G39","v":0},{"$f":"Pecuária!$E23","v":0},null,{"$f":"ROUND((J37+K37)*Pecuária!$C$46,0)","v":0},{"$f":"IF(OR(Pecuária!$C$88=\"novilha\",Pecuária!$C$89=\"novilha\"),ROUND((J37+K37-M37)*100%,0),\"0\")","v":"0"},0,{"$f":"ROUND(SUM(J37,K37)-M37/2,0)","v":0},{"$f":"ROUND(P37*Pecuária!$C$76,0)","v":0}]
["Garrotes",{"$f":"O26","v":0},{"$f":"Pecuária!$E24","v":0},null,{"$f":"ROUND((B38+C38)*Pecuária!$C$45,0)","v":0},{"$f":"IF(OR(Pecuária!$C$86=\"garrote\",Pecuária!$C$87=\"garrote\"),ROUND((B38+C38-E38)*100%,0),\"0\")","v":"0"},0,{"$f":"ROUND(SUM(B38,C38)-E38/2,0)","v":0},{"$f":"ROUND(H38*Pecuária!$C$77,0)","v":0},{"$f":"G40","v":0},{"$f":"Pecuária!$E24","v":0},null,{"$f":"ROUND((J38+K38)*Pecuária!$C$45,0)","v":0},{"$f":"IF(OR(Pecuária!$C$86=\"garrote\",Pecuária!$C$87=\"garrote\"),ROUND((J38+K38-M38)*100%,0),\"0\")","v":"0"},0,{"$f":"ROUND(SUM(J38,K38)-M38/2,0)","v":0},{"$f":"ROUND(P38*Pecuária!$C$77,0)","v":0}]
["Garrotas ",{"$f":"O27","v":0},{"$f":"Pecuária!$E25","v":0},null,{"$f":"ROUND((B39+C39)*Pecuária!$C$45,0)","v":0},{"$f":"IF(OR(Pecuária!$C$88=\"garrota\",Pecuária!$C$89=\"garrota\"),ROUND((B39+C39-E39)*100%,0),\"0\")","v":"0"},0,{"$f":"ROUND(SUM(B39,C39)-E39/2,0)","v":0},{"$f":"ROUND(H39*Pecuária!$C$78,0)","v":0},{"$f":"G41","v":0},{"$f":"Pecuária!$E25","v":0},null,{"$f":"ROUND((J39+K39)*Pecuária!$C$45,0)","v":0},{"$f":"IF(OR(Pecuária!$C$88=\"garrota\",Pecuária!$C$89=\"garrota\"),ROUND((J39+K39-M39)*100%,0),\"0\")","v":"0"},0,{"$f":"ROUND(SUM(J39,K39)-M39/2,0)","v":0},{"$f":"ROUND(P39*Pecuária!$C$78,0)","v":0}]
["Bezerros ",null,{"$f":"Pecuária!$E26","v":0},{"$f":"$B34*Pecuária!$C$43*50%+$C34*Pecuária!$C$43/2*50%","v":0},{"$f":"ROUND((B40+C40+D40)*Pecuária!$C$44,0)","v":0},{"$f":"IF(OR(Pecuária!$C$86=\"bezerro\",Pecuária!$C$87=\"bezerro\"),ROUND((B40+C40+D40-E40)*100%,0),\"0\")","v":"0"},{"$f":"ROUND(B40+C40+D40-E40-F40,0)","v":0},{"$f":"ROUND(SUM(B40,C40)+D40/2-E40/2,0)","v":0},{"$f":"ROUND(H40*Pecuária!$C$79,0)","v":0},null,{"$f":"Pecuária!$E26","v":0},{"$f":"J34*Pecuária!$C$43*50%+K34*Pecuária!$C$43/2*50%","v":0},{"$f":"ROUND((J40+K40+L40)*Pecuária!$C$44,0)","v":0},{"$f":"IF(OR(Pecuária!$C$86=\"bezerro\",Pecuária!$C$87=\"bezerro\"),ROUND((J40+K40+L40-M40)*100%,0),\"0\")","v":"0"},{"$f":"ROUND(J40+K40+L40-M40-N40,0)","v":0},{"$f":"ROUND(SUM(J40,K40)+L40/2-M40/2,0)","v":0},{"$f":"ROUND(P40*Pecuária!$C$79,0)","v":0}]
["Bezerras ",null,{"$f":"Pecuária!$E27","v":0},{"$f":"$B34*Pecuária!$C$43*50%+$C34*Pecuária!$C$43/2*50%","v":0},{"$f":"ROUND((B41+C41+D41)*Pecuária!$C$44,0)","v":0},{"$f":"IF(OR(Pecuária!$C$88=\"bezerra\",Pecuária!$C$89=\"bezerra\"),ROUND((B41+C41+D41-E41)*100%,0),\"0\")","v":"0"},{"$f":"ROUND(B41+C41+D41-E41-F41,0)","v":0},{"$f":"ROUND(SUM(B41,C41)+D41/2-E41/2,0)","v":0},{"$f":"ROUND(H41*Pecuária!$C$80,0)","v":0},null,{"$f":"Pecuária!$E27","v":0},{"$f":"$J34*Pecuária!$C$43*50%+$K34*Pecuária!$C$43/2*50%","v":0},{"$f":"ROUND((J41+K41+L41)*Pecuária!$C$44,0)","v":0},{"$f":"IF(OR(Pecuária!$C$88=\"bezerra\",Pecuária!$C$89=\"bezerra\"),ROUND((J41+K41+L41-M41)*100%,0),\"0\")","v":"0"},{"$f":"ROUND(J41+K41+L41-M41-N41,0)","v":0},{"$f":"ROUND(SUM(J41,K41)+L41/2-M41/2,0)","v":0},{"$f":"ROUND(P41*Pecuária!$C$80,0)","v":0}]
["Total",{"$f":"SUM(B33:B41)","v":0},{"$f":"SUM(C33:C41)","v":0},{"$f":"SUM(D40:D41)","v":0},{"$f":"SUM(E33:E41)","v":0},0,0,0,0,0,0,{"$f":"SUM(L40:L41)","v":0},0,0,0,0,0]
[]
["Categoria","Ano 7",null,null,null,null,null,null,null,"Ano 8"]
[null,"Qtd Inicial ","Aquis.","Nasc.","Perda","Venda","Qtd Final","Qtd Média",null,"Qtd Inicial ","Aquis.","Nasc.","Perda","Venda","Qtd Final","Qtd Média"]
[null,"(cab.)","(cab.)","(cab.)","(cab.)","(cab.)","(cab.)","(cab.)","(UA)","(cab.)","(cab.)","(cab.)","(cab.)","(cab.)","(cab.)","(cab.)","(UA)"]
["Reprodutores",{"$f":"O33","v":0},{"$f":"Pecuária!$E19","v":0},null,{"$f":"ROUND((B47+C47)*Pecuária!$C$47,0)","v":0},{"$f":"ROUND((B47+C47-E47)*Pecuária!$C$84,0)","v":0},{"$f":"ROUND(B47+C47-E47-F47,0)","v":0},{"$f":"ROUND(SUM(B47,C47)-SUM(E47,F47)/2,0)","v":0},{"$f":"ROUND(H47*Pecuária!$C$72,0)","v":0},{"$f":"G47","v":0},{"$f":"Pecuária!$E19","v":0},null,{"$f":"ROUND((J47+K47)*Pecuária!$C$47,0)","v":0},{"$f":"ROUND((J47+K47-M47)*Pecuária!$C$84,0)","v":0},{"$f":"ROUND(J47+K47-M47-N47,0)","v":0},{"$f":"ROUND(SUM(J47,K47)-SUM(M47,N47)/2,0)","v":0},{"$f":"ROUND(P47*Pecuária!$C$72,0)","v":0}]
["Matrizes",{"$f":"O34+O37","v":0},{"$f":"Pecuária!$E20","v":0},null,{"$f":"ROUND((B48+C48)*Pecuária!$C$47,0)","v":0},{"$f":"ROUND((B48+C48-E48)*Pecuária!$C$85,0)","v":0},0,{"$f":"ROUND(SUM(B48,C48)-SUM(E48,F48)/2,0)","v":0},{"$f":"ROUND(H48*Pecuária!$C$73,0)","v":0},{"$f":"G48+G51","v":0},{"$f":"Pecuária!$E20","v":0},null,{"$f":"ROUND((J48+K48)*Pecuária!$C$47,0)","v":0},{"$f":"ROUND((J48+K48-M48)*Pecuária!$C$85,0)","v":0},0,{"$f":"ROUND(SUM(J48,K48)-SUM(M48,N48)/2,0)","v":0},{"$f":"ROUND(P48*Pecuária!$C$73,0)","v":0}]
["Bois",{"$f":"O35+O36","v":0},{"$f":"Pecuária!$E21","v":0},null,{"$f":"ROUND((B49+C49)*Pecuária!$C$47,0)","v":0},{"$f":"IF(OR(Pecuária!$C$86=\"bois\",Pecuária!$C$87=\"bois\"),ROUND((B49+C49-E49)*100%,0),\"0\")","v":"0"},0,{"$f":"ROUND(SUM(B49,C49)-E49/2,0)","v":0},{"$f":"ROUND(H49*Pecuária!$C$74,0)","v":0},{"$f":"G49+G50","v":0},{"$f":"Pecuária!$E21","v":0},null,{"$f":"ROUND((J49+K49)*Pecuária!$C$47,0)","v":0},{"$f":"IF(OR(Pecuária!$C$86=\"bois\",Pecuária!$C$87=\"bois\"),ROUND((J49+K49-M49)*100%,0),\"0\")","v":"0"},0,{"$f":"ROUND(SUM(J49,K49)-M49/2,0)","v":0},{"$f":"ROUND(P49*Pecuária!$C$74,0)","v":0}]
["Novilhos",{"$f":"O38","v":0},{"$f":"Pecuária!$E22","v":0},null,{"$f":"ROUND((B50+C50)*Pecuária!$C$46,0)","v":0},{"$f":"IF(OR(Pecuária!$C$86=\"novilho\",Pecuária!$C$87=\"novilho\"),ROUND((B50+C50-E50)*100%,0),\"0\")","v":"0"},0,{"$f":"ROUND(SUM(B50,C50)-E50/2,0)","v":0},{"$f":"ROUND(H50*Pecuária!$C$75,0)","v":0},{"$f":"G52","v":0},{"$f":"Pecuária!$E22","v":0},null,{"$f":"ROUND((J50+K50)*Pecuária!$C$46,0)","v":0},{"$f":"IF(OR(Pecuária!$C$86=\"novilho\",Pecuária!$C$87=\"novilho\"),ROUND((J50+K50-M50)*100%,0),\"0\")","v":"0"},0,{"$f":"ROUND(SUM(J50,K50)-M50/2,0)","v":0},{"$f":"ROUND(P50*Pecuária!$C$75,0)","v":0}]
["Novilhas ",{"$f":"O39","v":0},{"$f":"Pecuária!$E23","v":0},null,{"$f":"ROUND((B51+C51)*Pecuária!$C$46,0)","v":0},{"$f":"IF(OR(Pecuária!$C$88=\"novilha\",Pecuária!$C$89=\"novilha\"),ROUND((B51+C51-E51)*100%,0),\"0\")","v":"0"},0,{"$f":"ROUND(SUM(B51,C51)-E51/2,0)","v":0},{"$f":"ROUND(H51*Pecuária!$C$76,0)","v":0},{"$f":"G53","v":0},{"$f":"Pecuária!$E23","v":0},null,{"$f":"ROUND((J51+K51)*Pecuária!$C$46,0)","v":0},{"$f":"IF(OR(Pecuária!$C$88=\"novilha\",Pecuária!$C$89=\"novilha\"),ROUND((J51+K51-M51)*100%,0),\"0\")","v":"0"},0,{"$f":"ROUND(SUM(J51,K51)-M51/2,0)","v":0},{"$f":"ROUND(P51*Pecuária!$C$76,0)","v":0}]
["Garrotes",{"$f":"O40","v":0},{"$f":"Pecuária!$E24","v":0},null,{"$f":"ROUND((B52+C52)*Pecuária!$C$45,0)","v":0},{"$f":"IF(OR(Pecuária!$C$86=\"garrote\",Pecuária!$C$87=\"garrote\"),ROUND((B52+C52-E52)*100%,0),\"0\")","v":"0"},0,{"$f":"ROUND(SUM(B52,C52)-E52/2,0)","v":0},{"$f":"ROUND(H52*Pecuária!$C$77,0)","v":0},{"$f":"G54","v":0},{"$f":"Pecuária!$E24","v":0},null,{"$f":"ROUND((J52+K52)*Pecuária!$C$45,0)","v":0},{"$f":"IF(OR(Pecuária!$C$86=\"garrote\",Pecuária!$C$87=\"garrote\"),ROUND((J52+K52-M52)*100%,0),\"0\")","v":"0"},0,{"$f":"ROUND(SUM(J52,K52)-M52/2,0)","v":0},{"$f":"ROUND(P52*Pecuária!$C$77,0)","v":0}]
["Garrotas ",{"$f":"O41","v":0},{"$f":"Pecuária!$E25","v":0},null,{"$f":"ROUND((B53+C53)*Pecuária!$C$45,0)","v":0},{"$f":"IF(OR(Pecuária!$C$88=\"garrota\",Pecuária!$C$89=\"garrota\"),ROUND((B53+C53-E53)*100%,0),\"0\")","v":"0"},0,{"$f":"ROUND(SUM(B53,C53)-E53/2,0)","v":0},{"$f":"ROUND(H53*Pecuária!$C$78,0)","v":0},{"$f":"G55","v":0},{"$f":"Pecuária!$E25","v":0},null,{"$f":"ROUND((J53+K53)*Pecuária!$C$45,0)","v":0},{"$f":"IF(OR(Pecuária!$C$88=\"garrota\",Pecuária!$C$89=\"garrota\"),ROUND((J53+K53-M53)*100%,0),\"0\")","v":"0"},0,{"$f":"ROUND(SUM(J53,K53)-M53/2,0)","v":0},{"$f":"ROUND(P53*Pecuária!$C$78,0)","v":0}]
["Bezerros ",null,{"$f":"Pecuária!$E26","v":0},{"$f":"$B48*Pecuária!$C$43*50%+$C48*Pecuária!$C$43/2*50%","v":0},{"$f":"ROUND((B54+C54+D54)*Pecuária!$C$44,0)","v":0},{"$f":"IF(OR(Pecuária!$C$86=\"bezerro\",Pecuária!$C$87=\"bezerro\"),ROUND((B54+C54+D54-E54)*100%,0),\"0\")","v":"0"},{"$f":"ROUND(B54+C54+D54-E54-F54,0)","v":0},{"$f":"ROUND(SUM(B54,C54)+D54/2-E54/2,0)","v":0},{"$f":"ROUND(H54*Pecuária!$C$79,0)","v":0},null,{"$f":"Pecuária!$E26","v":0},{"$f":"J48*Pecuária!$C$43*50%+K48*Pecuária!$C$43/2*50%","v":0},{"$f":"ROUND((J54+K54+L54)*Pecuária!$C$44,0)","v":0},{"$f":"IF(OR(Pecuária!$C$86=\"bezerro\",Pecuária!$C$87=\"bezerro\"),ROUND((J54+K54+L54-M54)*100%,0),\"0\")","v":"0"},{"$f":"ROUND(J54+K54+L54-M54-N54,0)","v":0},{"$f":"ROUND(SUM(J54,K54)+L54/2-M54/2,0)","v":0},{"$f":"ROUND(P54*Pecuária!$C$79,0)","v":0}]
["Bezerras ",null,{"$f":"Pecuária!$E27","v":0},{"$f":"$B48*Pecuária!$C$43*50%+$C48*Pecuária!$C$43/2*50%","v":0},{"$f":"ROUND((B55+C55+D55)*Pecuária!$C$44,0)","v":0},{"$f":"IF(OR(Pecuária!$C$88=\"bezerra\",Pecuária!$C$89=\"bezerra\"),ROUND((B55+C55+D55-E55)*100%,0),\"0\")","v":"0"},{"$f":"ROUND(B55+C55+D55-E55-F55,0)","v":0},{"$f":"ROUND(SUM(B55,C55)+D55/2-E55/2,0)","v":0},{"$f":"ROUND(H55*Pecuária!$C$80,0)","v":0},null,{"$f":"Pecuária!$E27","v":0},{"$f":"$J48*Pecuária!$C$43*50%+$K48*Pecuária!$C$43/2*50%","v":0},{"$f":"ROUND((J55+K55+L55)*Pecuária!$C$44,0)","v":0},{"$f":"IF(OR(Pecuária!$C$88=\"bezerra\",Pecuária!$C$89=\"bezerra\"),ROUND((J55+K55+L55-M55)*100%,0),\"0\")","v":"0"},{"$f":"ROUND(J55+K55+L55-M55-N55,0)","v":0},{"$f":"ROUND(SUM(J55,K55)+L55/2-M55/2,0)","v":0},{"$f":"ROUND(P55*Pecuária!$C$80,0)","v":0}]
["Total",{"$f":"SUM(B47:B55)","v":0},{"$f":"SUM(C47:C55)","v":0},{"$f":"SUM(D54:D55)","v":0},{"$f":"SUM(E47:E55)","v":0},0,0,0,0,0,{"$f":"SUM(K47:K55)","v":0},{"$f":"SUM(L54:L55)","v":0},0,0,0,0,0]
[]
["Categoria","Ano 9",null,null,null,null,null,null,null,"Ano 10"]
[null,"Qtd Inicial ","Aquis.","Nasc.","Perda","Venda","Qtd Final","Qtd Média",null,"Qtd Inicial ","Aquis.","Nasc.","Perda","Venda","Qtd Final","Qtd Média"]
[null,"(cab.)","(cab.)","(cab.)","(cab.)","(cab.)","(cab.)","(cab.)","(UA)","(cab.)","(cab.)","(cab.)","(cab.)","(cab.)","(cab.)","(cab.)","(UA)"]
["Reprodutores",{"$f":"O47","v":0},{"$f":"Pecuária!$E19","v":0},null,{"$f":"ROUND((B61+C61)*Pecuária!$C$47,0)","v":0},{"$f":"ROUND((B61+C61-E61)*Pecuária!$C$84,0)","v":0},{"$f":"ROUND(B61+C61-E61-F61,0)","v":0},{"$f":"ROUND(SUM(B61,C61)-SUM(E61,F61)/2,0)","v":0},{"$f":"ROUND(H61*Pecuária!$C$72,0)","v":0},{"$f":"G61","v":0},{"$f":"Pecuária!$E19","v":0},null,{"$f":"ROUND((J61+K61)*Pecuária!$C$47,0)","v":0},{"$f":"ROUND((J61+K61-M61)*Pecuária!$C$84,0)","v":0},{"$f":"ROUND(J61+K61-M61-N61,0)","v":0},{"$f":"ROUND(SUM(J61,K61)-SUM(M61,N61)/2,0)","v":0},{"$f":"ROUND(P61*Pecuária!$C$72,0)","v":0}]
["Matrizes",{"$f":"O48+O51","v":0},{"$f":"Pecuária!$E20","v":0},null,{"$f":"ROUND((B62+C62)*Pecuária!$C$47,0)","v":0},{"$f":"ROUND((B62+C62-E62)*Pecuária!$C$85,0)","v":0},0,{"$f":"ROUND(SUM(B62,C62)-SUM(E62,F62)/2,0)","v":0},{"$f":"ROUND(H62*Pecuária!$C$73,0)","v":0},{"$f":"G62+G65","v":0},{"$f":"Pecuária!$E20","v":0},null,{"$f":"ROUND((J62+K62)*Pecuária!$C$47,0)","v":0},{"$f":"ROUND((J62+K62-M62)*Pecuária!$C$85,0)","v":0},0,{"$f":"ROUND(SUM(J62,K62)-SUM(M62,N62)/2,0)","v":0},{"$f":"ROUND(P62*Pecuária!$C$73,0)","v":0}]
["Bois",{"$f":"O49+O50","v":0},{"$f":"Pecuária!$E21","v":0},null,{"$f":"ROUND((B63+C63)*Pecuária!$C$47,0)","v":0},{"$f":"IF(OR(Pecuária!$C$86=\"bois\",Pecuária!$C$87=\"bois\"),ROUND((B63+C63-E63)*100%,0),\"0\")","v":"0"},0,{"$f":"ROUND(SUM(B63,C63)-E63/2,0)","v":0},{"$f":"ROUND(H63*Pecuária!$C$74,0)","v":0},{"$f":"G63+G64","v":0},{"$f":"Pecuária!$E21","v":0},null,{"$f":"ROUND((J63+K63)*Pecuária!$C$47,0)","v":0},{"$f":"IF(OR(Pecuária!$C$86=\"bois\",Pecuária!$C$87=\"bois\"),ROUND((J63+K63-M63)*100%,0),\"0\")","v":"0"},0,{"$f":"ROUND(SUM(J63,K63)-M63/2,0)","v":0},{"$f":"ROUND(P63*Pecuária!$C$74,0)","v":0}]
["Novilhos",{"$f":"O52","v":0},{"$f":"Pecuária!$E22","v":0},null,{"$f":"ROUND((B64+C64)*Pecuária!$C$46,0)","v":0},{"$f":"IF(OR(Pecuária!$C$86=\"novilho\",Pecuária!$C$87=\"novilho\"),ROUND((B64+C64-E64)*100%,0),\"0\")","v":"0"},0,{"$f":"ROUND(SUM(B64,C64)-E64/2,0)","v":0},{"$f":"ROUND(H64*Pecuária!$C$75,0)","v":0},{"$f":"G66","v":0},{"$f":"Pecuária!$E22","v":0},null,{"$f":"ROUND((J64+K64)*Pecuária!$C$46,0)","v":0},{"$f":"IF(OR(Pecuária!$C$86=\"novilho\",Pecuária!$C$87=\"novilho\"),ROUND((J64+K64-M64)*100%,0),\"0\")","v":"0"},0,{"$f":"ROUND(SUM(J64,K64)-M64/2,0)","v":0},{"$f":"ROUND(P64*Pecuária!$C$75,0)","v":0}]
["Novilhas ",{"$f":"O53","v":0},{"$f":"Pecuária!$E23","v":0},null,{"$f":"ROUND((B65+C65)*Pecuária!$C$46,0)","v":0},{"$f":"IF(OR(Pecuária!$C$88=\"novilha\",Pecuária!$C$89=\"novilha\"),ROUND((B65+C65-E65)*100%,0),\"0\")","v":"0"},0,{"$f":"ROUND(SUM(B65,C65)-E65/2,0)","v":0},{"$f":"ROUND(H65*Pecuária!$C$76,0)","v":0},{"$f":"G67","v":0},{"$f":"Pecuária!$E23","v":0},null,{"$f":"ROUND((J65+K65)*Pecuária!$C$46,0)","v":0},{"$f":"IF(OR(Pecuária!$C$88=\"novilha\",Pecuária!$C$89=\"novilha\"),ROUND((J65+K65-M65)*100%,0),\"0\")","v":"0"},0,{"$f":"ROUND(SUM(J65,K65)-M65/2,0)","v":0},{"$f":"ROUND(P65*Pecuária!$C$76,0)","v":0}]
["Garrotes",{"$f":"O54","v":0},{"$f":"Pecuária!$E24","v":0},null,{"$f":"ROUND((B66+C66)*Pecuária!$C$45,0)","v":0},{"$f":"IF(OR(Pecuária!$C$86=\"garrote\",Pecuária!$C$87=\"garrote\"),ROUND((B66+C66-E66)*100%,0),\"0\")","v":"0"},0,{"$f":"ROUND(SUM(B66,C66)-E66/2,0)","v":0},{"$f":"ROUND(H66*Pecuária!$C$77,0)","v":0},{"$f":"G68","v":0},{"$f":"Pecuária!$E24","v":0},null,{"$f":"ROUND((J66+K66)*Pecuária!$C$45,0)","v":0},{"$f":"IF(OR(Pecuária!$C$86=\"garrote\",Pecuária!$C$87=\"garrote\"),ROUND((J66+K66-M66)*100%,0),\"0\")","v":"0"},0,{"$f":"ROUND(SUM(J66,K66)-M66/2,0)","v":0},{"$f":"ROUND(P66*Pecuária!$C$77,0)","v":0}]
["Garrotas ",{"$f":"O55","v":0},{"$f":"Pecuária!$E25","v":0},null,{"$f":"ROUND((B67+C67)*Pecuária!$C$45,0)","v":0},{"$f":"IF(OR(Pecuária!$C$88=\"garrota\",Pecuária!$C$89=\"garrota\"),ROUND((B67+C67-E67)*100%,0),\"0\")","v":"0"},0,{"$f":"ROUND(SUM(B67,C67)-E67/2,0)","v":0},{"$f":"ROUND(H67*Pecuária!$C$78,0)","v":0},{"$f":"G69","v":0},{"$f":"Pecuária!$E25","v":0},null,{"$f":"ROUND((J67+K67)*Pecuária!$C$45,0)","v":0},{"$f":"IF(OR(Pecuária!$C$88=\"garrota\",Pecuária!$C$89=\"garrota\"),ROUND((J67+K67-M67)*100%,0),\"0\")","v":"0"},0,{"$f":"ROUND(SUM(J67,K67)-M67/2,0)","v":0},{"$f":"ROUND(P67*Pecuária!$C$78,0)","v":0}]
["Bezerros ",null,{"$f":"Pecuária!$E26","v":0},{"$f":"$B62*Pecuária!$C$43*50%+$C62*Pecuária!$C$43/2*50%","v":0},{"$f":"ROUND((B68+C68+D68)*Pecuária!$C$44,0)","v":0},{"$f":"IF(OR(Pecuária!$C$86=\"bezerro\",Pecuária!$C$87=\"bezerro\"),ROUND((B68+C68+D68-E68)*100%,0),\"0\")","v":"0"},{"$f":"ROUND(B68+C68+D68-E68-F68,0)","v":0},{"$f":"ROUND(SUM(B68,C68)+D68/2-E68/2,0)","v":0},{"$f":"ROUND(H68*Pecuária!$C$79,0)","v":0},null,{"$f":"Pecuária!$E26","v":0},{"$f":"J62*Pecuária!$C$43*50%+K62*Pecuária!$C$43/2*50%","v":0},{"$f":"ROUND((J68+K68+L68)*Pecuária!$C$44,0)","v":0},{"$f":"IF(OR(Pecuária!$C$86=\"bezerro\",Pecuária!$C$87=\"bezerro\"),ROUND((J68+K68+L68-M68)*100%,0),\"0\")","v":"0"},{"$f":"ROUND(J68+K68+L68-M68-N68,0)","v":0},{"$f":"ROUND(SUM(J68,K68)+L68/2-M68/2,0)","v":0},{"$f":"ROUND(P68*Pecuária!$C$79,0)","v":0}]
["Bezerras ",null,{"$f":"Pecuária!$E27","v":0},{"$f":"$B62*Pecuária!$C$43*50%+$C62*Pecuária!$C$43/2*50%","v":0},{"$f":"ROUND((B69+C69+D69)*Pecuária!$C$44,0)","v":0},{"$f":"IF(OR(Pecuária!$C$88=\"bezerra\",Pecuária!$C$89=\"bezerra\"),ROUND((B69+C69+D69-E69)*100%,0),\"0\")","v":"0"},{"$f":"ROUND(B69+C69+D69-E69-F69,0)","v":0},{"$f":"ROUND(SUM(B69,C69)+D69/2-E69/2,0)","v":0},{"$f":"ROUND(H69*Pecuária!$C$80,0)","v":0},null,{"$f":"Pecuária!$E27","v":0},{"$f":"$J62*Pecuária!$C$43*50%+$K62*Pecuária!$C$43/2*50%","v":0},{"$f":"ROUND((J69+K69+L69)*Pecuária!$C$44,0)","v":0},{"$f":"IF(OR(Pecuária!$C$88=\"bezerra\",Pecuária!$C$89=\"bezerra\"),ROUND((J69+K69+L69-M69)*100%,0),\"0\")","v":"0"},{"$f":"ROUND(J69+K69+L69-M69-N69,0)","v":0},{"$f":"ROUND(SUM(J69,K69)+L69/2-M69/2,0)","v":0},{"$f":"ROUND(P69*Pecuária!$C$80,0)","v":0}]
["Total",{"$f":"SUM(B61:B69)","v":0},{"$f":"SUM(C61:C69)","v":0},{"$f":"SUM(D68:D69)","v":0},0,0,0,0,0,0,0,{"$f":"SUM(L68:L69)","v":0},0,0,0,0,0]
["Categoria","Ano 11",null,null,null,null,null,null,null,"Ano 12"]
[null,"Qtd Inicial ","Aquis.","Nasc.","Perda","Venda","Qtd Final","Qtd Média",null,"Qtd Inicial ","Aquis.","Nasc.","Perda","Venda","Qtd Final","Qtd Média"]
[null,"(cab.)","(cab.)","(cab.)","(cab.)","(cab.)","(cab.)","(cab.)","(UA)","(cab.)","(cab.)","(cab.)","(cab.)","(cab.)","(cab.)","(cab.)","(UA)"]
["Reprodutores",{"$f":"O61","v":0},{"$f":"Pecuária!$E19","v":0},null,{"$f":"ROUND((B74+C74)*Pecuária!$C$47,0)","v":0},{"$f":"ROUND((B74+C74-E74)*Pecuária!$C$84,0)","v":0},{"$f":"ROUND(B74+C74-E74-F74,0)","v":0},{"$f":"ROUND(SUM(B74,C74)-SUM(E74,F74)/2,0)","v":0},{"$f":"ROUND(H74*Pecuária!$C$72,0)","v":0},{"$f":"G74","v":0},{"$f":"Pecuária!$E19","v":0},null,{"$f":"ROUND((J74+K74)*Pecuária!$C$47,0)","v":0},{"$f":"ROUND((J74+K74-M74)*Pecuária!$C$84,0)","v":0},{"$f":"ROUND(J74+K74-M74-N74,0)","v":0},{"$f":"ROUND(SUM(J74,K74)-SUM(M74,N74)/2,0)","v":0},{"$f":"ROUND(P74*Pecuária!$C$72,0)","v":0}]
["Matrizes",{"$f":"O62+O65","v":0},{"$f":"Pecuária!$E20","v":0},null,{"$f":"ROUND((B75+C75)*Pecuária!$C$47,0)","v":0},{"$f":"ROUND((B75+C75-E75)*Pecuária!$C$85,0)","v":0},0,{"$f":"ROUND(SUM(B75,C75)-SUM(E75,F75)/2,0)","v":0},{"$f":"ROUND(H75*Pecuária!$C$73,0)","v":0},{"$f":"G75+G78","v":0},{"$f":"Pecuária!$E20","v":0},null,{"$f":"ROUND((J75+K75)*Pecuária!$C$47,0)","v":0},{"$f":"ROUND((J75+K75-M75)*Pecuária!$C$85,0)","v":0},0,{"$f":"ROUND(SUM(J75,K75)-SUM(M75,N75)/2,0)","v":0},{"$f":"ROUND(P75*Pecuária!$C$73,0)","v":0}]
["Bois",{"$f":"O63+O64","v":0},{"$f":"Pecuária!$E21","v":0},null,{"$f":"ROUND((B76+C76)*Pecuária!$C$47,0)","v":0},{"$f":"IF(OR(Pecuária!$C$86=\"bois\",Pecuária!$C$87=\"bois\"),ROUND((B76+C76-E76)*100%,0),\"0\")","v":"0"},0,{"$f":"ROUND(SUM(B76,C76)-E76/2,0)","v":0},{"$f":"ROUND(H76*Pecuária!$C$74,0)","v":0},{"$f":"G76+G77","v":0},{"$f":"Pecuária!$E21","v":0},null,{"$f":"ROUND((J76+K76)*Pecuária!$C$47,0)","v":0},{"$f":"IF(OR(Pecuária!$C$86=\"bois\",Pecuária!$C$87=\"bois\"),ROUND((J76+K76-M76)*100%,0),\"0\")","v":"0"},0,{"$f":"ROUND(SUM(J76,K76)-M76/2,0)","v":0},{"$f":"ROUND(P76*Pecuária!$C$74,0)","v":0}]
["Novilhos",{"$f":"O66","v":0},{"$f":"Pecuária!$E22","v":0},null,{"$f":"ROUND((B77+C77)*Pecuária!$C$46,0)","v":0},{"$f":"IF(OR(Pecuária!$C$86=\"novilho\",Pecuária!$C$87=\"novilho\"),ROUND((B77+C77-E77)*100%,0),\"0\")","v":"0"},0,{"$f":"ROUND(SUM(B77,C77)-E77/2,0)","v":0},{"$f":"ROUND(H77*Pecuária!$C$75,0)","v":0},{"$f":"G79","v":0},{"$f":"Pecuária!$E22","v":0},null,{"$f":"ROUND((J77+K77)*Pecuária!$C$46,0)","v":0},{"$f":"IF(OR(Pecuária!$C$86=\"novilho\",Pecuária!$C$87=\"novilho\"),ROUND((J77+K77-M77)*100%,0),\"0\")","v":"0"},0,{"$f":"ROUND(SUM(J77,K77)-M77/2,0)","v":0},{"$f":"ROUND(P77*Pecuária!$C$75,0)","v":0}]
["Novilhas ",{"$f":"O67","v":0},{"$f":"Pecuária!$E23","v":0},null,{"$f":"ROUND((B78+C78)*Pecuária!$C$46,0)","v":0},{"$f":"IF(OR(Pecuária!$C$88=\"novilha\",Pecuária!$C$89=\"novilha\"),ROUND((B78+C78-E78)*100%,0),\"0\")","v":"0"},0,{"$f":"ROUND(SUM(B78,C78)-E78/2,0)","v":0},{"$f":"ROUND(H78*Pecuária!$C$76,0)","v":0},{"$f":"G80","v":0},{"$f":"Pecuária!$E23","v":0},null,{"$f":"ROUND((J78+K78)*Pecuária!$C$46,0)","v":0},{"$f":"IF(OR(Pecuária!$C$88=\"novilha\",Pecuária!$C$89=\"novilha\"),ROUND((J78+K78-M78)*100%,0),\"0\")","v":"0"},0,{"$f":"ROUND(SUM(J78,K78)-M78/2,0)","v":0},{"$f":"ROUND(P78*Pecuária!$C$76,0)","v":0}]
["Garrotes",{"$f":"O68","v":0},{"$f":"Pecuária!$E24","v":0},null,{"$f":"ROUND((B79+C79)*Pecuária!$C$45,0)","v":0},{"$f":"IF(OR(Pecuária!$C$86=\"garrote\",Pecuária!$C$87=\"garrote\"),ROUND((B79+C79-E79)*100%,0),\"0\")","v":"0"},0,{"$f":"ROUND(SUM(B79,C79)-E79/2,0)","v":0},{"$f":"ROUND(H79*Pecuária!$C$77,0)","v":0},{"$f":"G81","v":0},{"$f":"Pecuária!$E24","v":0},null,{"$f":"ROUND((J79+K79)*Pecuária!$C$45,0)","v":0},{"$f":"IF(OR(Pecuária!$C$86=\"garrote\",Pecuária!$C$87=\"garrote\"),ROUND((J79+K79-M79)*100%,0),\"0\")","v":"0"},0,{"$f":"ROUND(SUM(J79,K79)-M79/2,0)","v":0},{"$f":"ROUND(P79*Pecuária!$C$77,0)","v":0}]
["Garrotas ",{"$f":"O69","v":0},{"$f":"Pecuária!$E25","v":0},null,{"$f":"ROUND((B80+C80)*Pecuária!$C$45,0)","v":0},{"$f":"IF(OR(Pecuária!$C$88=\"garrota\",Pecuária!$C$89=\"garrota\"),ROUND((B80+C80-E80)*100%,0),\"0\")","v":"0"},0,{"$f":"ROUND(SUM(B80,C80)-E80/2,0)","v":0},{"$f":"ROUND(H80*Pecuária!$C$78,0)","v":0},{"$f":"G82","v":0},{"$f":"Pecuária!$E25","v":0},null,{"$f":"ROUND((J80+K80)*Pecuária!$C$45,0)","v":0},{"$f":"IF(OR(Pecuária!$C$88=\"garrota\",Pecuária!$C$89=\"garrota\"),ROUND((J80+K80-M80)*100%,0),\"0\")","v":"0"},0,{"$f":"ROUND(SUM(J80,K80)-M80/2,0)","v":0},{"$f":"ROUND(P80*Pecuária!$C$78,0)","v":0}]
["Bezerros ",null,{"$f":"Pecuária!$E26","v":0},{"$f":"$B75*Pecuária!$C$43*50%+$C75*Pecuária!$C$43/2*50%","v":0},{"$f":"ROUND((B81+C81+D81)*Pecuária!$C$44,0)","v":0},{"$f":"IF(OR(Pecuária!$C$86=\"bezerro\",Pecuária!$C$87=\"bezerro\"),ROUND((B81+C81+D81-E81)*100%,0),\"0\")","v":"0"},{"$f":"ROUND(B81+C81+D81-E81-F81,0)","v":0},{"$f":"ROUND(SUM(B81,C81)+D81/2-E81/2,0)","v":0},{"$f":"ROUND(H81*Pecuária!$C$79,0)","v":0},null,{"$f":"Pecuária!$E26","v":0},{"$f":"J75*Pecuária!$C$43*50%+K75*Pecuária!$C$43/2*50%","v":0},{"$f":"ROUND((J81+K81+L81)*Pecuária!$C$44,0)","v":0},{"$f":"IF(OR(Pecuária!$C$86=\"bezerro\",Pecuária!$C$87=\"bezerro\"),ROUND((J81+K81+L81-M81)*100%,0),\"0\")","v":"0"},{"$f":"ROUND(J81+K81+L81-M81-N81,0)","v":0},{"$f":"ROUND(SUM(J81,K81)+L81/2-M81/2,0)","v":0},{"$f":"ROUND(P81*Pecuária!$C$79,0)","v":0}]
["Bezerras ",null,{"$f":"Pecuária!$E27","v":0},{"$f":"$B75*Pecuária!$C$43*50%+$C75*Pecuária!$C$43/2*50%","v":0},{"$f":"ROUND((B82+C82+D82)*Pecuária!$C$44,0)","v":0},{"$f":"IF(OR(Pecuária!$C$88=\"bezerra\",Pecuária!$C$89=\"bezerra\"),ROUND((B82+C82+D82-E82)*100%,0),\"0\")","v":"0"},{"$f":"ROUND(B82+C82+D82-E82-F82,0)","v":0},{"$f":"ROUND(SUM(B82,C82)+D82/2-E82/2,0)","v":0},{"$f":"ROUND(H82*Pecuária!$C$80,0)","v":0},null,{"$f":"Pecuária!$E27","v":0},{"$f":"$J75*Pecuária!$C$43*50%+$K75*Pecuária!$C$43/2*50%","v":0},{"$f":"ROUND((J82+K82+L82)*Pecuária!$C$44,0)","v":0},{"$f":"IF(OR(Pecuária!$C$88=\"bezerra\",Pecuária!$C$89=\"bezerra\"),ROUND((J82+K82+L82-M82)*100%,0),\"0\")","v":"0"},{"$f":"ROUND(J82+K82+L82-M82-N82,0)","v":0},{"$f":"ROUND(SUM(J82,K82)+L82/2-M82/2,0)","v":0},{"$f":"ROUND(P82*Pecuária!$C$80,0)","v":0}]
["Total",{"$f":"SUM(B74:B82)","v":0},{"$f":"SUM(C74:C82)","v":0},{"$f":"SUM(D81:D82)","v":0},{"$f":"SUM(E74:E82)","v":0},0,0,0,0,0,0,{"$f":"SUM(L81:L82)","v":0},0,0,0,0,0]
[]
["Evolução do Rebanho de Leite"]
["Categoria","Ano 1",null,null,null,null,null,null,null,"Ano 2"]
[null,"Qtd Inicial ","Aquis.","Nasc.","Perda","Venda","Qtd Final","Qtd Média",null,"Qtd Inicial ","Aquis.","Nasc.","Perda","Venda","Qtd Final","Qtd Média"]
[null,"(cab.)","(cab.)","(cab.)","(cab.)","(cab.)","(cab.)","(cab.)","(UA)","(cab.)","(cab.)","(cab.)","(cab.)","(cab.)","(cab.)","(cab.)","(UA)"]
["Reprodutores",{"$f":"Pecuária!D5","v":0},{"$f":"Pecuária!E5+Pecuária!C30","v":0},null,{"$f":"ROUND((B89+C89)*Pecuária!$E$47,0)","v":0},{"$f":"ROUND((B89+C89-E89)*Pecuária!$D$84,0)","v":0},{"$f":"ROUND(B89+C89-E89-F89,0)","v":0},{"$f":"ROUND(SUM(B89,C89)-SUM(E89,F89)/2,0)","v":0},{"$f":"ROUND(H89*Pecuária!$C$72,0)","v":0},{"$f":"G89","v":0},{"$f":"Pecuária!D30","v":0},null,{"$f":"ROUND((J89+K89)*Pecuária!$E$47,0)","v":0},{"$f":"ROUND((J89+K89-M89)*Pecuária!$D$84,0)","v":0},{"$f":"ROUND(J89+K89-M89-N89,0)","v":0},{"$f":"ROUND(SUM(J89,K89)-SUM(M89,N89)/2,0)","v":0},{"$f":"ROUND(P89*Pecuária!$C$72,0)","v":0}]
["Matrizes",{"$f":"Pecuária!D6","v":0},{"$f":"Pecuária!E6+Pecuária!C31","v":0},null,{"$f":"ROUND((B90+C90)*Pecuária!$E$47,0)","v":0},{"$f":"ROUND((B90+C90-E90)*Pecuária!$D$85,0)","v":0},0,{"$f":"ROUND(SUM(B90,C90)-SUM(E90,F90)/2,0)","v":0},{"$f":"ROUND(H90*Pecuária!$C$73,0)","v":0},{"$f":"G90+G93","v":0},{"$f":"Pecuária!D31","v":0},null,{"$f":"ROUND((J90+K90)*Pecuária!$E$47,0)","v":0},{"$f":"ROUND((J90+K90-M90)*Pecuária!$D$85,0)","v":0},0,{"$f":"ROUND(SUM(J90,K90)-SUM(M90,N90)/2,0)","v":0},{"$f":"ROUND(P90*Pecuária!$C$73,0)","v":0}]
["Bois",{"$f":"Pecuária!D7","v":0},{"$f":"Pecuária!E7+Pecuária!C32","v":0},null,{"$f":"ROUND((B91+C91)*Pecuária!$E$47,0)","v":0},{"$f":"IF(OR(Pecuária!$D$86=\"bois\",Pecuária!$D$87=\"bois\"),ROUND((B91+C91-E91)*100%,0),\"0\")","v":"0"},0,{"$f":"ROUND(SUM(B91,C91)-E91/2,0)","v":0},{"$f":"ROUND(H91*Pecuária!$C$74,0)","v":0},{"$f":"G91+G92","v":0},{"$f":"Pecuária!D32","v":0},null,{"$f":"ROUND((J91+K91)*Pecuária!$E$47,0)","v":0},{"$f":"IF(OR(Pecuária!$D$86=\"bois\",Pecuária!$D$87=\"bois\"),ROUND((J91+K91-M91)*100%,0),\"0\")","v":"0"},0,{"$f":"ROUND(SUM(J91,K91)-M91/2,0)","v":0},{"$f":"ROUND(P91*Pecuária!$C$74,0)","v":0}]
["Novilhos",{"$f":"Pecuária!D8","v":0},{"$f":"Pecuária!E8+Pecuária!C33","v":0},null,{"$f":"ROUND((B92+C92)*Pecuária!$E$46,0)","v":0},{"$f":"IF(OR(Pecuária!$D$86=\"novilho\",Pecuária!$D$87=\"novilho\"),ROUND((B92+C92-E92)*100%,0),\"0\")","v":"0"},0,{"$f":"ROUND(SUM(B92,C92)-E92/2,0)","v":0},{"$f":"ROUND(H92*Pecuária!$C$75,0)","v":0},{"$f":"G94","v":0},{"$f":"Pecuária!D33","v":0},null,{"$f":"ROUND((J92+K92)*Pecuária!$E$46,0)","v":0},{"$f":"IF(OR(Pecuária!$D$86=\"novilho\",Pecuária!$D$87=\"novilho\"),ROUND((J92+K92-M92)*100%,0),\"0\")","v":"0"},0,{"$f":"ROUND(SUM(J92,K92)-M92/2,0)","v":0},{"$f":"ROUND(P92*Pecuária!$C$75,0)","v":0}]
["Novilhas ",{"$f":"Pecuária!D9","v":0},{"$f":"Pecuária!E9+Pecuária!C34","v":0},null,{"$f":"ROUND((B93+C93)*Pecuária!$E$46,0)","v":0},{"$f":"IF(OR(Pecuária!$D$88=\"novilha\",Pecuária!$D$89=\"novilha\"),ROUND((B93+C93-E93)*100%,0),\"0\")","v":"0"},0,{"$f":"ROUND(SUM(B93,C93)-E93/2,0)","v":0},{"$f":"ROUND(H93*Pecuária!$C$76,0)","v":0},{"$f":"G95","v":0},{"$f":"Pecuária!D34","v":0},null,{"$f":"ROUND((J93+K93)*Pecuária!$E$46,0)","v":0},{"$f":"IF(OR(Pecuária!$D$88=\"novilha\",Pecuária!$D$89=\"novilha\"),ROUND((J93+K93-M93)*100%,0),\"0\")","v":"0"},0,{"$f":"ROUND(SUM(J93,K93)-M93/2,0)","v":0},{"$f":"ROUND(P93*Pecuária!$C$76,0)","v":0}]
["Garrotes",{"$f":"Pecuária!D10","v":0},{"$f":"Pecuária!E10+Pecuária!C35","v":0},null,{"$f":"ROUND((B94+C94)*Pecuária!$E$45,0)","v":0},{"$f":"IF(OR(Pecuária!$D$86=\"garrote\",Pecuária!$D$87=\"garrote\"),ROUND((B94+C94-E94)*100%,0),\"0\")","v":"0"},0,{"$f":"ROUND(SUM(B94,C94)-E94/2,0)","v":0},{"$f":"ROUND(H94*Pecuária!$C$77,0)","v":0},{"$f":"G96","v":0},{"$f":"Pecuária!D35","v":0},null,{"$f":"ROUND((J94+K94)*Pecuária!$E$45,0)","v":0},{"$f":"IF(OR(Pecuária!$D$86=\"garrote\",Pecuária!$D$87=\"garrote\"),ROUND((J94+K94-M94)*100%,0),\"0\")","v":"0"},0,{"$f":"ROUND(SUM(J94,K94)-M94/2,0)","v":0},{"$f":"ROUND(P94*Pecuária!$C$77,0)","v":0}]
["Garrotas ",{"$f":"Pecuária!D11","v":0},{"$f":"Pecuária!E11+Pecuária!C36","v":0},null,{"$f":"ROUND((B95+C95)*Pecuária!$E$45,0)","v":0},{"$f":"IF(OR(Pecuária!$D$88=\"garrota\",Pecuária!$D$89=\"garrota\"),ROUND((B95+C95-E95)*100%,0),\"0\")","v":"0"},0,{"$f":"ROUND(SUM(B95,C95)-E95/2,0)","v":0},{"$f":"ROUND(H95*Pecuária!$C$78,0)","v":0},{"$f":"G97","v":0},{"$f":"Pecuária!D36","v":0},null,{"$f":"ROUND((J95+K95)*Pecuária!$E$45,0)","v":0},{"$f":"IF(OR(Pecuária!$D$88=\"garrota\",Pecuária!$D$89=\"garrota\"),ROUND((J95+K95-M95)*100%,0),\"0\")","v":"0"},0,{"$f":"ROUND(SUM(J95,K95)-M95/2,0)","v":0},{"$f":"ROUND(P95*Pecuária!$C$78,0)","v":0}]
["Bezerros ",{"$f":"Pecuária!D12","v":0},{"$f":"Pecuária!E12+Pecuária!C37","v":0},{"$f":"ROUND(B90*Pecuária!$E$43*50%+C90*Pecuária!$E$43/2*50%,0)","v":0},{"$f":"ROUND((B96+C96+D96)*Pecuária!$E$44,0)","v":0},{"$f":"IF(OR(Pecuária!$D$86=\"bezerro\",Pecuária!$D$87=\"bezerro\"),ROUND((B96+C96+D96-E96)*100%,0),\"0\")","v":"0"},{"$f":"ROUND(B96+C96+D96-E96-F96,0)","v":0},{"$f":"ROUND(SUM(B96,C96)+D96/2-E96/2,0)","v":0},{"$f":"ROUND(H96*Pecuária!$C$79,0)","v":0},null,{"$f":"Pecuária!D37","v":0},{"$f":"ROUND(J90*Pecuária!$E$43*50%+K90*Pecuária!$E$43/2*50%,0)","v":0},{"$f":"ROUND((J96+K96+L96)*Pecuária!$E$44,0)","v":0},{"$f":"IF(OR(Pecuária!$D$86=\"bezerro\",Pecuária!$D$87=\"bezerro\"),ROUND((J96+K96+L96-M96)*100%,0),\"0\")","v":"0"},{"$f":"ROUND(J96+K96+L96-M96-N96,0)","v":0},{"$f":"ROUND(SUM(J96,K96)+L96/2-M96/2,0)","v":0},{"$f":"ROUND(P96*Pecuária!$C$79,0)","v":0}]
["Bezerras ",{"$f":"Pecuária!D13","v":0},{"$f":"Pecuária!E13+Pecuária!C38","v":0},{"$f":"ROUND(B90*Pecuária!$E$43*50%+C90*Pecuária!$E$43/2*50%,0)","v":0},{"$f":"ROUND((B97+C97+D97)*Pecuária!$E$44,0)","v":0},{"$f":"IF(OR(Pecuária!$D$88=\"bezerra\",Pecuária!$D$89=\"bezerra\"),ROUND((B97+C97+D97-E97)*100%,0),\"0\")","v":"0"},{"$f":"ROUND(B97+C97+D97-E97-F97,0)","v":0},{"$f":"ROUND(SUM(B97,C97)+D97/2-E97/2,0)","v":0},{"$f":"ROUND(H97*Pecuária!$C$80,0)","v":0},null,{"$f":"Pecuária!D38","v":0},{"$f":"ROUND(J90*Pecuária!$E$43*50%+K90*Pecuária!$E$43/2*50%,0)","v":0},{"$f":"ROUND((J97+K97+L97)*Pecuária!$E$44,0)","v":0},{"$f":"IF(OR(Pecuária!$D$88=\"bezerra\",Pecuária!$D$89=\"bezerra\"),ROUND((J97+K97+L97-M97)*100%,0),\"0\")","v":"0"},{"$f":"ROUND(J97+K97+L97-M97-N97,0)","v":0},{"$f":"ROUND(SUM(J97,K97)+L97/2-M97/2,0)","v":0},{"$f":"ROUND(P97*Pecuária!$C$80,0)","v":0}]
["Total",{"$f":"SUM(B89:B97)","v":0},{"$f":"SUM(C89:C97)","v":0},{"$f":"SUM(D96:D97)","v":0},{"$f":"SUM(E89:E97)","v":0},0,0,0,0,0,0,{"$f":"SUM(L96:L97)","v":0},0,0,0,0,0]
[]
["Categoria","Ano 3",null,null,null,null,null,null,null,"Ano 4"]
[null,"Qtd Inicial ","Aquis.","Nasc.","Perda","Venda","Qtd Final","Qtd Média",null,"Qtd Inicial ","Aquis.","Nasc.","Perda","Venda","Qtd Final","Qtd Média"]
[null,"(cab.)","(cab.)","(cab.)","(cab.)","(cab.)","(cab.)","(cab.)","(UA)","(cab.)","(cab.)","(cab.)","(cab.)","(cab.)","(cab.)","(cab.)","(UA)"]
["Reprodutores",{"$f":"O89","v":0},{"$f":"Pecuária!$E$30","v":0},null,{"$f":"ROUND((B103+C103)*Pecuária!$E$47,0)","v":0},{"$f":"ROUND((B103+C103-E103)*Pecuária!$D$84,0)","v":0},{"$f":"ROUND(B103+C103-E103-F103,0)","v":0},{"$f":"ROUND(SUM(B103,C103)-SUM(E103,F103)/2,0)","v":0},{"$f":"ROUND(H103*Pecuária!$C$72,0)","v":0},{"$f":"G103","v":0},{"$f":"Pecuária!$E$30","v":0},null,{"$f":"ROUND((J103+K103)*Pecuária!$E$47,0)","v":0},{"$f":"ROUND((J103+K103-M103)*Pecuária!$D$84,0)","v":0},{"$f":"ROUND(J103+K103-M103-N103,0)","v":0},{"$f":"ROUND(SUM(J103,K103)-SUM(M103,N103)/2,0)","v":0},{"$f":"ROUND(P103*Pecuária!$C$72,0)","v":0}]
["Matrizes",{"$f":"O90+O93","v":0},{"$f":"Pecuária!$E$31","v":0},null,{"$f":"ROUND((B104+C104)*Pecuária!$E$47,0)","v":0},{"$f":"ROUND((B104+C104-E104)*Pecuária!$D$85,0)","v":0},0,{"$f":"ROUND(SUM(B104,C104)-SUM(E104,F104)/2,0)","v":0},{"$f":"ROUND(H104*Pecuária!$C$73,0)","v":0},{"$f":"G104+G107","v":0},{"$f":"Pecuária!$E$31","v":0},null,{"$f":"ROUND((J104+K104)*Pecuária!$E$47,0)","v":0},{"$f":"ROUND((J104+K104-M104)*Pecuária!$D$85,0)","v":0},0,{"$f":"ROUND(SUM(J104,K104)-SUM(M104,N104)/2,0)","v":0},{"$f":"ROUND(P104*Pecuária!$C$73,0)","v":0}]
["Bois",{"$f":"O91+O92","v":0},{"$f":"Pecuária!$E$32","v":0},null,{"$f":"ROUND((B105+C105)*Pecuária!$E$47,0)","v":0},{"$f":"IF(OR(Pecuária!$D$86=\"bois\",Pecuária!$D$87=\"bois\"),ROUND((B105+C105-E105)*100%,0),\"0\")","v":"0"},0,{"$f":"ROUND(SUM(B105,C105)-E105/2,0)","v":0},{"$f":"ROUND(H105*Pecuária!$C$74,0)","v":0},{"$f":"G105+G106","v":0},{"$f":"Pecuária!$E$32","v":0},null,{"$f":"ROUND((J105+K105)*Pecuária!$E$47,0)","v":0},{"$f":"IF(OR(Pecuária!$D$86=\"bois\",Pecuária!$D$87=\"bois\"),ROUND((J105+K105-M105)*100%,0),\"0\")","v":"0"},0,{"$f":"ROUND(SUM(J105,K105)-M105/2,0)","v":0},{"$f":"ROUND(P105*Pecuária!$C$74,0)","v":0}]
["Novilhos",{"$f":"O94","v":0},{"$f":"Pecuária!$E$33","v":0},null,{"$f":"ROUND((B106+C106)*Pecuária!$E$46,0)","v":0},{"$f":"IF(OR(Pecuária!$D$86=\"novilho\",Pecuária!$D$87=\"novilho\"),ROUND((B106+C106-E106)*100%,0),\"0\")","v":"0"},0,{"$f":"ROUND(SUM(B106,C106)-E106/2,0)","v":0},{"$f":"ROUND(H106*Pecuária!$C$75,0)","v":0},{"$f":"G108","v":0},{"$f":"Pecuária!$E$33","v":0},null,{"$f":"ROUND((J106+K106)*Pecuária!$E$46,0)","v":0},{"$f":"IF(OR(Pecuária!$D$86=\"novilho\",Pecuária!$D$87=\"novilho\"),ROUND((J106+K106-M106)*100%,0),\"0\")","v":"0"},0,{"$f":"ROUND(SUM(J106,K106)-M106/2,0)","v":0},{"$f":"ROUND(P106*Pecuária!$C$75,0)","v":0}]
["Novilhas ",{"$f":"O95","v":0},{"$f":"Pecuária!$E$34","v":0},null,{"$f":"ROUND((B107+C107)*Pecuária!$E$46,0)","v":0},{"$f":"IF(OR(Pecuária!$D$88=\"novilha\",Pecuária!$D$89=\"novilha\"),ROUND((B107+C107-E107)*100%,0),\"0\")","v":"0"},0,{"$f":"ROUND(SUM(B107,C107)-E107/2,0)","v":0},{"$f":"ROUND(H107*Pecuária!$C$76,0)","v":0},{"$f":"G109","v":0},{"$f":"Pecuária!$E$34","v":0},null,{"$f":"ROUND((J107+K107)*Pecuária!$E$46,0)","v":0},{"$f":"IF(OR(Pecuária!$D$88=\"novilha\",Pecuária!$D$89=\"novilha\"),ROUND((J107+K107-M107)*100%,0),\"0\")","v":"0"},0,{"$f":"ROUND(SUM(J107,K107)-M107/2,0)","v":0},{"$f":"ROUND(P107*Pecuária!$C$76,0)","v":0}]
["Garrotes",{"$f":"O96","v":0},{"$f":"Pecuária!$E$35","v":0},null,{"$f":"ROUND((B108+C108)*Pecuária!$E$45,0)","v":0},{"$f":"IF(OR(Pecuária!$D$86=\"garrote\",Pecuária!$D$87=\"garrote\"),ROUND((B108+C108-E108)*100%,0),\"0\")","v":"0"},0,{"$f":"ROUND(SUM(B108,C108)-E108/2,0)","v":0},{"$f":"ROUND(H108*Pecuária!$C$77,0)","v":0},{"$f":"G110","v":0},{"$f":"Pecuária!$E$35","v":0},null,{"$f":"ROUND((J108+K108)*Pecuária!$E$45,0)","v":0},{"$f":"IF(OR(Pecuária!$D$86=\"garrote\",Pecuária!$D$87=\"garrote\"),ROUND((J108+K108-M108)*100%,0),\"0\")","v":"0"},0,{"$f":"ROUND(SUM(J108,K108)-M108/2,0)","v":0},{"$f":"ROUND(P108*Pecuária!$C$77,0)","v":0}]
["Garrotas ",{"$f":"O97","v":0},{"$f":"Pecuária!$E$36","v":0},null,{"$f":"ROUND((B109+C109)*Pecuária!$E$45,0)","v":0},{"$f":"IF(OR(Pecuária!$D$88=\"garrota\",Pecuária!$D$89=\"garrota\"),ROUND((B109+C109-E109)*100%,0),\"0\")","v":"0"},0,{"$f":"ROUND(SUM(B109,C109)-E109/2,0)","v":0},{"$f":"ROUND(H109*Pecuária!$C$78,0)","v":0},{"$f":"G111","v":0},{"$f":"Pecuária!$E$36","v":0},null,{"$f":"ROUND((J109+K109)*Pecuária!$E$45,0)","v":0},{"$f":"IF(OR(Pecuária!$D$88=\"garrota\",Pecuária!$D$89=\"garrota\"),ROUND((J109+K109-M109)*100%,0),\"0\")","v":"0"},0,{"$f":"ROUND(SUM(J109,K109)-M109/2,0)","v":0},{"$f":"ROUND(P109*Pecuária!$C$78,0)","v":0}]
["Bezerros ",null,{"$f":"Pecuária!$E$37","v":0},{"$f":"ROUND(B104*Pecuária!$E$43*50%+C104*Pecuária!$E$43/2*50%,0)","v":0},{"$f":"ROUND((B110+C110+D110)*Pecuária!$E$44,0)","v":0},{"$f":"IF(OR(Pecuária!$D$86=\"bezerro\",Pecuária!$D$87=\"bezerro\"),ROUND((B110+C110+D110-E110)*100%,0),\"0\")","v":"0"},{"$f":"ROUND(B110+C110+D110-E110-F110,0)","v":0},{"$f":"ROUND(SUM(B110,C110)+D110/2-E110/2,0)","v":0},{"$f":"ROUND(H110*Pecuária!$C$79,0)","v":0},null,{"$f":"Pecuária!$E$37","v":0},{"$f":"ROUND(J104*Pecuária!$E$43*50%+K104*Pecuária!$E$43/2*50%,0)","v":0},{"$f":"ROUND((J110+K110+L110)*Pecuária!$E$44,0)","v":0},{"$f":"IF(OR(Pecuária!$D$86=\"bezerro\",Pecuária!$D$87=\"bezerro\"),ROUND((J110+K110+L110-M110)*100%,0),\"0\")","v":"0"},{"$f":"ROUND(J110+K110+L110-M110-N110,0)","v":0},{"$f":"ROUND(SUM(J110,K110)+L110/2-M110/2,0)","v":0},{"$f":"ROUND(P110*Pecuária!$C$79,0)","v":0}]
["Bezerras ",null,{"$f":"Pecuária!$E$38","v":0},{"$f":"ROUND(B104*Pecuária!$E$43*50%+C104*Pecuária!$E$43/2*50%,0)","v":0},{"$f":"ROUND((B111+C111+D111)*Pecuária!$E$44,0)","v":0},{"$f":"IF(OR(Pecuária!$D$88=\"bezerra\",Pecuária!$D$89=\"bezerra\"),ROUND((B111+C111+D111-E111)*100%,0),\"0\")","v":"0"},{"$f":"ROUND(B111+C111+D111-E111-F111,0)","v":0},{"$f":"ROUND(SUM(B111,C111)+D111/2-E111/2,0)","v":0},{"$f":"ROUND(H111*Pecuária!$C$80,0)","v":0},null,{"$f":"Pecuária!$E$38","v":0},{"$f":"ROUND(J104*Pecuária!$E$43*50%+K104*Pecuária!$E$43/2*50%,0)","v":0},{"$f":"ROUND((J111+K111+L111)*Pecuária!$E$44,0)","v":0},{"$f":"IF(OR(Pecuária!$D$88=\"bezerra\",Pecuária!$D$89=\"bezerra\"),ROUND((J111+K111+L111-M111)*100%,0),\"0\")","v":"0"},{"$f":"ROUND(J111+K111+L111-M111-N111,0)","v":0},{"$f":"ROUND(SUM(J111,K111)+L111/2-M111/2,0)","v":0},{"$f":"ROUND(P111*Pecuária!$C$80,0)","v":0}]
["Total",{"$f":"SUM(B103:B111)","v":0},0,{"$f":"SUM(D110:D111)","v":0},0,0,0,0,0,0,0,{"$f":"SUM(L110:L111)","v":0},0,0,0,0,0]
[]
["Categoria","Ano 5",null,null,null,null,null,null,null,"Ano 6"]
[null,"Qtd Inicial ","Aquis.","Nasc.","Perda","Venda","Qtd Final","Qtd Média",null,"Qtd Inicial ","Aquis.","Nasc.","Perda","Venda","Qtd Final","Qtd Média"]
[null,"(cab.)","(cab.)","(cab.)","(cab.)","(cab.)","(cab.)","(cab.)","(UA)","(cab.)","(cab.)","(cab.)","(cab.)","(cab.)","(cab.)","(cab.)","(UA)"]
["Reprodutores",{"$f":"O103","v":0},{"$f":"Pecuária!$E$30","v":0},null,{"$f":"ROUND((B117+C117)*Pecuária!$E$47,0)","v":0},{"$f":"ROUND((B117+C117-E117)*Pecuária!$D$84,0)","v":0},{"$f":"ROUND(B117+C117-E117-F117,0)","v":0},{"$f":"ROUND(SUM(B117,C117)-SUM(E117,F117)/2,0)","v":0},{"$f":"ROUND(H117*Pecuária!$C$72,0)","v":0},{"$f":"G117","v":0},{"$f":"Pecuária!$E$30","v":0},null,{"$f":"ROUND((J117+K117)*Pecuária!$E$47,0)","v":0},{"$f":"ROUND((J117+K117-M117)*Pecuária!$D$84,0)","v":0},{"$f":"ROUND(J117+K117-M117-N117,0)","v":0},{"$f":"ROUND(SUM(J117,K117)-SUM(M117,N117)/2,0)","v":0},{"$f":"ROUND(P117*Pecuária!$C$72,0)","v":0}]
["Matrizes",{"$f":"O104+O107","v":0},{"$f":"Pecuária!$E$31","v":0},null,{"$f":"ROUND((B118+C118)*Pecuária!$E$47,0)","v":0},{"$f":"ROUND((B118+C118-E118)*Pecuária!$D$85,0)","v":0},0,{"$f":"ROUND(SUM(B118,C118)-SUM(E118,F118)/2,0)","v":0},{"$f":"ROUND(H118*Pecuária!$C$73,0)","v":0},{"$f":"G118+G121","v":0},{"$f":"Pecuária!$E$31","v":0},null,{"$f":"ROUND((J118+K118)*Pecuária!$E$47,0)","v":0},{"$f":"ROUND((J118+K118-M118)*Pecuária!$D$85,0)","v":0},0,{"$f":"ROUND(SUM(J118,K118)-SUM(M118,N118)/2,0)","v":0},{"$f":"ROUND(P118*Pecuária!$C$73,0)","v":0}]
["Bois",{"$f":"O105+O106","v":0},{"$f":"Pecuária!$E$32","v":0},null,{"$f":"ROUND((B119+C119)*Pecuária!$E$47,0)","v":0},{"$f":"IF(OR(Pecuária!$D$86=\"bois\",Pecuária!$D$87=\"bois\"),ROUND((B119+C119-E119)*100%,0),\"0\")","v":"0"},0,{"$f":"ROUND(SUM(B119,C119)-E119/2,0)","v":0},{"$f":"ROUND(H119*Pecuária!$C$74,0)","v":0},{"$f":"G119+G120","v":0},{"$f":"Pecuária!$E$32","v":0},null,{"$f":"ROUND((J119+K119)*Pecuária!$E$47,0)","v":0},{"$f":"IF(OR(Pecuária!$D$86=\"bois\",Pecuária!$D$87=\"bois\"),ROUND((J119+K119-M119)*100%,0),\"0\")","v":"0"},0,{"$f":"ROUND(SUM(J119,K119)-M119/2,0)","v":0},{"$f":"ROUND(P119*Pecuária!$C$74,0)","v":0}]
["Novilhos",{"$f":"O108","v":0},{"$f":"Pecuária!$E$33","v":0},null,{"$f":"ROUND((B120+C120)*Pecuária!$E$46,0)","v":0},{"$f":"IF(OR(Pecuária!$D$86=\"novilho\",Pecuária!$D$87=\"novilho\"),ROUND((B120+C120-E120)*100%,0),\"0\")","v":"0"},0,{"$f":"ROUND(SUM(B120,C120)-E120/2,0)","v":0},{"$f":"ROUND(H120*Pecuária!$C$75,0)","v":0},{"$f":"G122","v":0},{"$f":"Pecuária!$E$33","v":0},null,{"$f":"ROUND((J120+K120)*Pecuária!$E$46,0)","v":0},{"$f":"IF(OR(Pecuária!$D$86=\"novilho\",Pecuária!$D$87=\"novilho\"),ROUND((J120+K120-M120)*100%,0),\"0\")","v":"0"},0,{"$f":"ROUND(SUM(J120,K120)-M120/2,0)","v":0},{"$f":"ROUND(P120*Pecuária!$C$75,0)","v":0}]
["Novilhas ",{"$f":"O109","v":0},{"$f":"Pecuária!$E$34","v":0},null,{"$f":"ROUND((B121+C121)*Pecuária!$E$46,0)","v":0},{"$f":"IF(OR(Pecuária!$D$88=\"novilha\",Pecuária!$D$89=\"novilha\"),ROUND((B121+C121-E121)*100%,0),\"0\")","v":"0"},0,{"$f":"ROUND(SUM(B121,C121)-E121/2,0)","v":0},{"$f":"ROUND(H121*Pecuária!$C$76,0)","v":0},{"$f":"G123","v":0},{"$f":"Pecuária!$E$34","v":0},null,{"$f":"ROUND((J121+K121)*Pecuária!$E$46,0)","v":0},{"$f":"IF(OR(Pecuária!$D$88=\"novilha\",Pecuária!$D$89=\"novilha\"),ROUND((J121+K121-M121)*100%,0),\"0\")","v":"0"},0,{"$f":"ROUND(SUM(J121,K121)-M121/2,0)","v":0},{"$f":"ROUND(P121*Pecuária!$C$76,0)","v":0}]
["Garrotes",{"$f":"O110","v":0},{"$f":"Pecuária!$E$35","v":0},null,{"$f":"ROUND((B122+C122)*Pecuária!$E$45,0)","v":0},{"$f":"IF(OR(Pecuária!$D$86=\"garrote\",Pecuária!$D$87=\"garrote\"),ROUND((B122+C122-E122)*100%,0),\"0\")","v":"0"},0,{"$f":"ROUND(SUM(B122,C122)-E122/2,0)","v":0},{"$f":"ROUND(H122*Pecuária!$C$77,0)","v":0},{"$f":"G124","v":0},{"$f":"Pecuária!$E$35","v":0},null,{"$f":"ROUND((J122+K122)*Pecuária!$E$45,0)","v":0},{"$f":"IF(OR(Pecuária!$D$86=\"garrote\",Pecuária!$D$87=\"garrote\"),ROUND((J122+K122-M122)*100%,0),\"0\")","v":"0"},0,{"$f":"ROUND(SUM(J122,K122)-M122/2,0)","v":0},{"$f":"ROUND(P122*Pecuária!$C$77,0)","v":0}]
["Garrotas ",{"$f":"O111","v":0},{"$f":"Pecuária!$E$36","v":0},null,{"$f":"ROUND((B123+C123)*Pecuária!$E$45,0)","v":0},{"$f":"IF(OR(Pecuária!$D$88=\"garrota\",Pecuária!$D$89=\"garrota\"),ROUND((B123+C123-E123)*100%,0),\"0\")","v":"0"},0,{"$f":"ROUND(SUM(B123,C123)-E123/2,0)","v":0},{"$f":"ROUND(H123*Pecuária!$C$78,0)","v":0},{"$f":"G125","v":0},{"$f":"Pecuária!$E$36","v":0},null,{"$f":"ROUND((J123+K123)*Pecuária!$E$45,0)","v":0},{"$f":"IF(OR(Pecuária!$D$88=\"garrota\",Pecuária!$D$89=\"garrota\"),ROUND((J123+K123-M123)*100%,0),\"0\")","v":"0"},0,{"$f":"ROUND(SUM(J123,K123)-M123/2,0)","v":0},{"$f":"ROUND(P123*Pecuária!$C$78,0)","v":0}]
["Bezerros ",null,{"$f":"Pecuária!$E$37","v":0},{"$f":"ROUND(B118*Pecuária!$E$43*50%+C118*Pecuária!$E$43/2*50%,0)","v":0},{"$f":"ROUND((B124+C124+D124)*Pecuária!$E$44,0)","v":0},{"$f":"IF(OR(Pecuária!$D$86=\"bezerro\",Pecuária!$D$87=\"bezerro\"),ROUND((B124+C124+D124-E124)*100%,0),\"0\")","v":"0"},{"$f":"ROUND(B124+C124+D124-E124-F124,0)","v":0},{"$f":"ROUND(SUM(B124,C124)+D124/2-E124/2,0)","v":0},{"$f":"ROUND(H124*Pecuária!$C$79,0)","v":0},null,{"$f":"Pecuária!$E$37","v":0},{"$f":"ROUND(J118*Pecuária!$E$43*50%+K118*Pecuária!$E$43/2*50%,0)","v":0},{"$f":"ROUND((J124+K124+L124)*Pecuária!$E$44,0)","v":0},{"$f":"IF(OR(Pecuária!$D$86=\"bezerro\",Pecuária!$D$87=\"bezerro\"),ROUND((J124+K124+L124-M124)*100%,0),\"0\")","v":"0"},{"$f":"ROUND(J124+K124+L124-M124-N124,0)","v":0},{"$f":"ROUND(SUM(J124,K124)+L124/2-M124/2,0)","v":0},{"$f":"ROUND(P124*Pecuária!$C$79,0)","v":0}]
["Bezerras ",null,{"$f":"Pecuária!$E$38","v":0},{"$f":"ROUND(B118*Pecuária!$E$43*50%+C118*Pecuária!$E$43/2*50%,0)","v":0},{"$f":"ROUND((B125+C125+D125)*Pecuária!$E$44,0)","v":0},{"$f":"IF(OR(Pecuária!$D$88=\"bezerra\",Pecuária!$D$89=\"bezerra\"),ROUND((B125+C125+D125-E125)*100%,0),\"0\")","v":"0"},{"$f":"ROUND(B125+C125+D125-E125-F125,0)","v":0},{"$f":"ROUND(SUM(B125,C125)+D125/2-E125/2,0)","v":0},{"$f":"ROUND(H125*Pecuária!$C$80,0)","v":0},null,{"$f":"Pecuária!$E$38","v":0},{"$f":"ROUND(J118*Pecuária!$E$43*50%+K118*Pecuária!$E$43/2*50%,0)","v":0},{"$f":"ROUND((J125+K125+L125)*Pecuária!$E$44,0)","v":0},{"$f":"IF(OR(Pecuária!$D$88=\"bezerra\",Pecuária!$D$89=\"bezerra\"),ROUND((J125+K125+L125-M125)*100%,0),\"0\")","v":"0"},{"$f":"ROUND(J125+K125+L125-M125-N125,0)","v":0},{"$f":"ROUND(SUM(J125,K125)+L125/2-M125/2,0)","v":0},{"$f":"ROUND(P125*Pecuária!$C$80,0)","v":0}]
["Total",{"$f":"SUM(B117:B125)","v":0},{"$f":"SUM(C117:C125)","v":0},{"$f":"SUM(D124:D125)","v":0},{"$f":"SUM(E117:E125)","v":0},0,0,0,0,0,0,{"$f":"SUM(L124:L125)","v":0},0,0,{"$f":"SUM(O117:O125)","v":0},{"$f":"SUM(P117:P125)","v":0},0]
[]
["Categoria","Ano 7",null,null,null,null,null,null,null,"Ano 8"]
[null,"Qtd Inicial ","Aquis.","Nasc.","Perda","Venda","Qtd Final","Qtd Média",null,"Qtd Inicial ","Aquis.","Nasc.","Perda","Venda","Qtd Final","Qtd Média"]
[null,"(cab.)","(cab.)","(cab.)","(cab.)","(cab.)","(cab.)","(cab.)","(UA)","(cab.)","(cab.)","(cab.)","(cab.)","(cab.)","(cab.)","(cab.)","(UA)"]
["Reprodutores",{"$f":"O117","v":0},{"$f":"Pecuária!$E$30","v":0},null,{"$f":"ROUND((B131+C131)*Pecuária!$E$47,0)","v":0},{"$f":"ROUND((B131+C131-E131)*Pecuária!$D$84,0)","v":0},{"$f":"ROUND(B131+C131-E131-F131,0)","v":0},{"$f":"ROUND(SUM(B131,C131)-SUM(E131,F131)/2,0)","v":0},{"$f":"ROUND(H131*Pecuária!$C$72,0)","v":0},{"$f":"G131","v":0},{"$f":"Pecuária!$E$30","v":0},null,{"$f":"ROUND((J131+K131)*Pecuária!$E$47,0)","v":0},{"$f":"ROUND((J131+K131-M131)*Pecuária!$D$84,0)","v":0},{"$f":"ROUND(J131+K131-M131-N131,0)","v":0},{"$f":"ROUND(SUM(J131,K131)-SUM(M131,N131)/2,0)","v":0},{"$f":"ROUND(P131*Pecuária!$C$72,0)","v":0}]
["Matrizes",{"$f":"O118+O121","v":0},{"$f":"Pecuária!$E$31","v":0},null,{"$f":"ROUND((B132+C132)*Pecuária!$E$47,0)","v":0},{"$f":"ROUND((B132+C132-E132)*Pecuária!$D$85,0)","v":0},0,{"$f":"ROUND(SUM(B132,C132)-SUM(E132,F132)/2,0)","v":0},{"$f":"ROUND(H132*Pecuária!$C$73,0)","v":0},{"$f":"G132+G135","v":0},{"$f":"Pecuária!$E$31","v":0},null,{"$f":"ROUND((J132+K132)*Pecuária!$E$47,0)","v":0},{"$f":"ROUND((J132+K132-M132)*Pecuária!$D$85,0)","v":0},0,{"$f":"ROUND(SUM(J132,K132)-SUM(M132,N132)/2,0)","v":0},{"$f":"ROUND(P132*Pecuária!$C$73,0)","v":0}]
["Bois",{"$f":"O119+O120","v":0},{"$f":"Pecuária!$E$32","v":0},null,{"$f":"ROUND((B133+C133)*Pecuária!$E$47,0)","v":0},{"$f":"IF(OR(Pecuária!$D$86=\"bois\",Pecuária!$D$87=\"bois\"),ROUND((B133+C133-E133)*100%,0),\"0\")","v":"0"},0,{"$f":"ROUND(SUM(B133,C133)-E133/2,0)","v":0},{"$f":"ROUND(H133*Pecuária!$C$74,0)","v":0},{"$f":"G133+G134","v":0},{"$f":"Pecuária!$E$32","v":0},null,{"$f":"ROUND((J133+K133)*Pecuária!$E$47,0)","v":0},{"$f":"IF(OR(Pecuária!$D$86=\"bois\",Pecuária!$D$87=\"bois\"),ROUND((J133+K133-M133)*100%,0),\"0\")","v":"0"},0,{"$f":"ROUND(SUM(J133,K133)-M133/2,0)","v":0},{"$f":"ROUND(P133*Pecuária!$C$74,0)","v":0}]
["Novilhos",{"$f":"O122","v":0},{"$f":"Pecuária!$E$33","v":0},null,{"$f":"ROUND((B134+C134)*Pecuária!$E$46,0)","v":0},{"$f":"IF(OR(Pecuária!$D$86=\"novilho\",Pecuária!$D$87=\"novilho\"),ROUND((B134+C134-E134)*100%,0),\"0\")","v":"0"},0,{"$f":"ROUND(SUM(B134,C134)-E134/2,0)","v":0},{"$f":"ROUND(H134*Pecuária!$C$75,0)","v":0},{"$f":"G136","v":0},{"$f":"Pecuária!$E$33","v":0},null,{"$f":"ROUND((J134+K134)*Pecuária!$E$46,0)","v":0},{"$f":"IF(OR(Pecuária!$D$86=\"novilho\",Pecuária!$D$87=\"novilho\"),ROUND((J134+K134-M134)*100%,0),\"0\")","v":"0"},0,{"$f":"ROUND(SUM(J134,K134)-M134/2,0)","v":0},{"$f":"ROUND(P134*Pecuária!$C$75,0)","v":0}]
["Novilhas ",{"$f":"O123","v":0},{"$f":"Pecuária!$E$34","v":0},null,{"$f":"ROUND((B135+C135)*Pecuária!$E$46,0)","v":0},{"$f":"IF(OR(Pecuária!$D$88=\"novilha\",Pecuária!$D$89=\"novilha\"),ROUND((B135+C135-E135)*100%,0),\"0\")","v":"0"},0,{"$f":"ROUND(SUM(B135,C135)-E135/2,0)","v":0},{"$f":"ROUND(H135*Pecuária!$C$76,0)","v":0},{"$f":"G137","v":0},{"$f":"Pecuária!$E$34","v":0},null,{"$f":"ROUND((J135+K135)*Pecuária!$E$46,0)","v":0},{"$f":"IF(OR(Pecuária!$D$88=\"novilha\",Pecuária!$D$89=\"novilha\"),ROUND((J135+K135-M135)*100%,0),\"0\")","v":"0"},0,{"$f":"ROUND(SUM(J135,K135)-M135/2,0)","v":0},{"$f":"ROUND(P135*Pecuária!$C$76,0)","v":0}]
["Garrotes",{"$f":"O124","v":0},{"$f":"Pecuária!$E$35","v":0},null,{"$f":"ROUND((B136+C136)*Pecuária!$E$45,0)","v":0},{"$f":"IF(OR(Pecuária!$D$86=\"garrote\",Pecuária!$D$87=\"garrote\"),ROUND((B136+C136-E136)*100%,0),\"0\")","v":"0"},0,{"$f":"ROUND(SUM(B136,C136)-E136/2,0)","v":0},{"$f":"ROUND(H136*Pecuária!$C$77,0)","v":0},{"$f":"G138","v":0},{"$f":"Pecuária!$E$35","v":0},null,{"$f":"ROUND((J136+K136)*Pecuária!$E$45,0)","v":0},{"$f":"IF(OR(Pecuária!$D$86=\"garrote\",Pecuária!$D$87=\"garrote\"),ROUND((J136+K136-M136)*100%,0),\"0\")","v":"0"},0,{"$f":"ROUND(SUM(J136,K136)-M136/2,0)","v":0},{"$f":"ROUND(P136*Pecuária!$C$77,0)","v":0}]
["Garrotas ",{"$f":"O125","v":0},{"$f":"Pecuária!$E$36","v":0},null,{"$f":"ROUND((B137+C137)*Pecuária!$E$45,0)","v":0},{"$f":"IF(OR(Pecuária!$D$88=\"garrota\",Pecuária!$D$89=\"garrota\"),ROUND((B137+C137-E137)*100%,0),\"0\")","v":"0"},0,{"$f":"ROUND(SUM(B137,C137)-E137/2,0)","v":0},{"$f":"ROUND(H137*Pecuária!$C$78,0)","v":0},{"$f":"G139","v":0},{"$f":"Pecuária!$E$36","v":0},null,{"$f":"ROUND((J137+K137)*Pecuária!$E$45,0)","v":0},{"$f":"IF(OR(Pecuária!$D$88=\"garrota\",Pecuária!$D$89=\"garrota\"),ROUND((J137+K137-M137)*100%,0),\"0\")","v":"0"},0,{"$f":"ROUND(SUM(J137,K137)-M137/2,0)","v":0},{"$f":"ROUND(P137*Pecuária!$C$78,0)","v":0}]
["Bezerros ",null,{"$f":"Pecuária!$E$37","v":0},{"$f":"B132*Pecuária!$E$43*50%+C132*Pecuária!$E$43/2*50%","v":0},{"$f":"ROUND((B138+C138+D138)*Pecuária!$E$44,0)","v":0},{"$f":"IF(OR(Pecuária!$D$86=\"bezerro\",Pecuária!$D$87=\"bezerro\"),ROUND((B138+C138+D138-E138)*100%,0),\"0\")","v":"0"},{"$f":"ROUND(B138+C138+D138-E138-F138,0)","v":0},{"$f":"ROUND(SUM(B138,C138)+D138/2-E138/2,0)","v":0},{"$f":"ROUND(H138*Pecuária!$C$79,0)","v":0},null,{"$f":"Pecuária!$E$37","v":0},{"$f":"J132*Pecuária!$E$43*50%+K132*Pecuária!$E$43/2*50%","v":0},{"$f":"ROUND((J138+K138+L138)*Pecuária!$E$44,0)","v":0},{"$f":"IF(OR(Pecuária!$D$86=\"bezerro\",Pecuária!$D$87=\"bezerro\"),ROUND((J138+K138+L138-M138)*100%,0),\"0\")","v":"0"},{"$f":"ROUND(J138+K138+L138-M138-N138,0)","v":0},{"$f":"ROUND(SUM(J138,K138)+L138/2-M138/2,0)","v":0},{"$f":"ROUND(P138*Pecuária!$C$79,0)","v":0}]
["Bezerras ",null,{"$f":"Pecuária!$E$38","v":0},{"$f":"B132*Pecuária!$E$43*50%+C132*Pecuária!$E$43/2*50%","v":0},{"$f":"ROUND((B139+C139+D139)*Pecuária!$E$44,0)","v":0},{"$f":"IF(OR(Pecuária!$D$88=\"bezerra\",Pecuária!$D$89=\"bezerra\"),ROUND((B139+C139+D139-E139)*100%,0),\"0\")","v":"0"},{"$f":"ROUND(B139+C139+D139-E139-F139,0)","v":0},{"$f":"ROUND(SUM(B139,C139)+D139/2-E139/2,0)","v":0},{"$f":"ROUND(H139*Pecuária!$C$80,0)","v":0},null,{"$f":"Pecuária!$E$38","v":0},{"$f":"J132*Pecuária!$E$43*50%+K132*Pecuária!$E$43/2*50%","v":0},{"$f":"ROUND((J139+K139+L139)*Pecuária!$E$44,0)","v":0},{"$f":"IF(OR(Pecuária!$D$88=\"bezerra\",Pecuária!$D$89=\"bezerra\"),ROUND((J139+K139+L139-M139)*100%,0),\"0\")","v":"0"},{"$f":"ROUND(J139+K139+L139-M139-N139,0)","v":0},{"$f":"ROUND(SUM(J139,K139)+L139/2-M139/2,0)","v":0},{"$f":"ROUND(P139*Pecuária!$C$80,0)","v":0}]
["Total",{"$f":"SUM(B131:B139)","v":0},{"$f":"SUM(C131:C139)","v":0},{"$f":"SUM(D138:D139)","v":0},{"$f":"SUM(E131:E139)","v":0},0,0,0,0,0,0,{"$f":"SUM(L138:L139)","v":0},0,0,0,0,0]
[]
["Categoria","Ano 9",null,null,null,null,null,null,null,"Ano 10"]
[null,"Qtd Inicial ","Aquis.","Nasc.","Perda","Venda","Qtd Final","Qtd Média",null,"Qtd Inicial ","Aquis.","Nasc.","Perda","Venda","Qtd Final","Qtd Média"]
[null,"(cab.)","(cab.)","(cab.)","(cab.)","(cab.)","(cab.)","(cab.)","(UA)","(cab.)","(cab.)","(cab.)","(cab.)","(cab.)","(cab.)","(cab.)","(UA)"]
["Reprodutores",{"$f":"O131","v":0},{"$f":"Pecuária!$E$30","v":0},null,{"$f":"ROUND((B145+C145)*Pecuária!$E$47,0)","v":0},{"$f":"ROUND((B145+C145-E145)*Pecuária!$D$84,0)","v":0},{"$f":"ROUND(B145+C145-E145-F145,0)","v":0},{"$f":"ROUND(SUM(B145,C145)-SUM(E145,F145)/2,0)","v":0},{"$f":"ROUND(H145*Pecuária!$C$72,0)","v":0},{"$f":"G145","v":0},{"$f":"Pecuária!$E$30","v":0},null,{"$f":"ROUND((J145+K145)*Pecuária!$E$47,0)","v":0},{"$f":"ROUND((J145+K145-M145)*Pecuária!$D$84,0)","v":0},{"$f":"ROUND(J145+K145-M145-N145,0)","v":0},{"$f":"ROUND(SUM(J145,K145)-SUM(M145,N145)/2,0)","v":0},{"$f":"ROUND(P145*Pecuária!$C$72,0)","v":0}]
["Matrizes",{"$f":"O132+O135","v":0},{"$f":"Pecuária!$E$31","v":0},null,{"$f":"ROUND((B146+C146)*Pecuária!$E$47,0)","v":0},{"$f":"ROUND((B146+C146-E146)*Pecuária!$D$85,0)","v":0},0,{"$f":"ROUND(SUM(B146,C146)-SUM(E146,F146)/2,0)","v":0},{"$f":"ROUND(H146*Pecuária!$C$73,0)","v":0},{"$f":"G146+G149","v":0},{"$f":"Pecuária!$E$31","v":0},null,{"$f":"ROUND((J146+K146)*Pecuária!$E$47,0)","v":0},{"$f":"ROUND((J146+K146-M146)*Pecuária!$D$85,0)","v":0},0,{"$f":"ROUND(SUM(J146,K146)-SUM(M146,N146)/2,0)","v":0},{"$f":"ROUND(P146*Pecuária!$C$73,0)","v":0}]
["Bois",{"$f":"O133+O134","v":0},{"$f":"Pecuária!$E$32","v":0},null,{"$f":"ROUND((B147+C147)*Pecuária!$E$47,0)","v":0},{"$f":"IF(OR(Pecuária!$D$86=\"bois\",Pecuária!$D$87=\"bois\"),ROUND((B147+C147-E147)*100%,0),\"0\")","v":"0"},0,{"$f":"ROUND(SUM(B147,C147)-E147/2,0)","v":0},{"$f":"ROUND(H147*Pecuária!$C$74,0)","v":0},{"$f":"G147+G148","v":0},{"$f":"Pecuária!$E$32","v":0},null,{"$f":"ROUND((J147+K147)*Pecuária!$E$47,0)","v":0},{"$f":"IF(OR(Pecuária!$D$86=\"bois\",Pecuária!$D$87=\"bois\"),ROUND((J147+K147-M147)*100%,0),\"0\")","v":"0"},0,{"$f":"ROUND(SUM(J147,K147)-M147/2,0)","v":0},{"$f":"ROUND(P147*Pecuária!$C$74,0)","v":0}]
["Novilhos",{"$f":"O136","v":0},{"$f":"Pecuária!$E$33","v":0},null,{"$f":"ROUND((B148+C148)*Pecuária!$E$46,0)","v":0},{"$f":"IF(OR(Pecuária!$D$86=\"novilho\",Pecuária!$D$87=\"novilho\"),ROUND((B148+C148-E148)*100%,0),\"0\")","v":"0"},0,{"$f":"ROUND(SUM(B148,C148)-E148/2,0)","v":0},{"$f":"ROUND(H148*Pecuária!$C$75,0)","v":0},{"$f":"G150","v":0},{"$f":"Pecuária!$E$33","v":0},null,{"$f":"ROUND((J148+K148)*Pecuária!$E$46,0)","v":0},{"$f":"IF(OR(Pecuária!$D$86=\"novilho\",Pecuária!$D$87=\"novilho\"),ROUND((J148+K148-M148)*100%,0),\"0\")","v":"0"},0,{"$f":"ROUND(SUM(J148,K148)-M148/2,0)","v":0},{"$f":"ROUND(P148*Pecuária!$C$75,0)","v":0}]
["Novilhas ",{"$f":"O137","v":0},{"$f":"Pecuária!$E$34","v":0},null,{"$f":"ROUND((B149+C149)*Pecuária!$E$46,0)","v":0},{"$f":"IF(OR(Pecuária!$D$88=\"novilha\",Pecuária!$D$89=\"novilha\"),ROUND((B149+C149-E149)*100%,0),\"0\")","v":"0"},0,{"$f":"ROUND(SUM(B149,C149)-E149/2,0)","v":0},{"$f":"ROUND(H149*Pecuária!$C$76,0)","v":0},{"$f":"G151","v":0},{"$f":"Pecuária!$E$34","v":0},null,{"$f":"ROUND((J149+K149)*Pecuária!$E$46,0)","v":0},{"$f":"IF(OR(Pecuária!$D$88=\"novilha\",Pecuária!$D$89=\"novilha\"),ROUND((J149+K149-M149)*100%,0),\"0\")","v":"0"},0,{"$f":"ROUND(SUM(J149,K149)-M149/2,0)","v":0},{"$f":"ROUND(P149*Pecuária!$C$76,0)","v":0}]
["Garrotes",{"$f":"O138","v":0},{"$f":"Pecuária!$E$35","v":0},null,{"$f":"ROUND((B150+C150)*Pecuária!$E$45,0)","v":0},{"$f":"IF(OR(Pecuária!$D$86=\"garrote\",Pecuária!$D$87=\"garrote\"),ROUND((B150+C150-E150)*100%,0),\"0\")","v":"0"},0,{"$f":"ROUND(SUM(B150,C150)-E150/2,0)","v":0},{"$f":"ROUND(H150*Pecuária!$C$77,0)","v":0},{"$f":"G152","v":0},{"$f":"Pecuária!$E$35","v":0},null,{"$f":"ROUND((J150+K150)*Pecuária!$E$45,0)","v":0},{"$f":"IF(OR(Pecuária!$D$86=\"garrote\",Pecuária!$D$87=\"garrote\"),ROUND((J150+K150-M150)*100%,0),\"0\")","v":"0"},0,{"$f":"ROUND(SUM(J150,K150)-M150/2,0)","v":0},{"$f":"ROUND(P150*Pecuária!$C$77,0)","v":0}]
["Garrotas ",{"$f":"O139","v":0},{"$f":"Pecuária!$E$36","v":0},null,{"$f":"ROUND((B151+C151)*Pecuária!$E$45,0)","v":0},{"$f":"IF(OR(Pecuária!$D$88=\"garrota\",Pecuária!$D$89=\"garrota\"),ROUND((B151+C151-E151)*100%,0),\"0\")","v":"0"},0,{"$f":"ROUND(SUM(B151,C151)-E151/2,0)","v":0},{"$f":"ROUND(H151*Pecuária!$C$78,0)","v":0},{"$f":"G153","v":0},{"$f":"Pecuária!$E$36","v":0},null,{"$f":"ROUND((J151+K151)*Pecuária!$E$45,0)","v":0},{"$f":"IF(OR(Pecuária!$D$88=\"garrota\",Pecuária!$D$89=\"garrota\"),ROUND((J151+K151-M151)*100%,0),\"0\")","v":"0"},0,{"$f":"ROUND(SUM(J151,K151)-M151/2,0)","v":0},{"$f":"ROUND(P151*Pecuária!$C$78,0)","v":0}]
["Bezerros ",null,{"$f":"Pecuária!$E$37","v":0},{"$f":"ROUND(B146*Pecuária!$E$43*50%+C146*Pecuária!$E$43/2*50%,0)","v":0},{"$f":"ROUND((B152+C152+D152)*Pecuária!$E$44,0)","v":0},{"$f":"IF(OR(Pecuária!$D$86=\"bezerro\",Pecuária!$D$87=\"bezerro\"),ROUND((B152+C152+D152-E152)*100%,0),\"0\")","v":"0"},{"$f":"ROUND(B152+C152+D152-E152-F152,0)","v":0},{"$f":"ROUND(SUM(B152,C152)+D152/2-E152/2,0)","v":0},{"$f":"ROUND(H152*Pecuária!$C$79,0)","v":0},null,{"$f":"Pecuária!$E$37","v":0},{"$f":"ROUND(J146*Pecuária!$E$43*50%+K146*Pecuária!$E$43/2*50%,0)","v":0},{"$f":"ROUND((J152+K152+L152)*Pecuária!$E$44,0)","v":0},{"$f":"IF(OR(Pecuária!$D$86=\"bezerro\",Pecuária!$D$87=\"bezerro\"),ROUND((J152+K152+L152-M152)*100%,0),\"0\")","v":"0"},{"$f":"ROUND(J152+K152+L152-M152-N152,0)","v":0},{"$f":"ROUND(SUM(J152,K152)+L152/2-M152/2,0)","v":0},{"$f":"ROUND(P152*Pecuária!$C$79,0)","v":0}]
["Bezerras ",null,{"$f":"Pecuária!$E$38","v":0},{"$f":"ROUND(B146*Pecuária!$E$43*50%+C146*Pecuária!$E$43/2*50%,0)","v":0},{"$f":"ROUND((B153+C153+D153)*Pecuária!$E$44,0)","v":0},{"$f":"IF(OR(Pecuária!$D$88=\"bezerra\",Pecuária!$D$89=\"bezerra\"),ROUND((B153+C153+D153-E153)*100%,0),\"0\")","v":"0"},{"$f":"ROUND(B153+C153+D153-E153-F153,0)","v":0},{"$f":"ROUND(SUM(B153,C153)+D153/2-E153/2,0)","v":0},{"$f":"ROUND(H153*Pecuária!$C$80,0)","v":0},null,{"$f":"Pecuária!$E$38","v":0},{"$f":"ROUND(J146*Pecuária!$E$43*50%+K146*Pecuária!$E$43/2*50%,0)","v":0},{"$f":"ROUND((J153+K153+L153)*Pecuária!$E$44,0)","v":0},{"$f":"IF(OR(Pecuária!$D$88=\"bezerra\",Pecuária!$D$89=\"bezerra\"),ROUND((J153+K153+L153-M153)*100%,0),\"0\")","v":"0"},{"$f":"ROUND(J153+K153+L153-M153-N153,0)","v":0},{"$f":"ROUND(SUM(J153,K153)+L153/2-M153/2,0)","v":0},{"$f":"ROUND(P153*Pecuária!$C$80,0)","v":0}]
["Total",{"$f":"SUM(B145:B153)","v":0},0,{"$f":"SUM(D152:D153)","v":0},0,0,0,0,0,0,0,{"$f":"SUM(L152:L153)","v":0},0,0,0,0,0]
[]
["Categoria","Ano 11",null,null,null,null,null,null,null,"Ano 12"]
[null,"Qtd Inicial ","Aquis.","Nasc.","Perda","Venda","Qtd Final","Qtd Média",null,"Qtd Inicial ","Aquis.","Nasc.","Perda","Venda","Qtd Final","Qtd Média"]
[null,"(cab.)","(cab.)","(cab.)","(cab.)","(cab.)","(cab.)","(cab.)","(UA)","(cab.)","(cab.)","(cab.)","(cab.)","(cab.)","(cab.)","(cab.)","(UA)"]
["Reprodutores",{"$f":"O145","v":0},{"$f":"Pecuária!$E$30","v":0},null,{"$f":"ROUND((B159+C159)*Pecuária!$E$47,0)","v":0},{"$f":"ROUND((B159+C159-E159)*Pecuária!$D$84,0)","v":0},{"$f":"ROUND(B159+C159-E159-F159,0)","v":0},{"$f":"ROUND(SUM(B159,C159)-SUM(E159,F159)/2,0)","v":0},{"$f":"ROUND(H159*Pecuária!$C$72,0)","v":0},{"$f":"G159","v":0},{"$f":"Pecuária!$E$30","v":0},null,{"$f":"ROUND((J159+K159)*Pecuária!$E$47,0)","v":0},{"$f":"ROUND((J159+K159-M159)*Pecuária!$D$84,0)","v":0},{"$f":"ROUND(J159+K159-M159-N159,0)","v":0},{"$f":"ROUND(SUM(J159,K159)-SUM(M159,N159)/2,0)","v":0},{"$f":"ROUND(P159*Pecuária!$C$72,0)","v":0}]
["Matrizes",{"$f":"O146+O149","v":0},{"$f":"Pecuária!$E$31","v":0},null,{"$f":"ROUND((B160+C160)*Pecuária!$E$47,0)","v":0},{"$f":"ROUND((B160+C160-E160)*Pecuária!$D$85,0)","v":0},0,{"$f":"ROUND(SUM(B160,C160)-SUM(E160,F160)/2,0)","v":0},{"$f":"ROUND(H160*Pecuária!$C$73,0)","v":0},{"$f":"G160+G163","v":0},{"$f":"Pecuária!$E$31","v":0},null,{"$f":"ROUND((J160+K160)*Pecuária!$E$47,0)","v":0},{"$f":"ROUND((J160+K160-M160)*Pecuária!$D$85,0)","v":0},0,{"$f":"ROUND(SUM(J160,K160)-SUM(M160,N160)/2,0)","v":0},{"$f":"ROUND(P160*Pecuária!$C$73,0)","v":0}]
["Bois",{"$f":"O147+O148","v":0},{"$f":"Pecuária!$E$32","v":0},null,{"$f":"ROUND((B161+C161)*Pecuária!$E$47,0)","v":0},{"$f":"IF(OR(Pecuária!$D$86=\"bois\",Pecuária!$D$87=\"bois\"),ROUND((B161+C161-E161)*100%,0),\"0\")","v":"0"},0,{"$f":"ROUND(SUM(B161,C161)-E161/2,0)","v":0},{"$f":"ROUND(H161*Pecuária!$C$74,0)","v":0},{"$f":"G161+G162","v":0},{"$f":"Pecuária!$E$32","v":0},null,{"$f":"ROUND((J161+K161)*Pecuária!$E$47,0)","v":0},{"$f":"IF(OR(Pecuária!$D$86=\"bois\",Pecuária!$D$87=\"bois\"),ROUND((J161+K161-M161)*100%,0),\"0\")","v":"0"},0,{"$f":"ROUND(SUM(J161,K161)-M161/2,0)","v":0},{"$f":"ROUND(P161*Pecuária!$C$74,0)","v":0}]
["Novilhos",{"$f":"O150","v":0},{"$f":"Pecuária!$E$33","v":0},null,{"$f":"ROUND((B162+C162)*Pecuária!$E$46,0)","v":0},{"$f":"IF(OR(Pecuária!$D$86=\"novilho\",Pecuária!$D$87=\"novilho\"),ROUND((B162+C162-E162)*100%,0),\"0\")","v":"0"},0,{"$f":"ROUND(SUM(B162,C162)-E162/2,0)","v":0},{"$f":"ROUND(H162*Pecuária!$C$75,0)","v":0},{"$f":"G164","v":0},{"$f":"Pecuária!$E$33","v":0},null,{"$f":"ROUND((J162+K162)*Pecuária!$E$46,0)","v":0},{"$f":"IF(OR(Pecuária!$D$86=\"novilho\",Pecuária!$D$87=\"novilho\"),ROUND((J162+K162-M162)*100%,0),\"0\")","v":"0"},0,{"$f":"ROUND(SUM(J162,K162)-M162/2,0)","v":0},{"$f":"ROUND(P162*Pecuária!$C$75,0)","v":0}]
["Novilhas ",{"$f":"O151","v":0},{"$f":"Pecuária!$E$34","v":0},null,{"$f":"ROUND((B163+C163)*Pecuária!$E$46,0)","v":0},{"$f":"IF(OR(Pecuária!$D$88=\"novilha\",Pecuária!$D$89=\"novilha\"),ROUND((B163+C163-E163)*100%,0),\"0\")","v":"0"},0,{"$f":"ROUND(SUM(B163,C163)-E163/2,0)","v":0},{"$f":"ROUND(H163*Pecuária!$C$76,0)","v":0},{"$f":"G165","v":0},{"$f":"Pecuária!$E$34","v":0},null,{"$f":"ROUND((J163+K163)*Pecuária!$E$46,0)","v":0},{"$f":"IF(OR(Pecuária!$D$88=\"novilha\",Pecuária!$D$89=\"novilha\"),ROUND((J163+K163-M163)*100%,0),\"0\")","v":"0"},0,{"$f":"ROUND(SUM(J163,K163)-M163/2,0)","v":0},{"$f":"ROUND(P163*Pecuária!$C$76,0)","v":0}]
["Garrotes",{"$f":"O152","v":0},{"$f":"Pecuária!$E$35","v":0},null,{"$f":"ROUND((B164+C164)*Pecuária!$E$45,0)","v":0},{"$f":"IF(OR(Pecuária!$D$86=\"garrote\",Pecuária!$D$87=\"garrote\"),ROUND((B164+C164-E164)*100%,0),\"0\")","v":"0"},0,{"$f":"ROUND(SUM(B164,C164)-E164/2,0)","v":0},{"$f":"ROUND(H164*Pecuária!$C$77,0)","v":0},{"$f":"G166","v":0},{"$f":"Pecuária!$E$35","v":0},null,{"$f":"ROUND((J164+K164)*Pecuária!$E$45,0)","v":0},{"$f":"IF(OR(Pecuária!$D$86=\"garrote\",Pecuária!$D$87=\"garrote\"),ROUND((J164+K164-M164)*100%,0),\"0\")","v":"0"},0,{"$f":"ROUND(SUM(J164,K164)-M164/2,0)","v":0},{"$f":"ROUND(P164*Pecuária!$C$77,0)","v":0}]
["Garrotas ",{"$f":"O153","v":0},{"$f":"Pecuária!$E$36","v":0},null,{"$f":"ROUND((B165+C165)*Pecuária!$E$45,0)","v":0},{"$f":"IF(OR(Pecuária!$D$88=\"garrota\",Pecuária!$D$89=\"garrota\"),ROUND((B165+C165-E165)*100%,0),\"0\")","v":"0"},0,{"$f":"ROUND(SUM(B165,C165)-E165/2,0)","v":0},{"$f":"ROUND(H165*Pecuária!$C$78,0)","v":0},{"$f":"G167","v":0},{"$f":"Pecuária!$E$36","v":0},null,{"$f":"ROUND((J165+K165)*Pecuária!$E$45,0)","v":0},{"$f":"IF(OR(Pecuária!$D$88=\"garrota\",Pecuária!$D$89=\"garrota\"),ROUND((J165+K165-M165)*100%,0),\"0\")","v":"0"},0,{"$f":"ROUND(SUM(J165,K165)-M165/2,0)","v":0},{"$f":"ROUND(P165*Pecuária!$C$78,0)","v":0}]
["Bezerros ",null,{"$f":"Pecuária!$E$37","v":0},{"$f":"ROUND(B160*Pecuária!$E$43*50%+C160*Pecuária!$E$43/2*50%,0)","v":0},{"$f":"ROUND((B166+C166+D166)*Pecuária!$E$44,0)","v":0},{"$f":"IF(OR(Pecuária!$D$86=\"bezerro\",Pecuária!$D$87=\"bezerro\"),ROUND((B166+C166+D166-E166)*100%,0),\"0\")","v":"0"},{"$f":"ROUND(B166+C166+D166-E166-F166,0)","v":0},{"$f":"ROUND(SUM(B166,C166)+D166/2-E166/2,0)","v":0},{"$f":"ROUND(H166*Pecuária!$C$79,0)","v":0},null,{"$f":"Pecuária!$E$37","v":0},{"$f":"ROUND(J160*Pecuária!$E$43*50%+K160*Pecuária!$E$43/2*50%,0)","v":0},{"$f":"ROUND((J166+K166+L166)*Pecuária!$E$44,0)","v":0},{"$f":"IF(OR(Pecuária!$D$86=\"bezerro\",Pecuária!$D$87=\"bezerro\"),ROUND((J166+K166+L166-M166)*100%,0),\"0\")","v":"0"},{"$f":"ROUND(J166+K166+L166-M166-N166,0)","v":0},{"$f":"ROUND(SUM(J166,K166)+L166/2-M166/2,0)","v":0},{"$f":"ROUND(P166*Pecuária!$C$79,0)","v":0}]
["Bezerras ",null,{"$f":"Pecuária!$E$38","v":0},{"$f":"ROUND(B160*Pecuária!$E$43*50%+C160*Pecuária!$E$43/2*50%,0)","v":0},{"$f":"ROUND((B167+C167+D167)*Pecuária!$E$44,0)","v":0},{"$f":"IF(OR(Pecuária!$D$88=\"bezerra\",Pecuária!$D$89=\"bezerra\"),ROUND((B167+C167+D167-E167)*100%,0),\"0\")","v":"0"},{"$f":"ROUND(B167+C167+D167-E167-F167,0)","v":0},{"$f":"ROUND(SUM(B167,C167)+D167/2-E167/2,0)","v":0},{"$f":"ROUND(H167*Pecuária!$C$80,0)","v":0},null,{"$f":"Pecuária!$E$38","v":0},{"$f":"ROUND(J160*Pecuária!$E$43*50%+K160*Pecuária!$E$43/2*50%,0)","v":0},{"$f":"ROUND((J167+K167+L167)*Pecuária!$E$44,0)","v":0},{"$f":"IF(OR(Pecuária!$D$88=\"bezerra\",Pecuária!$D$89=\"bezerra\"),ROUND((J167+K167+L167-M167)*100%,0),\"0\")","v":"0"},{"$f":"ROUND(J167+K167+L167-M167-N167,0)","v":0},{"$f":"ROUND(SUM(J167,K167)+L167/2-M167/2,0)","v":0},{"$f":"ROUND(P167*Pecuária!$C$80,0)","v":0}]
["Total",{"$f":"SUM(B159:B167)","v":0},{"$f":"SUM(C159:C167)","v":0},{"$f":"SUM(D166:D167)","v":0},{"$f":"SUM(E159:E167)","v":0},0,0,0,0,0,0,{"$f":"SUM(L166:L167)","v":0},0,0,0,0,0]

{"sheet":"Mem pecuaria","index":21,"n_rows":118,"n_cols":13,"rows_kept":118,"cut":false,"hidden":true,"merged":[[112,0,112,12],[70,0,72,0],[70,1,70,12],[98,0,100,0],[98,1,98,12],[53,0,55,0],[53,1,53,12],[54,1,54,2],[54,3,54,4],[54,5,54,6],[54,7,54,8],[54,9,54,10],[54,11,54,12],[35,0,35,12],[36,0,38,0],[36,1,36,12],[37,1,37,2],[37,3,37,4],[37,5,37,6],[37,7,37,8],[37,9,37,10],[37,11,37,12],[18,0,20,0],[18,1,18,12],[19,1,19,2],[19,3,19,4],[19,5,19,6],[19,7,19,8],[19,9,19,10],[19,11,19,12],[0,0,0,12],[1,0,3,0],[1,1,1,12],[2,1,2,2],[2,3,2,4],[2,5,2,6],[2,7,2,8],[2,9,2,10],[2,11,2,12]]}
["Receitas - Rebanho de Corte"]
["Produtos Comercializados","Produção"]
[null,"Ano 1",null,"Ano 2",null,"Ano 3",null,"Ano 4",null,"Ano 5",null,"Ano 6"]
[null,"Qtd","Valor","Qtd","Valor","Qtd","Valor","Qtd","Valor","Qtd","Valor","Qtd","Valor"]
["Touro descartado",{"$f":"'Evolução rebanho'!F5","v":0},{"$f":"B5*Pecuária!$B95","v":0},{"$f":"'Evolução rebanho'!N5","v":0},{"$f":"D5*Pecuária!B95","v":0},{"$f":"'Evolução rebanho'!F19","v":0},{"$f":"F5*Pecuária!B95","v":0},{"$f":"'Evolução rebanho'!N19","v":0},{"$f":"H5*Pecuária!B95","v":0},{"$f":"'Evolução rebanho'!F33","v":0},{"$f":"J5*Pecuária!$B$95","v":0},{"$f":"'Evolução rebanho'!N33","v":0},{"$f":"L5*Pecuária!$B$95","v":0}]
["Matriz descartada",{"$f":"'Evolução rebanho'!F6","v":0},{"$f":"B6*Pecuária!B96","v":0},{"$f":"'Evolução rebanho'!N6","v":0},{"$f":"D6*Pecuária!B96","v":0},{"$f":"'Evolução rebanho'!F20","v":0},{"$f":"F6*Pecuária!B96","v":0},{"$f":"'Evolução rebanho'!N20","v":0},{"$f":"H6*Pecuária!B96","v":0},{"$f":"'Evolução rebanho'!F34","v":0},{"$f":"J6*Pecuária!$B$96","v":0},{"$f":"'Evolução rebanho'!N34","v":0},{"$f":"L6*Pecuária!$B$96","v":0}]
["Boi Gordo p/ abate",{"$f":"'Evolução rebanho'!F7","v":"0"},{"$f":"B7*Pecuária!B97","v":0},{"$f":"'Evolução rebanho'!N7","v":"0"},{"$f":"D7*Pecuária!B97","v":0},{"$f":"'Evolução rebanho'!F21","v":"0"},{"$f":"F7*Pecuária!B97","v":0},{"$f":"'Evolução rebanho'!N21","v":"0"},{"$f":"H7*Pecuária!B97","v":0},{"$f":"'Evolução rebanho'!F35","v":"0"},{"$f":"J7*Pecuária!$B$97","v":0},{"$f":"'Evolução rebanho'!N35","v":"0"},{"$f":"L7*Pecuária!$B$97","v":0}]
["Novilho Gordo",{"$f":"'Evolução rebanho'!F8","v":"0"},{"$f":"B8*Pecuária!B98","v":0},{"$f":"'Evolução rebanho'!N8","v":"0"},{"$f":"D8*Pecuária!B98","v":0},{"$f":"'Evolução rebanho'!F22","v":"0"},{"$f":"F8*Pecuária!B98","v":0},{"$f":"'Evolução rebanho'!N22","v":"0"},{"$f":"H8*Pecuária!B98","v":0},{"$f":"'Evolução rebanho'!F36","v":"0"},{"$f":"J8*Pecuária!$B$98","v":0},{"$f":"'Evolução rebanho'!N36","v":"0"},{"$f":"L8*Pecuária!$B$98","v":0}]
["Fêmea Excedente",{"$f":"'Evolução rebanho'!F9","v":"0"},{"$f":"B9*Pecuária!B99","v":0},{"$f":"'Evolução rebanho'!N9","v":"0"},{"$f":"D9*Pecuária!B99","v":0},{"$f":"'Evolução rebanho'!F23","v":"0"},{"$f":"F9*Pecuária!B99","v":0},{"$f":"'Evolução rebanho'!N23","v":"0"},{"$f":"H9*Pecuária!B99","v":0},{"$f":"'Evolução rebanho'!F37","v":"0"},{"$f":"J9*Pecuária!$B$99","v":0},{"$f":"'Evolução rebanho'!N37","v":"0"},{"$f":"L9*Pecuária!$B$99","v":0}]
["Garrotes ",{"$f":"'Evolução rebanho'!F10","v":"0"},{"$f":"B10*Pecuária!B100","v":0},{"$f":"'Evolução rebanho'!N10","v":"0"},{"$f":"D10*Pecuária!B100","v":0},{"$f":"'Evolução rebanho'!F24","v":"0"},{"$f":"F10*Pecuária!B100","v":0},{"$f":"'Evolução rebanho'!N24","v":"0"},{"$f":"H10*Pecuária!B100","v":0},{"$f":"'Evolução rebanho'!F38","v":"0"},{"$f":"J10*Pecuária!$B$100","v":0},{"$f":"'Evolução rebanho'!N38","v":"0"},{"$f":"L10*Pecuária!$B$100","v":0}]
["Garrotas ",{"$f":"'Evolução rebanho'!F11","v":"0"},{"$f":"B11*Pecuária!B101","v":0},{"$f":"'Evolução rebanho'!N11","v":"0"},{"$f":"D11*Pecuária!B101","v":0},{"$f":"'Evolução rebanho'!F25","v":"0"},{"$f":"F11*Pecuária!B101","v":0},{"$f":"'Evolução rebanho'!N25","v":"0"},{"$f":"H11*Pecuária!B101","v":0},{"$f":"'Evolução rebanho'!F39","v":"0"},{"$f":"J11*Pecuária!$B$101","v":0},{"$f":"'Evolução rebanho'!N39","v":"0"},{"$f":"L11*Pecuária!$B$101","v":0}]
["Bezerros ",{"$f":"'Evolução rebanho'!F12","v":0},{"$f":"B12*Pecuária!B102","v":0},{"$f":"'Evolução rebanho'!N12","v":"0"},{"$f":"D12*Pecuária!B102","v":0},{"$f":"'Evolução rebanho'!F26","v":"0"},{"$f":"F12*Pecuária!B102","v":0},{"$f":"'Evolução rebanho'!N26","v":"0"},{"$f":"H12*Pecuária!B102","v":0},{"$f":"'Evolução rebanho'!F40","v":"0"},{"$f":"J12*Pecuária!$B$102","v":0},{"$f":"'Evolução rebanho'!N40","v":"0"},{"$f":"L12*Pecuária!$B$102","v":0}]
["Bezerras ",{"$f":"'Evolução rebanho'!F13","v":"0"},{"$f":"B13*Pecuária!B103","v":0},{"$f":"'Evolução rebanho'!N13","v":"0"},{"$f":"D13*Pecuária!B103","v":0},{"$f":"'Evolução rebanho'!F27","v":"0"},{"$f":"F13*Pecuária!B103","v":0},{"$f":"'Evolução rebanho'!N27","v":"0"},{"$f":"H13*Pecuária!B103","v":0},{"$f":"'Evolução rebanho'!F41","v":"0"},{"$f":"J13*Pecuária!$B$103","v":0},{"$f":"'Evolução rebanho'!N41","v":"0"},{"$f":"L13*Pecuária!$B$103","v":0}]
["Leite (l)",{"$f":"IF(Pecuária!$C$90=\"Leite\",('Evolução rebanho'!$B$6+'Evolução rebanho'!$C$6)*Pecuária!C43*Pecuária!C54*Pecuária!C55*100%,\"0\")","v":"0"},{"$f":"B14*Pecuária!B104","v":0},{"$f":"IF(Pecuária!$C$90=\"Leite\",('Evolução rebanho'!J6+'Evolução rebanho'!K6)*Pecuária!C43*Pecuária!C54*Pecuária!C55*100%,0)","v":0},{"$f":"D14*Pecuária!B104","v":0},{"$f":"IF(Pecuária!$C$90=\"Leite\",('Evolução rebanho'!B20+'Evolução rebanho'!C20)*Pecuária!C43*Pecuária!C54*Pecuária!C55*100%,0)","v":0},{"$f":"F14*Pecuária!B104","v":0},{"$f":"IF(Pecuária!$C$90=\"Leite\",('Evolução rebanho'!J20+'Evolução rebanho'!K20)*Pecuária!C43*Pecuária!C54*Pecuária!C55*100%,0)","v":0},{"$f":"H14*Pecuária!B104","v":0},{"$f":"IF(Pecuária!$C$90=\"Leite\",('Evolução rebanho'!B34+'Evolução rebanho'!C34)*Pecuária!C43*Pecuária!C54*Pecuária!C55*100%,0)","v":0},{"$f":"J14*Pecuária!$B$104","v":0},{"$f":"IF(Pecuária!$C$90=\"Leite\",('Evolução rebanho'!J34+'Evolução rebanho'!K34)*Pecuária!C43*Pecuária!C54*Pecuária!C55*100%,0)","v":0},{"$f":"L14*Pecuária!$B$104","v":0}]
["Queijo (kg)",{"$f":"IF(Pecuária!$C$90=\"queijo\",IFERROR(('Evolução rebanho'!$B$6+'Evolução rebanho'!$C$6)*Pecuária!$C$43*Pecuária!$C$54*Pecuária!$C$55*100%/Pecuária!C56,0),0)","v":0},{"$f":"B15*Pecuária!B105","v":0},{"$f":"IF(Pecuária!$C$90=\"queijo\",IFERROR(('Evolução rebanho'!$J$6+'Evolução rebanho'!$K$6)*Pecuária!$C$43*Pecuária!$C$54*Pecuária!$C$55*100%/Pecuária!C56,0),0)","v":0},{"$f":"D15*Pecuária!B105","v":0},{"$f":"IF(Pecuária!$C$90=\"queijo\",IFERROR(('Evolução rebanho'!$B$20+'Evolução rebanho'!$C$20)*Pecuária!$C$43*Pecuária!$C$54*Pecuária!$C$55*100%/Pecuária!C56,0),0)","v":0},{"$f":"F15*Pecuária!B105","v":0},{"$f":"IF(Pecuária!$C$90=\"queijo\",IFERROR(('Evolução rebanho'!J20+'Evolução rebanho'!K20)*Pecuária!$C$43*Pecuária!$C$54*Pecuária!$C$55*100%/Pecuária!C56,0),0)","v":0},{"$f":"H15*Pecuária!B105","v":0},{"$f":"IF(Pecuária!$C$90=\"queijo\",IFERROR(('Evolução rebanho'!B34+'Evolução rebanho'!C34)*Pecuária!$C$43*Pecuária!$C$54*Pecuária!$C$55*100%/Pecuária!C56,0),0)","v":0},{"$f":"J15*Pecuária!$B$105","v":0},{"$f":"IF(Pecuária!$C$90=\"queijo\",IFERROR(('Evolução rebanho'!J34+'Evolução rebanho'!K34)*Pecuária!$C$43*Pecuária!$C$54*Pecuária!$C$55*100%/Pecuária!C56,0),0)","v":0},{"$f":"L15*Pecuária!$B$105","v":0}]
["Manteiga (kg)",{"$f":"IF(Pecuária!$C$90=\"manteiga\",IFERROR(('Evolução rebanho'!$B$6+'Evolução rebanho'!$C$6)*Pecuária!$C$43*Pecuária!$C$54*Pecuária!$C$55*100%/Pecuária!C57,0),0)","v":0},{"$f":"B16*Pecuária!B106","v":0},{"$f":"IF(Pecuária!$C$90=\"manteiga\",IFERROR(('Evolução rebanho'!$J$6+'Evolução rebanho'!$K$6)*Pecuária!$C$43*Pecuária!$C$54*Pecuária!$C$55*100%/Pecuária!C57,0),0)","v":0},{"$f":"D16*Pecuária!B106","v":0},{"$f":"IF(Pecuária!$C$90=\"manteiga\",IFERROR(('Evolução rebanho'!$B$20+'Evolução rebanho'!$C$20)*Pecuária!$C$43*Pecuária!$C$54*Pecuária!$C$55*100%/Pecuária!C57,0),0)","v":0},{"$f":"F16*Pecuária!B106","v":0},{"$f":"IF(Pecuária!$C$90=\"manteiga\",IFERROR(('Evolução rebanho'!J20+'Evolução rebanho'!K20)*Pecuária!$C$43*Pecuária!$C$54*Pecuária!$C$55*100%/Pecuária!C57,0),0)","v":0},{"$f":"H16*Pecuária!B106","v":0},{"$f":"IF(Pecuária!$C$90=\"manteiga\",IFERROR(('Evolução rebanho'!B34+'Evolução rebanho'!C34)*Pecuária!$C$43*Pecuária!$C$54*Pecuária!$C$55*100%/Pecuária!C57,0),0)","v":0},{"$f":"J16*Pecuária!$B$106","v":0},{"$f":"IF(Pecuária!$C$90=\"manteiga\",IFERROR(('Evolução rebanho'!J34+'Evolução rebanho'!K34)*Pecuária!$C$43*Pecuária!$C$54*Pecuária!$C$55*100%/Pecuária!C57,0),0)","v":0},{"$f":"L16*Pecuária!$B$106","v":0}]
["Total",{"$f":"SUM(B5:B16)","v":0},0,0,{"$f":"SUM(E5:E16)","v":0},0,{"$f":"SUM(G5:G16)","v":0},0,{"$f":"SUM(I5:I16)","v":0},0,0,0,{"$f":"SUM(M5:M16)","v":0}]
[]
["Produtos Comercializados","Produção"]
[null,"Ano 7",null,"Ano 8",null,"Ano 9",null,"Ano 10",null,"Ano 11",null,"Ano 12"]
[null,"Qtd","Valor","Qtd","Valor","Qtd","Valor","Qtd","Valor","Qtd","Valor","Qtd","Valor"]
["Touro descartado",{"$f":"'Evolução rebanho'!F47","v":0},{"$f":"B22*Pecuária!$B$95","v":0},{"$f":"'Evolução rebanho'!N47","v":0},{"$f":"D22*Pecuária!$B$95","v":0},{"$f":"'Evolução rebanho'!F61","v":0},{"$f":"F22*Pecuária!$B$95","v":0},{"$f":"'Evolução rebanho'!N61","v":0},{"$f":"H22*Pecuária!$B$95","v":0},{"$f":"'Evolução rebanho'!F74","v":0},{"$f":"J22*Pecuária!$B$95","v":0},{"$f":"'Evolução rebanho'!N74","v":0},{"$f":"L22*Pecuária!$B$95","v":0}]
["Matriz descartada",{"$f":"'Evolução rebanho'!F48","v":0},{"$f":"B23*Pecuária!$B$96","v":0},{"$f":"'Evolução rebanho'!N48","v":0},{"$f":"D23*Pecuária!$B$96","v":0},{"$f":"'Evolução rebanho'!F62","v":0},{"$f":"F23*Pecuária!$B$96","v":0},{"$f":"'Evolução rebanho'!N62","v":0},{"$f":"H23*Pecuária!$B$96","v":0},{"$f":"'Evolução rebanho'!F75","v":0},{"$f":"J23*Pecuária!$B$96","v":0},{"$f":"'Evolução rebanho'!N75","v":0},{"$f":"L23*Pecuária!$B$96","v":0}]
["Boi Gordo p/ abate",{"$f":"'Evolução rebanho'!F49","v":"0"},{"$f":"B24*Pecuária!$B$97","v":0},{"$f":"'Evolução rebanho'!N49","v":"0"},{"$f":"D24*Pecuária!$B$97","v":0},{"$f":"'Evolução rebanho'!F63","v":"0"},{"$f":"F24*Pecuária!$B$97","v":0},{"$f":"'Evolução rebanho'!N63","v":"0"},{"$f":"H24*Pecuária!$B$97","v":0},{"$f":"'Evolução rebanho'!F76","v":"0"},{"$f":"J24*Pecuária!$B$97","v":0},{"$f":"'Evolução rebanho'!N76","v":"0"},{"$f":"L24*Pecuária!$B$97","v":0}]
["Novilho Gordo",{"$f":"'Evolução rebanho'!F50","v":"0"},{"$f":"B25*Pecuária!$B$98","v":0},{"$f":"'Evolução rebanho'!N50","v":"0"},{"$f":"D25*Pecuária!$B$98","v":0},{"$f":"'Evolução rebanho'!F64","v":"0"},{"$f":"F25*Pecuária!$B$98","v":0},{"$f":"'Evolução rebanho'!N64","v":"0"},{"$f":"H25*Pecuária!$B$98","v":0},{"$f":"'Evolução rebanho'!F77","v":"0"},{"$f":"J25*Pecuária!$B$98","v":0},{"$f":"'Evolução rebanho'!N77","v":"0"},{"$f":"L25*Pecuária!$B$98","v":0}]
["Fêmea Excedente",{"$f":"'Evolução rebanho'!F51","v":"0"},{"$f":"B26*Pecuária!$B$99","v":0},{"$f":"'Evolução rebanho'!N51","v":"0"},{"$f":"D26*Pecuária!$B$99","v":0},{"$f":"'Evolução rebanho'!F65","v":"0"},{"$f":"F26*Pecuária!$B$99","v":0},{"$f":"'Evolução rebanho'!N65","v":"0"},{"$f":"H26*Pecuária!$B$99","v":0},{"$f":"'Evolução rebanho'!F78","v":"0"},{"$f":"J26*Pecuária!$B$99","v":0},{"$f":"'Evolução rebanho'!N78","v":"0"},{"$f":"L26*Pecuária!$B$99","v":0}]
["Garrotes ",{"$f":"'Evolução rebanho'!F52","v":"0"},{"$f":"B27*Pecuária!$B$100","v":0},{"$f":"'Evolução rebanho'!N52","v":"0"},{"$f":"D27*Pecuária!$B$100","v":0},{"$f":"'Evolução rebanho'!F66","v":"0"},{"$f":"F27*Pecuária!$B$100","v":0},{"$f":"'Evolução rebanho'!N66","v":"0"},{"$f":"H27*Pecuária!$B$100","v":0},{"$f":"'Evolução rebanho'!F79","v":"0"},{"$f":"J27*Pecuária!$B$100","v":0},{"$f":"'Evolução rebanho'!N79","v":"0"},{"$f":"L27*Pecuária!$B$100","v":0}]
["Garrotas ",{"$f":"'Evolução rebanho'!F53","v":"0"},{"$f":"B28*Pecuária!$B$101","v":0},{"$f":"'Evolução rebanho'!N53","v":"0"},{"$f":"D28*Pecuária!$B$101","v":0},{"$f":"'Evolução rebanho'!F67","v":"0"},{"$f":"F28*Pecuária!$B$101","v":0},{"$f":"'Evolução rebanho'!N67","v":"0"},{"$f":"H28*Pecuária!$B$101","v":0},{"$f":"'Evolução rebanho'!F80","v":"0"},{"$f":"J28*Pecuária!$B$101","v":0},{"$f":"'Evolução rebanho'!N80","v":"0"},{"$f":"L28*Pecuária!$B$101","v":0}]
["Bezerros ",{"$f":"'Evolução rebanho'!F54","v":"0"},{"$f":"B29*Pecuária!$B$102","v":0},{"$f":"'Evolução rebanho'!N54","v":"0"},{"$f":"D29*Pecuária!$B$102","v":0},{"$f":"'Evolução rebanho'!F68","v":"0"},{"$f":"F29*Pecuária!$B$102","v":0},{"$f":"'Evolução rebanho'!N68","v":"0"},{"$f":"H29*Pecuária!$B$102","v":0},{"$f":"'Evolução rebanho'!F81","v":"0"},{"$f":"J29*Pecuária!$B$102","v":0},{"$f":"'Evolução rebanho'!N81","v":"0"},{"$f":"L29*Pecuária!$B$102","v":0}]
["Bezerras ",{"$f":"'Evolução rebanho'!F55","v":"0"},{"$f":"B30*Pecuária!$B$103","v":0},{"$f":"'Evolução rebanho'!N55","v":"0"},{"$f":"D30*Pecuária!$B$103","v":0},{"$f":"'Evolução rebanho'!F69","v":"0"},{"$f":"F30*Pecuária!$B$103","v":0},{"$f":"'Evolução rebanho'!N69","v":"0"},{"$f":"H30*Pecuária!$B$103","v":0},{"$f":"'Evolução rebanho'!F82","v":"0"},{"$f":"J30*Pecuária!$B$103","v":0},{"$f":"'Evolução rebanho'!N82","v":"0"},{"$f":"L30*Pecuária!$B$103","v":0}]
["Leite (l)",{"$f":"IF(Pecuária!$C$90=\"Leite\",('Evolução rebanho'!B48+'Evolução rebanho'!C48)*Pecuária!C43*Pecuária!C54*Pecuária!C55*100%,0)","v":0},{"$f":"B31*Pecuária!$B$104","v":0},{"$f":"IF(Pecuária!$C$90=\"Leite\",('Evolução rebanho'!J48+'Evolução rebanho'!K48)*Pecuária!C43*Pecuária!C54*Pecuária!C55*100%,0)","v":0},{"$f":"D31*Pecuária!$B$104","v":0},{"$f":"IF(Pecuária!$C$90=\"Leite\",('Evolução rebanho'!B62+'Evolução rebanho'!C62)*Pecuária!C43*Pecuária!C54*Pecuária!C55*100%,0)","v":0},{"$f":"F31*Pecuária!$B$104","v":0},{"$f":"IF(Pecuária!$C$90=\"Leite\",('Evolução rebanho'!J62+'Evolução rebanho'!K62)*Pecuária!C43*Pecuária!C54*Pecuária!C55*100%,0)","v":0},{"$f":"H31*Pecuária!$B$104","v":0},{"$f":"IF(Pecuária!$C$90=\"Leite\",('Evolução rebanho'!B75+'Evolução rebanho'!C75)*Pecuária!C43*Pecuária!C54*Pecuária!C55*100%,0)","v":0},{"$f":"J31*Pecuária!$B$104","v":0},{"$f":"IF(Pecuária!$C$90=\"Leite\",('Evolução rebanho'!J75+'Evolução rebanho'!K75)*Pecuária!C43*Pecuária!C54*Pecuária!C55*100%,0)","v":0},{"$f":"L31*Pecuária!$B$104","v":0}]
["Queijo (kg)",{"$f":"IF(Pecuária!$C$90=\"queijo\",IFERROR(('Evolução rebanho'!B48+'Evolução rebanho'!C48)*Pecuária!$C$43*Pecuária!$C$54*Pecuária!$C$55*100%/Pecuária!C56,0),0)","v":0},{"$f":"B32*Pecuária!$B$105","v":0},{"$f":"IF(Pecuária!$C$90=\"queijo\",IFERROR(('Evolução rebanho'!J48+'Evolução rebanho'!K48)*Pecuária!$C$43*Pecuária!$C$54*Pecuária!$C$55*100%/Pecuária!C56,0),0)","v":0},{"$f":"D32*Pecuária!$B$105","v":0},{"$f":"IF(Pecuária!$C$90=\"queijo\",IFERROR(('Evolução rebanho'!B62+'Evolução rebanho'!C62)*Pecuária!$C$43*Pecuária!$C$54*Pecuária!$C$55*100%/Pecuária!C56,0),0)","v":0},{"$f":"F32*Pecuária!$B$105","v":0},{"$f":"IF(Pecuária!$C$90=\"queijo\",IFERROR(('Evolução rebanho'!J62+'Evolução rebanho'!K62)*Pecuária!$C$43*Pecuária!$C$54*Pecuária!$C$55*100%/Pecuária!C56,0),0)","v":0},{"$f":"H32*Pecuária!$B$105","v":0},{"$f":"IF(Pecuária!$C$90=\"queijo\",IFERROR(('Evolução rebanho'!B75+'Evolução rebanho'!C75)*Pecuária!$C$43*Pecuária!$C$54*Pecuária!$C$55*100%/Pecuária!C56,0),0)","v":0},{"$f":"J32*Pecuária!$B$105","v":0},{"$f":"IF(Pecuária!$C$90=\"queijo\",IFERROR(('Evolução rebanho'!J75+'Evolução rebanho'!K75)*Pecuária!$C$43*Pecuária!$C$54*Pecuária!$C$55*100%/Pecuária!C56,0),0)","v":0},{"$f":"L32*Pecuária!$B$105","v":0}]
["Manteiga (kg)",{"$f":"IF(Pecuária!$C$90=\"manteiga\",IFERROR(('Evolução rebanho'!B48+'Evolução rebanho'!C48)*Pecuária!$C$43*Pecuária!$C$54*Pecuária!$C$55*100%/Pecuária!C57,0),0)","v":0},{"$f":"B33*Pecuária!$B$106","v":0},{"$f":"IF(Pecuária!$C$90=\"manteiga\",IFERROR(('Evolução rebanho'!J48+'Evolução rebanho'!K48)*Pecuária!$C$43*Pecuária!$C$54*Pecuária!$C$55*100%/Pecuária!C57,0),0)","v":0},{"$f":"D33*Pecuária!$B$106","v":0},{"$f":"IF(Pecuária!$C$90=\"manteiga\",IFERROR(('Evolução rebanho'!B62+'Evolução rebanho'!C62)*Pecuária!$C$43*Pecuária!$C$54*Pecuária!$C$55*100%/Pecuária!C57,0),0)","v":0},{"$f":"F33*Pecuária!$B$106","v":0},{"$f":"IF(Pecuária!$C$90=\"manteiga\",IFERROR(('Evolução rebanho'!J62+'Evolução rebanho'!K62)*Pecuária!$C$43*Pecuária!$C$54*Pecuária!$C$55*100%/Pecuária!C57,0),0)","v":0},{"$f":"H33*Pecuária!$B$106","v":0},{"$f":"IF(Pecuária!$C$90=\"manteiga\",IFERROR(('Evolução rebanho'!B75+'Evolução rebanho'!C75)*Pecuária!$C$43*Pecuária!$C$54*Pecuária!$C$55*100%/Pecuária!C57,0),0)","v":0},{"$f":"J33*Pecuária!$B$106","v":0},{"$f":"IF(Pecuária!$C$90=\"manteiga\",IFERROR(('Evolução rebanho'!J75+'Evolução rebanho'!K75)*Pecuária!$C$43*Pecuária!$C$54*Pecuária!$C$55*100%/Pecuária!C57,0),0)","v":0},{"$f":"L33*Pecuária!$B$106","v":0}]
["Total",{"$f":"SUM(B22:B33)","v":0},0,0,0,0,0,0,0,0,0,0,0]
[]
["Receitas - Rebanho de Leite"]
["Produtos Comercializados","Produção"]
[null,"Ano 1",null,"Ano 2",null,"Ano 3",null,"Ano 4",null,"Ano 5",null,"Ano 6"]
[null,"Qtd","Valor","Qtd","Valor","Qtd","Valor","Qtd","Valor","Qtd","Valor","Qtd","Valor"]
["Touro descartado",{"$f":"'Evolução rebanho'!F89","v":0},{"$f":"B40*Pecuária!C95","v":0},{"$f":"'Evolução rebanho'!N89","v":0},{"$f":"D40*Pecuária!$C$95","v":0},{"$f":"'Evolução rebanho'!F103","v":0},{"$f":"F40*Pecuária!$C$95","v":0},{"$f":"'Evolução rebanho'!N103","v":0},{"$f":"H40*Pecuária!$C$95","v":0},{"$f":"'Evolução rebanho'!F117","v":0},{"$f":"J40*Pecuária!$C$95","v":0},{"$f":"'Evolução rebanho'!N117","v":0},{"$f":"L40*Pecuária!$C$95","v":0}]
["Matriz descartada",{"$f":"'Evolução rebanho'!F90","v":0},{"$f":"B41*Pecuária!C96","v":0},{"$f":"'Evolução rebanho'!N90","v":0},{"$f":"D41*Pecuária!$C$96","v":0},{"$f":"'Evolução rebanho'!F104","v":0},{"$f":"F41*Pecuária!$C$96","v":0},{"$f":"'Evolução rebanho'!N104","v":0},{"$f":"H41*Pecuária!$C$96","v":0},{"$f":"'Evolução rebanho'!F118","v":0},{"$f":"J41*Pecuária!$C$96","v":0},{"$f":"'Evolução rebanho'!N118","v":0},{"$f":"L41*Pecuária!$C$96","v":0}]
["Boi Gordo p/ abate",{"$f":"'Evolução rebanho'!F91","v":"0"},{"$f":"B42*Pecuária!C97","v":0},{"$f":"'Evolução rebanho'!N91","v":"0"},{"$f":"D42*Pecuária!$C$97","v":0},{"$f":"'Evolução rebanho'!F105","v":"0"},{"$f":"F42*Pecuária!$C$97","v":0},{"$f":"'Evolução rebanho'!N105","v":"0"},{"$f":"H42*Pecuária!$C$97","v":0},{"$f":"'Evolução rebanho'!F119","v":"0"},{"$f":"J42*Pecuária!$C$97","v":0},{"$f":"'Evolução rebanho'!N119","v":"0"},{"$f":"L42*Pecuária!$C$97","v":0}]
["Novilho Gordo",{"$f":"'Evolução rebanho'!F92","v":"0"},{"$f":"B43*Pecuária!C98","v":0},{"$f":"'Evolução rebanho'!N92","v":"0"},{"$f":"D43*Pecuária!$C$98","v":0},{"$f":"'Evolução rebanho'!F106","v":"0"},{"$f":"F43*Pecuária!$C$98","v":0},{"$f":"'Evolução rebanho'!N106","v":"0"},{"$f":"H43*Pecuária!$C$98","v":0},{"$f":"'Evolução rebanho'!F120","v":"0"},{"$f":"J43*Pecuária!$C$98","v":0},{"$f":"'Evolução rebanho'!N120","v":"0"},{"$f":"L43*Pecuária!$C$98","v":0}]
["Fêmea Excedente",{"$f":"'Evolução rebanho'!F93","v":"0"},{"$f":"B44*Pecuária!C99","v":0},{"$f":"'Evolução rebanho'!N93","v":"0"},{"$f":"D44*Pecuária!$C$99","v":0},{"$f":"'Evolução rebanho'!F107","v":"0"},{"$f":"F44*Pecuária!$C$99","v":0},{"$f":"'Evolução rebanho'!N107","v":"0"},{"$f":"H44*Pecuária!$C$99","v":0},{"$f":"'Evolução rebanho'!F121","v":"0"},{"$f":"J44*Pecuária!$C$99","v":0},{"$f":"'Evolução rebanho'!N121","v":"0"},{"$f":"L44*Pecuária!$C$99","v":0}]
["Garrotes ",{"$f":"'Evolução rebanho'!F94","v":"0"},{"$f":"B45*Pecuária!C100","v":0},{"$f":"'Evolução rebanho'!N94","v":"0"},{"$f":"D45*Pecuária!$C$100","v":0},{"$f":"'Evolução rebanho'!F108","v":"0"},{"$f":"F45*Pecuária!$C$100","v":0},{"$f":"'Evolução rebanho'!N108","v":"0"},{"$f":"H45*Pecuária!$C$100","v":0},{"$f":"'Evolução rebanho'!F122","v":"0"},{"$f":"J45*Pecuária!$C$100","v":0},{"$f":"'Evolução rebanho'!N122","v":"0"},{"$f":"L45*Pecuária!$C$100","v":0}]
["Garrotas ",{"$f":"'Evolução rebanho'!F95","v":"0"},{"$f":"B46*Pecuária!C101","v":0},{"$f":"'Evolução rebanho'!N95","v":"0"},{"$f":"D46*Pecuária!$C$101","v":0},{"$f":"'Evolução rebanho'!F109","v":"0"},{"$f":"F46*Pecuária!$C$101","v":0},{"$f":"'Evolução rebanho'!N109","v":"0"},{"$f":"H46*Pecuária!$C$101","v":0},{"$f":"'Evolução rebanho'!F123","v":"0"},{"$f":"J46*Pecuária!$C$101","v":0},{"$f":"'Evolução rebanho'!N123","v":"0"},{"$f":"L46*Pecuária!$C$101","v":0}]
["Bezerros ",{"$f":"'Evolução rebanho'!F96","v":"0"},{"$f":"B47*Pecuária!C102","v":0},{"$f":"'Evolução rebanho'!N96","v":"0"},{"$f":"D47*Pecuária!$C$102","v":0},{"$f":"'Evolução rebanho'!F110","v":"0"},{"$f":"F47*Pecuária!$C$102","v":0},{"$f":"'Evolução rebanho'!N110","v":"0"},{"$f":"H47*Pecuária!$C$102","v":0},{"$f":"'Evolução rebanho'!F124","v":"0"},{"$f":"J47*Pecuária!$C$102","v":0},{"$f":"'Evolução rebanho'!N124","v":"0"},{"$f":"L47*Pecuária!$C$102","v":0}]
["Bezerras ",{"$f":"'Evolução rebanho'!F97","v":"0"},{"$f":"B48*Pecuária!C103","v":0},{"$f":"'Evolução rebanho'!N97","v":"0"},{"$f":"D48*Pecuária!$C$103","v":0},{"$f":"'Evolução rebanho'!F111","v":"0"},{"$f":"F48*Pecuária!$C$103","v":0},{"$f":"'Evolução rebanho'!N111","v":"0"},{"$f":"H48*Pecuária!$C$103","v":0},{"$f":"'Evolução rebanho'!F125","v":"0"},{"$f":"J48*Pecuária!$C$103","v":0},{"$f":"'Evolução rebanho'!N125","v":"0"},{"$f":"L48*Pecuária!$C$103","v":0}]
["Leite (l)",{"$f":"IF(Pecuária!$D$90=\"Leite\",('Evolução rebanho'!B90+'Evolução rebanho'!C90)*Pecuária!E43*Pecuária!E54*Pecuária!E55*100%,0)","v":0},{"$f":"B49*Pecuária!C104","v":0},{"$f":"IF(Pecuária!$D$90=\"Leite\",('Evolução rebanho'!J90+'Evolução rebanho'!K90)*Pecuária!E43*Pecuária!E54*Pecuária!E55*100%,0)","v":0},{"$f":"D49*Pecuária!$C$104","v":0},{"$f":"IF(Pecuária!$D$90=\"Leite\",('Evolução rebanho'!B104+'Evolução rebanho'!C104)*Pecuária!E43*Pecuária!E54*Pecuária!E55*100%,0)","v":0},{"$f":"F49*Pecuária!$C$104","v":0},{"$f":"IF(Pecuária!$D$90=\"Leite\",('Evolução rebanho'!J104+'Evolução rebanho'!K104)*Pecuária!E43*Pecuária!E54*Pecuária!E55*100%,0)","v":0},{"$f":"H49*Pecuária!$C$104","v":0},{"$f":"IF(Pecuária!$D$90=\"Leite\",('Evolução rebanho'!B118+'Evolução rebanho'!C118)*Pecuária!E43*Pecuária!E54*Pecuária!E55*100%,0)","v":0},{"$f":"J49*Pecuária!$C$104","v":0},{"$f":"IF(Pecuária!$D$90=\"Leite\",('Evolução rebanho'!J118+'Evolução rebanho'!K118)*Pecuária!E43*Pecuária!E54*Pecuária!E55*100%,0)","v":0},{"$f":"L49*Pecuária!$C$104","v":0}]
["Queijo (kg)",{"$f":"IF(Pecuária!$D$90=\"queijo\",IFERROR(('Evolução rebanho'!B90+'Evolução rebanho'!C90)*Pecuária!E43*Pecuária!E54*Pecuária!E55*100%/Pecuária!E56,0),0)","v":0},{"$f":"B50*Pecuária!C105","v":0},{"$f":"IF(Pecuária!$D$90=\"queijo\",IFERROR(('Evolução rebanho'!J90+'Evolução rebanho'!K90)*Pecuária!E43*Pecuária!E54*Pecuária!E55*100%/Pecuária!E56,0),0)","v":0},{"$f":"D50*Pecuária!$C$105","v":0},{"$f":"IF(Pecuária!$D$90=\"queijo\",IFERROR(('Evolução rebanho'!B104+'Evolução rebanho'!C104)*Pecuária!E43*Pecuária!E54*Pecuária!E55*100%/Pecuária!E56,0),0)","v":0},{"$f":"F50*Pecuária!$C$105","v":0},{"$f":"IF(Pecuária!$D$90=\"queijo\",IFERROR(('Evolução rebanho'!J104+'Evolução rebanho'!K104)*Pecuária!E43*Pecuária!E54*Pecuária!E55*100%/Pecuária!E56,0),0)","v":0},{"$f":"H50*Pecuária!$C$105","v":0},{"$f":"IF(Pecuária!$D$90=\"queijo\",IFERROR(('Evolução rebanho'!B118+'Evolução rebanho'!C118)*Pecuária!E43*Pecuária!E54*Pecuária!E55*100%/Pecuária!E56,0),0)","v":0},{"$f":"J50*Pecuária!$C$105","v":0},{"$f":"IF(Pecuária!$D$90=\"queijo\",IFERROR(('Evolução rebanho'!J118+'Evolução rebanho'!K118)*Pecuária!E43*Pecuária!E54*Pecuária!E55*100%/Pecuária!E56,0),0)","v":0},{"$f":"L50*Pecuária!$C$105","v":0}]
["Manteiga (kg)",{"$f":"IF(Pecuária!$D$90=\"manteiga\",IFERROR(('Evolução rebanho'!B90+'Evolução rebanho'!C90)*Pecuária!E43*Pecuária!E54*Pecuária!E55*100%/Pecuária!E57,0),0)","v":0},{"$f":"B51*Pecuária!C106","v":0},{"$f":"IF(Pecuária!$D$90=\"manteiga\",IFERROR(('Evolução rebanho'!J90+'Evolução rebanho'!K90)*Pecuária!E43*Pecuária!E54*Pecuária!E55*100%/Pecuária!E57,0),0)","v":0},{"$f":"D51*Pecuária!$C$106","v":0},{"$f":"IF(Pecuária!$D$90=\"manteiga\",IFERROR(('Evolução rebanho'!B104+'Evolução rebanho'!C104)*Pecuária!E43*Pecuária!E54*Pecuária!E55*100%/Pecuária!E57,0),0)","v":0},{"$f":"F51*Pecuária!$C$106","v":0},{"$f":"IF(Pecuária!$D$90=\"manteiga\",IFERROR(('Evolução rebanho'!J104+'Evolução rebanho'!K104)*Pecuária!E43*Pecuária!E54*Pecuária!E55*100%/Pecuária!E57,0),0)","v":0},{"$f":"H51*Pecuária!$C$106","v":0},{"$f":"IF(Pecuária!$D$90=\"manteiga\",IFERROR(('Evolução rebanho'!B118+'Evolução rebanho'!C118)*Pecuária!E43*Pecuária!E54*Pecuária!E55*100%/Pecuária!E57,0),0)","v":0},{"$f":"J51*Pecuária!$C$106","v":0},{"$f":"IF(Pecuária!$D$90=\"manteiga\",IFERROR(('Evolução rebanho'!J118+'Evolução rebanho'!K118)*Pecuária!E43*Pecuária!E54*Pecuária!E55*100%/Pecuária!E57,0),0)","v":0},{"$f":"L51*Pecuária!$C$106","v":0}]
["Total",{"$f":"SUM(B40:B51)","v":0},0,0,0,0,0,0,0,0,0,0,0]
[]
["Produtos Comercializados","Produção"]
[null,"Ano 7",null,"Ano 8",null,"Ano 9",null,"Ano 10",null,"Ano 11",null,"Ano 12"]
[null,"Qtd","Valor","Qtd","Valor","Qtd","Valor","Qtd","Valor","Qtd","Valor","Qtd","Valor"]
["Touro descartado",{"$f":"'Evolução rebanho'!F131","v":0},{"$f":"B57*Pecuária!$C$95","v":0},{"$f":"'Evolução rebanho'!N131","v":0},{"$f":"D57*Pecuária!$C$95","v":0},{"$f":"'Evolução rebanho'!F145","v":0},{"$f":"F57*Pecuária!$C$95","v":0},{"$f":"'Evolução rebanho'!N145","v":0},{"$f":"H57*Pecuária!$C$95","v":0},{"$f":"'Evolução rebanho'!F159","v":0},{"$f":"J57*Pecuária!$C$95","v":0},{"$f":"'Evolução rebanho'!N159","v":0},{"$f":"L57*Pecuária!$C$95","v":0}]
["Matriz descartada",{"$f":"'Evolução rebanho'!F132","v":0},{"$f":"B58*Pecuária!$C$96","v":0},{"$f":"'Evolução rebanho'!N132","v":0},{"$f":"D58*Pecuária!$C$96","v":0},{"$f":"'Evolução rebanho'!F146","v":0},{"$f":"F58*Pecuária!$C$96","v":0},{"$f":"'Evolução rebanho'!N146","v":0},{"$f":"H58*Pecuária!$C$96","v":0},{"$f":"'Evolução rebanho'!F160","v":0},{"$f":"J58*Pecuária!$C$96","v":0},{"$f":"'Evolução rebanho'!N160","v":0},{"$f":"L58*Pecuária!$C$96","v":0}]
["Boi Gordo p/ abate",{"$f":"'Evolução rebanho'!F133","v":"0"},{"$f":"B59*Pecuária!$C$97","v":0},{"$f":"'Evolução rebanho'!N133","v":"0"},{"$f":"D59*Pecuária!$C$97","v":0},{"$f":"'Evolução rebanho'!F147","v":"0"},{"$f":"F59*Pecuária!$C$97","v":0},{"$f":"'Evolução rebanho'!N147","v":"0"},{"$f":"H59*Pecuária!$C$97","v":0},{"$f":"'Evolução rebanho'!F161","v":"0"},{"$f":"J59*Pecuária!$C$97","v":0},{"$f":"'Evolução rebanho'!N161","v":"0"},{"$f":"L59*Pecuária!$C$97","v":0}]
["Novilho Gordo",{"$f":"'Evolução rebanho'!F134","v":"0"},{"$f":"B60*Pecuária!$C$98","v":0},{"$f":"'Evolução rebanho'!N134","v":"0"},{"$f":"D60*Pecuária!$C$98","v":0},{"$f":"'Evolução rebanho'!F148","v":"0"},{"$f":"F60*Pecuária!$C$98","v":0},{"$f":"'Evolução rebanho'!N148","v":"0"},{"$f":"H60*Pecuária!$C$98","v":0},{"$f":"'Evolução rebanho'!F162","v":"0"},{"$f":"J60*Pecuária!$C$98","v":0},{"$f":"'Evolução rebanho'!N162","v":"0"},{"$f":"L60*Pecuária!$C$98","v":0}]
["Fêmea Excedente",{"$f":"'Evolução rebanho'!F135","v":"0"},{"$f":"B61*Pecuária!$C$99","v":0},{"$f":"'Evolução rebanho'!N135","v":"0"},{"$f":"D61*Pecuária!$C$99","v":0},{"$f":"'Evolução rebanho'!F149","v":"0"},{"$f":"F61*Pecuária!$C$99","v":0},{"$f":"'Evolução rebanho'!N149","v":"0"},{"$f":"H61*Pecuária!$C$99","v":0},{"$f":"'Evolução rebanho'!F163","v":"0"},{"$f":"J61*Pecuária!$C$99","v":0},{"$f":"'Evolução rebanho'!N163","v":"0"},{"$f":"L61*Pecuária!$C$99","v":0}]
["Garrotes ",{"$f":"'Evolução rebanho'!F136","v":"0"},{"$f":"B62*Pecuária!$C$100","v":0},{"$f":"'Evolução rebanho'!N136","v":"0"},{"$f":"D62*Pecuária!$C$100","v":0},{"$f":"'Evolução rebanho'!F150","v":"0"},{"$f":"F62*Pecuária!$C$100","v":0},{"$f":"'Evolução rebanho'!N150","v":"0"},{"$f":"H62*Pecuária!$C$100","v":0},{"$f":"'Evolução rebanho'!F164","v":"0"},{"$f":"J62*Pecuária!$C$100","v":0},{"$f":"'Evolução rebanho'!N164","v":"0"},{"$f":"L62*Pecuária!$C$100","v":0}]
["Garrotas ",{"$f":"'Evolução rebanho'!F137","v":"0"},{"$f":"B63*Pecuária!$C$101","v":0},{"$f":"'Evolução rebanho'!N137","v":"0"},{"$f":"D63*Pecuária!$C$101","v":0},{"$f":"'Evolução rebanho'!F151","v":"0"},{"$f":"F63*Pecuária!$C$101","v":0},{"$f":"'Evolução rebanho'!N151","v":"0"},{"$f":"H63*Pecuária!$C$101","v":0},{"$f":"'Evolução rebanho'!F165","v":"0"},{"$f":"J63*Pecuária!$C$101","v":0},{"$f":"'Evolução rebanho'!N165","v":"0"},{"$f":"L63*Pecuária!$C$101","v":0}]
["Bezerros ",{"$f":"'Evolução rebanho'!F138","v":"0"},{"$f":"B64*Pecuária!$C$102","v":0},{"$f":"'Evolução rebanho'!N138","v":"0"},{"$f":"D64*Pecuária!$C$102","v":0},{"$f":"'Evolução rebanho'!F152","v":"0"},{"$f":"F64*Pecuária!$C$102","v":0},{"$f":"'Evolução rebanho'!N152","v":"0"},{"$f":"H64*Pecuária!$C$102","v":0},{"$f":"'Evolução rebanho'!F166","v":"0"},{"$f":"J64*Pecuária!$C$102","v":0},{"$f":"'Evolução rebanho'!N166","v":"0"},{"$f":"L64*Pecuária!$C$102","v":0}]
["Bezerras ",{"$f":"'Evolução rebanho'!F139","v":"0"},{"$f":"B65*Pecuária!$C$103","v":0},{"$f":"'Evolução rebanho'!N139","v":"0"},{"$f":"D65*Pecuária!$C$103","v":0},{"$f":"'Evolução rebanho'!F153","v":"0"},{"$f":"F65*Pecuária!$C$103","v":0},{"$f":"'Evolução rebanho'!N153","v":"0"},{"$f":"H65*Pecuária!$C$103","v":0},{"$f":"'Evolução rebanho'!F167","v":"0"},{"$f":"J65*Pecuária!$C$103","v":0},{"$f":"'Evolução rebanho'!N167","v":"0"},{"$f":"L65*Pecuária!$C$103","v":0}]
["Leite (l)",{"$f":"IF(Pecuária!$D$90=\"Leite\",('Evolução rebanho'!B132+'Evolução rebanho'!C132)*Pecuária!E43*Pecuária!E54*Pecuária!E55*100%,0)","v":0},{"$f":"B66*Pecuária!$C$104","v":0},{"$f":"IF(Pecuária!$D$90=\"Leite\",('Evolução rebanho'!J132+'Evolução rebanho'!K132)*Pecuária!E43*Pecuária!E54*Pecuária!E55*100%,0)","v":0},{"$f":"D66*Pecuária!$C$104","v":0},{"$f":"IF(Pecuária!$D$90=\"Leite\",('Evolução rebanho'!B146+'Evolução rebanho'!C146)*Pecuária!E43*Pecuária!E54*Pecuária!E55*100%,0)","v":0},{"$f":"F66*Pecuária!$C$104","v":0},{"$f":"IF(Pecuária!$D$90=\"Leite\",('Evolução rebanho'!J146+'Evolução rebanho'!K146)*Pecuária!E43*Pecuária!E54*Pecuária!E55*100%,0)","v":0},{"$f":"H66*Pecuária!$C$104","v":0},{"$f":"IF(Pecuária!$D$90=\"Leite\",('Evolução rebanho'!B160+'Evolução rebanho'!C160)*Pecuária!E43*Pecuária!E54*Pecuária!E55*100%,0)","v":0},{"$f":"J66*Pecuária!$C$104","v":0},{"$f":"IF(Pecuária!$D$90=\"Leite\",('Evolução rebanho'!J160+'Evolução rebanho'!K160)*Pecuária!E43*Pecuária!E54*Pecuária!E55*100%,0)","v":0},{"$f":"L66*Pecuária!$C$104","v":0}]
["Queijo (kg)",{"$f":"IF(Pecuária!$D$90=\"queijo\",IFERROR(('Evolução rebanho'!B132+'Evolução rebanho'!C132)*Pecuária!E43*Pecuária!E54*Pecuária!E55*100%/Pecuária!E56,0),0)","v":0},{"$f":"B67*Pecuária!$C$105","v":0},{"$f":"IF(Pecuária!$D$90=\"queijo\",IFERROR(('Evolução rebanho'!J132+'Evolução rebanho'!K132)*Pecuária!E43*Pecuária!E54*Pecuária!E55*100%/Pecuária!E56,0),0)","v":0},{"$f":"D67*Pecuária!$C$105","v":0},{"$f":"IF(Pecuária!$D$90=\"QUEIJO\",IFERROR(('Evolução rebanho'!B146+'Evolução rebanho'!C146)*Pecuária!E43*Pecuária!E54*Pecuária!E55*100%/Pecuária!E56,0),0)","v":0},{"$f":"F67*Pecuária!$C$105","v":0},{"$f":"IF(Pecuária!$D$90=\"queijo\",IFERROR(('Evolução rebanho'!J146+'Evolução rebanho'!K146)*Pecuária!E43*Pecuária!E54*Pecuária!E55*100%/Pecuária!E56,0),0)","v":0},{"$f":"H67*Pecuária!$C$105","v":0},{"$f":"IF(Pecuária!$D$90=\"queijo\",IFERROR(('Evolução rebanho'!B160+'Evolução rebanho'!C160)*Pecuária!E43*Pecuária!E54*Pecuária!E55*100%/Pecuária!E56,0),0)","v":0},{"$f":"J67*Pecuária!$C$105","v":0},{"$f":"IF(Pecuária!$D$90=\"queijo\",IFERROR(('Evolução rebanho'!J160+'Evolução rebanho'!K160)*Pecuária!E43*Pecuária!E54*Pecuária!E55*100%/Pecuária!E56,0),0)","v":0},{"$f":"L67*Pecuária!$C$105","v":0}]
["Manteiga (kg)",{"$f":"IF(Pecuária!$D$90=\"manteiga\",IFERROR(('Evolução rebanho'!B132+'Evolução rebanho'!C132)*Pecuária!E43*Pecuária!E54*Pecuária!E55*100%/Pecuária!E57,0),0)","v":0},{"$f":"B68*Pecuária!$C$106","v":0},{"$f":"IF(Pecuária!$D$90=\"manteiga\",IFERROR(('Evolução rebanho'!J132+'Evolução rebanho'!K132)*Pecuária!E43*Pecuária!E54*Pecuária!E55*100%/Pecuária!E57,0),0)","v":0},{"$f":"D68*Pecuária!$C$106","v":0},{"$f":"IF(Pecuária!$D$90=\"manteiga\",IFERROR(('Evolução rebanho'!B146+'Evolução rebanho'!C146)*Pecuária!E43*Pecuária!E54*Pecuária!E55*100%/Pecuária!E57,0),0)","v":0},{"$f":"F68*Pecuária!$C$106","v":0},{"$f":"IF(Pecuária!$D$90=\"manteiga\",IFERROR(('Evolução rebanho'!J146+'Evolução rebanho'!K146)*Pecuária!E43*Pecuária!E54*Pecuária!E55*100%/Pecuária!E57,0),0)","v":0},{"$f":"H68*Pecuária!$C$106","v":0},{"$f":"IF(Pecuária!$D$90=\"manteiga\",IFERROR(('Evolução rebanho'!B160+'Evolução rebanho'!C160)*Pecuária!E43*Pecuária!E54*Pecuária!E55*100%/Pecuária!E57,0),0)","v":0},{"$f":"J68*Pecuária!$C$106","v":0},{"$f":"IF(Pecuária!$D$90=\"manteiga\",IFERROR(('Evolução rebanho'!J160+'Evolução rebanho'!K160)*Pecuária!E43*Pecuária!E54*Pecuária!E55*100%/Pecuária!E57,0),0)","v":0},{"$f":"L68*Pecuária!$C$106","v":0}]
["Total",{"$f":"SUM(B57:B68)","v":0},0,0,0,0,0,0,0,0,0,0,0]
[]
["Especificação","Custo Operacional - Despesas não Financiadas (Rebanho de Corte  e Rebanho de Leite)"]
[null,"Ano 1","Ano 2","Ano 3","Ano 4","Ano 5","Ano 6","Ano 7","Ano 8","Ano 9","Ano 10","Ano 11","Ano 12"]
[null,"Valor Total","Valor Total","Valor Total","Valor Total","Valor Total","Valor Total","Valor Total","Valor Total","Valor Total","Valor Total","Valor Total","Valor Total"]
[{"$f":"IF(Pecuária!A112=\"\",\"\",Pecuária!A112)","v":"Sal mineral"},{"$f":"IF(Pecuária!$E$112=1,((Pecuária!C112*365)*Pecuária!D112)*('Evolução rebanho'!$H$14+'Evolução rebanho'!$H$98),0)","v":0},{"$f":"IFERROR(IF(Pecuária!$E$112<=2,((Pecuária!C112*365)*Pecuária!D112)*('Evolução rebanho'!$P$14+'Evolução rebanho'!$P$98),0),\"\")","v":0},{"$f":"IFERROR(IF(Pecuária!$E$112<=3,((Pecuária!C112*365)*Pecuária!D112)*('Evolução rebanho'!$H$28+'Evolução rebanho'!$H$112),0),\"\")","v":0},{"$f":"IFERROR(IF(Pecuária!$E$112<=4,((Pecuária!C112*365)*Pecuária!D112)*('Evolução rebanho'!$P$28+'Evolução rebanho'!$P$112),0),\"\")","v":0},{"$f":"IFERROR(IF(Pecuária!$E$112<=5,((Pecuária!C112*365)*Pecuária!D112)*('Evolução rebanho'!$H$42+'Evolução rebanho'!$H$126),0),\"\")","v":0},{"$f":"IFERROR(IF(Pecuária!$E$112<=6,((Pecuária!C112*365)*Pecuária!D112)*('Evolução rebanho'!$P$42+'Evolução rebanho'!$P$126),0),\"\")","v":0},{"$f":"IFERROR(IF(Pecuária!$E$112<=7,((Pecuária!C112*365)*Pecuária!D112)*('Evolução rebanho'!$H$56+'Evolução rebanho'!$H$140),0),\"\")","v":0},{"$f":"IFERROR(IF(Pecuária!$E$112<=8,((Pecuária!C112*365)*Pecuária!D112)*('Evolução rebanho'!$P$56+'Evolução rebanho'!$P$140),0),\"\")","v":0},{"$f":"IFERROR(IF(Pecuária!$E$112<=9,((Pecuária!C112*365)*Pecuária!D112)*('Evolução rebanho'!$H$70+'Evolução rebanho'!$H$154),0),\"\")","v":0},{"$f":"IFERROR(IF(Pecuária!$E$112<=10,((Pecuária!C112*365)*Pecuária!D112)*('Evolução rebanho'!$P$70+'Evolução rebanho'!$P$154),0),\"\")","v":0},{"$f":"IFERROR(IF(Pecuária!$E$112<=11,((Pecuária!C112*365)*Pecuária!D112)*('Evolução rebanho'!$H$83+'Evolução rebanho'!$H$168),0),\"\")","v":0},{"$f":"IFERROR(IF(Pecuária!$E$112<=12,((Pecuária!C112*365)*Pecuária!D112)*('Evolução rebanho'!$P$83+'Evolução rebanho'!$P$168),0),\"\")","v":0}]
[{"$f":"IF(Pecuária!A113=\"\",\"\",Pecuária!A113)","v":""},{"$f":"IFERROR(IF(Pecuária!$E$112=1,((Pecuária!C113*365)*Pecuária!D113)*('Evolução rebanho'!$H$14+'Evolução rebanho'!$H$98),0),\"\")","v":0},{"$f":"IFERROR(IF(Pecuária!$E$112<=2,((Pecuária!C113*365)*Pecuária!D113)*('Evolução rebanho'!$P$14+'Evolução rebanho'!$P$98),0),\"\")","v":0},{"$f":"IFERROR(IF(Pecuária!$E$112<=3,((Pecuária!C113*365)*Pecuária!D113)*('Evolução rebanho'!$H$28+'Evolução rebanho'!$H$112),0),\"\")","v":0},{"$f":"IFERROR(IF(Pecuária!$E$112<=4,((Pecuária!C113*365)*Pecuária!D113)*('Evolução rebanho'!$P$28+'Evolução rebanho'!$P$112),0),\"\")","v":0},{"$f":"IFERROR(IF(Pecuária!$E$112<=5,((Pecuária!C113*365)*Pecuária!D113)*('Evolução rebanho'!$H$42+'Evolução rebanho'!$H$126),0),\"\")","v":0},{"$f":"IFERROR(IF(Pecuária!$E$112<=6,((Pecuária!C113*365)*Pecuária!D113)*('Evolução rebanho'!$P$42+'Evolução rebanho'!P$126),0),\"\")","v":0},{"$f":"IFERROR(IF(Pecuária!$E$112<=7,((Pecuária!C113*365)*Pecuária!D113)*('Evolução rebanho'!$H$56+'Evolução rebanho'!$H$140),0),\"\")","v":0},{"$f":"IFERROR(IF(Pecuária!$E$112<=8,((Pecuária!C113*365)*Pecuária!D113)*('Evolução rebanho'!$P$56+'Evolução rebanho'!$P$140),0),\"\")","v":0},{"$f":"IFERROR(IF(Pecuária!$E$112<=9,((Pecuária!C113*365)*Pecuária!D113)*('Evolução rebanho'!$H$70+'Evolução rebanho'!$H$154),0),\"\")","v":0},{"$f":"IFERROR(IF(Pecuária!$E$112<=10,((Pecuária!C113*365)*Pecuária!D113)*('Evolução rebanho'!$P$70+'Evolução rebanho'!$P$154),0),\"\")","v":0},{"$f":"IFERROR(IF(Pecuária!$E$112<=11,((Pecuária!C113*365)*Pecuária!D113)*('Evolução rebanho'!$H$83+'Evolução rebanho'!$H$168),0),\"\")","v":0},{"$f":"IFERROR(IF(Pecuária!$E$112<=12,((Pecuária!C113*365)*Pecuária!D113)*('Evolução rebanho'!$P$83+'Evolução rebanho'!$P$168),0),\"\")","v":0}]
[{"$f":"IF(Pecuária!A114=\"\",\"\",Pecuária!A114)","v":""},{"$f":"IFERROR(IF(Pecuária!$E$112=1,((Pecuária!C114*365)*Pecuária!D114)*('Evolução rebanho'!$H$14+'Evolução rebanho'!$H$98),0),\"\")","v":0},{"$f":"IFERROR(IF(Pecuária!$E$112<=2,((Pecuária!C114*365)*Pecuária!D114)*('Evolução rebanho'!$P$14+'Evolução rebanho'!$P$98),0),\"\")","v":0},{"$f":"IFERROR(IF(Pecuária!$E$112<=3,((Pecuária!C114*365)*Pecuária!D114)*('Evolução rebanho'!$H$28+'Evolução rebanho'!$H$112),0),\"\")","v":0},{"$f":"IFERROR(IF(Pecuária!$E$112<=4,((Pecuária!C114*365)*Pecuária!D114)*('Evolução rebanho'!$P$28+'Evolução rebanho'!$P$112),0),\"\")","v":0},{"$f":"IFERROR(IF(Pecuária!$E$112<=5,((Pecuária!C114*365)*Pecuária!D114)*('Evolução rebanho'!$H$42+'Evolução rebanho'!$H$126),0),\"\")","v":0},{"$f":"IFERROR(IF(Pecuária!$E$112<=6,((Pecuária!C114*365)*Pecuária!D114)*('Evolução rebanho'!$P$42+'Evolução rebanho'!$P$126),0),\"\")","v":0},{"$f":"IFERROR(IF(Pecuária!$E$112<=7,((Pecuária!C114*365)*Pecuária!D114)*('Evolução rebanho'!$H$56+'Evolução rebanho'!$H$140),0),\"\")","v":0},{"$f":"IFERROR(IF(Pecuária!$E$112<=8,((Pecuária!C114*365)*Pecuária!D114)*('Evolução rebanho'!$P$56+'Evolução rebanho'!$P$140),0),\"\")","v":0},{"$f":"IFERROR(IF(Pecuária!$E$112<=9,((Pecuária!C114*365)*Pecuária!D114)*('Evolução rebanho'!$H$70+'Evolução rebanho'!$H$154),0),\"\")","v":0},{"$f":"IFERROR(IF(Pecuária!$E$112<=10,((Pecuária!C114*365)*Pecuária!D114)*('Evolução rebanho'!$P$70+'Evolução rebanho'!$P$154),0),\"\")","v":0},{"$f":"IFERROR(IF(Pecuária!$E$112<=11,((Pecuária!C114*365)*Pecuária!D114)*('Evolução rebanho'!$H$83+'Evolução rebanho'!$H$168),0),\"\")","v":0},{"$f":"IFERROR(IF(Pecuária!$E$112<=12,((Pecuária!C114*365)*Pecuária!D114)*('Evolução rebanho'!$P$83+'Evolução rebanho'!$P$168),0),\"\")","v":0}]
[{"$f":"IF(Pecuária!A119=\"\",\"\",Pecuária!A119)","v":"Brucelose"},{"$f":"IFERROR(IF(Pecuária!$E$119=1,(Pecuária!C119*Pecuária!D119)*('Evolução rebanho'!$H$14+'Evolução rebanho'!$H$98),0),\"\")","v":0},{"$f":"IFERROR(IF(Pecuária!$E$119<=2,(Pecuária!C119*Pecuária!D119)*('Evolução rebanho'!$P$14+'Evolução rebanho'!$P$98),0),\"\")","v":0},{"$f":"IFERROR(IF(Pecuária!$E$119<=3,(Pecuária!C119*Pecuária!D119)*('Evolução rebanho'!$H$28+'Evolução rebanho'!$H$112),0),\"\")","v":0},{"$f":"IFERROR(IF(Pecuária!$E$119<=4,(Pecuária!C119*Pecuária!D119)*('Evolução rebanho'!$P$28+'Evolução rebanho'!$P$112),0),\"\")","v":0},{"$f":"IFERROR(IF(Pecuária!$E$119<=5,(Pecuária!C119*Pecuária!D119)*('Evolução rebanho'!$H$42+'Evolução rebanho'!$H$126),0),\"\")","v":0},{"$f":"IFERROR(IF(Pecuária!$E$119<=6,(Pecuária!C119*Pecuária!D119)*('Evolução rebanho'!$P$42+'Evolução rebanho'!$P$126),0),\"\")","v":0},{"$f":"IFERROR(IF(Pecuária!$E$119<=7,(Pecuária!C119*Pecuária!D119)*('Evolução rebanho'!$H$56+'Evolução rebanho'!$H$140),0),\"\")","v":0},{"$f":"IFERROR(IF(Pecuária!$E$119<=8,(Pecuária!C119*Pecuária!D119)*('Evolução rebanho'!$P$56+'Evolução rebanho'!$P$140),0),\"\")","v":0},{"$f":"IFERROR(IF(Pecuária!$E$119<=9,(Pecuária!C119*Pecuária!D119)*('Evolução rebanho'!$H$70+'Evolução rebanho'!$H$154),0),\"\")","v":0},{"$f":"IFERROR(IF(Pecuária!$E$119<=10,(Pecuária!C119*Pecuária!D119)*('Evolução rebanho'!$P$70+'Evolução rebanho'!$P$154),0),\"\")","v":0},{"$f":"IFERROR(IF(Pecuária!$E$119<=11,(Pecuária!C119*Pecuária!D119)*('Evolução rebanho'!$H$83+'Evolução rebanho'!$H$168),0),\"\")","v":0},{"$f":"IFERROR(IF(Pecuária!$E$119<=12,(Pecuária!C119*Pecuária!D119)*('Evolução rebanho'!$P$83+'Evolução rebanho'!$P$168),0),\"\")","v":0}]
[{"$f":"IF(Pecuária!A120=\"\",\"\",Pecuária!A120)","v":"Aftosa"},{"$f":"IFERROR(IF(Pecuária!$E$119=1,(Pecuária!C120*Pecuária!D120)*('Evolução rebanho'!$H$14+'Evolução rebanho'!$H$98),0),\"\")","v":0},{"$f":"IFERROR(IF(Pecuária!$E$119<=2,(Pecuária!C120*Pecuária!D120)*('Evolução rebanho'!$P$14+'Evolução rebanho'!$P$98),0),\"\")","v":0},{"$f":"IFERROR(IF(Pecuária!$E$119<=3,(Pecuária!C120*Pecuária!D120)*('Evolução rebanho'!$H$28+'Evolução rebanho'!$H$112),0),\"\")","v":0},{"$f":"IFERROR(IF(Pecuária!$E$119<=4,(Pecuária!C120*Pecuária!D120)*('Evolução rebanho'!$P$28+'Evolução rebanho'!$P$112),0),\"\")","v":0},{"$f":"IFERROR(IF(Pecuária!$E$119<=5,(Pecuária!C120*Pecuária!D120)*('Evolução rebanho'!$H$42+'Evolução rebanho'!$H$126),0),\"\")","v":0},{"$f":"IFERROR(IF(Pecuária!$E$119<=6,(Pecuária!C120*Pecuária!D120)*('Evolução rebanho'!$P$42+'Evolução rebanho'!$P$126),0),\"\")","v":0},{"$f":"IFERROR(IF(Pecuária!$E$119<=7,(Pecuária!C120*Pecuária!D120)*('Evolução rebanho'!$H$56+'Evolução rebanho'!$H$140),0),\"\")","v":0},{"$f":"IFERROR(IF(Pecuária!$E$119<=8,(Pecuária!C120*Pecuária!D120)*('Evolução rebanho'!$P$56+'Evolução rebanho'!$P$140),0),\"\")","v":0},{"$f":"IFERROR(IF(Pecuária!$E$119<=9,(Pecuária!C120*Pecuária!D120)*('Evolução rebanho'!$H$70+'Evolução rebanho'!$H$154),0),\"\")","v":0},{"$f":"IFERROR(IF(Pecuária!$E$119<=10,(Pecuária!C120*Pecuária!D120)*('Evolução rebanho'!$P$70+'Evolução rebanho'!$P$154),0),\"\")","v":0},{"$f":"IFERROR(IF(Pecuária!$E$119<=11,(Pecuária!C120*Pecuária!D120)*('Evolução rebanho'!$H$83+'Evolução rebanho'!$H$168),0),\"\")","v":0},{"$f":"IFERROR(IF(Pecuária!$E$119<=12,(Pecuária!C120*Pecuária!D120)*('Evolução rebanho'!$P$83+'Evolução rebanho'!$P$168),0),\"\")","v":0}]
[{"$f":"IF(Pecuária!A121=\"\",\"\",Pecuária!A121)","v":"Carbúnculo/Manqueira"},{"$f":"IFERROR(IF(Pecuária!$E$119=1,(Pecuária!C121*Pecuária!D121)*('Evolução rebanho'!$H$14+'Evolução rebanho'!$H$98),0),\"\")","v":0},{"$f":"IFERROR(IF(Pecuária!$E$119<=2,(Pecuária!C121*Pecuária!D121)*('Evolução rebanho'!$P$14+'Evolução rebanho'!$P$98),0),\"\")","v":0},{"$f":"IFERROR(IF(Pecuária!$E$119<=3,(Pecuária!C121*Pecuária!D121)*('Evolução rebanho'!$H$28+'Evolução rebanho'!$H$112),0),\"\")","v":0},{"$f":"IFERROR(IF(Pecuária!$E$119<=4,(Pecuária!C121*Pecuária!D121)*('Evolução rebanho'!$P$28+'Evolução rebanho'!$P$112),0),\"\")","v":0},{"$f":"IFERROR(IF(Pecuária!$E$119<=5,(Pecuária!C121*Pecuária!D121)*('Evolução rebanho'!$H$42+'Evolução rebanho'!$H$126),0),\"\")","v":0},{"$f":"IFERROR(IF(Pecuária!$E$119<=6,(Pecuária!C121*Pecuária!D121)*('Evolução rebanho'!$P$42+'Evolução rebanho'!$P$126),0),\"\")","v":0},{"$f":"IFERROR(IF(Pecuária!$E$119<=7,(Pecuária!C121*Pecuária!D121)*('Evolução rebanho'!$H$56+'Evolução rebanho'!$H$140),0),\"\")","v":0},{"$f":"IFERROR(IF(Pecuária!$E$119<=8,(Pecuária!C121*Pecuária!D121)*('Evolução rebanho'!$P$56+'Evolução rebanho'!$P$140),0),\"\")","v":0},{"$f":"IFERROR(IF(Pecuária!$E$119<=9,(Pecuária!C121*Pecuária!D121)*('Evolução rebanho'!$H$70+'Evolução rebanho'!$H$154),0),\"\")","v":0},{"$f":"IFERROR(IF(Pecuária!$E$119<=10,(Pecuária!C121*Pecuária!D121)*('Evolução rebanho'!$P$70+'Evolução rebanho'!$P$154),0),\"\")","v":0},{"$f":"IFERROR(IF(Pecuária!$E$119<=11,(Pecuária!C121*Pecuária!D121)*('Evolução rebanho'!$H$83+'Evolução rebanho'!$H$168),0),\"\")","v":0},{"$f":"IFERROR(IF(Pecuária!$E$119<=12,(Pecuária!C121*Pecuária!D121)*('Evolução rebanho'!$P$83+'Evolução rebanho'!$P$168),0),\"\")","v":0}]
[{"$f":"IF(Pecuária!A122=\"\",\"\",Pecuária!A122)","v":"Botulismo"},{"$f":"IFERROR(IF(Pecuária!$E$119=1,(Pecuária!C122*Pecuária!D122)*('Evolução rebanho'!$H$14+'Evolução rebanho'!$H$98),0),\"\")","v":0},{"$f":"IFERROR(IF(Pecuária!$E$119<=2,(Pecuária!C122*Pecuária!D122)*('Evolução rebanho'!$P$14+'Evolução rebanho'!$P$98),0),\"\")","v":0},{"$f":"IFERROR(IF(Pecuária!$E$119<=3,(Pecuária!C122*Pecuária!D122)*('Evolução rebanho'!$H$28+'Evolução rebanho'!$H$112),0),\"\")","v":0},{"$f":"IFERROR(IF(Pecuária!$E$119<=4,(Pecuária!C122*Pecuária!D122)*('Evolução rebanho'!$P$28+'Evolução rebanho'!$P$112),0),\"\")","v":0},{"$f":"IFERROR(IF(Pecuária!$E$119<=5,(Pecuária!C122*Pecuária!D122)*('Evolução rebanho'!$H$42+'Evolução rebanho'!$H$126),0),\"\")","v":0},{"$f":"IFERROR(IF(Pecuária!$E$119<=6,(Pecuária!C122*Pecuária!D122)*('Evolução rebanho'!$P$42+'Evolução rebanho'!$P$126),0),\"\")","v":0},{"$f":"IFERROR(IF(Pecuária!$E$119<=7,(Pecuária!C122*Pecuária!D122)*('Evolução rebanho'!$H$56+'Evolução rebanho'!$H$140),0),\"\")","v":0},{"$f":"IFERROR(IF(Pecuária!$E$119<=8,(Pecuária!C122*Pecuária!D122)*('Evolução rebanho'!$P$56+'Evolução rebanho'!$P$140),0),\"\")","v":0},{"$f":"IFERROR(IF(Pecuária!$E$119<=9,(Pecuária!C122*Pecuária!D122)*('Evolução rebanho'!$H$70+'Evolução rebanho'!$H$154),0),\"\")","v":0},{"$f":"IFERROR(IF(Pecuária!$E$119<=10,(Pecuária!C122*Pecuária!D122)*('Evolução rebanho'!$P$70+'Evolução rebanho'!$P$154),0),\"\")","v":0},{"$f":"IFERROR(IF(Pecuária!$E$119<=11,(Pecuária!C122*Pecuária!D122)*('Evolução rebanho'!$H$83+'Evolução rebanho'!$H$168),0),\"\")","v":0},{"$f":"IFERROR(IF(Pecuária!$E$119<=12,(Pecuária!C122*Pecuária!D122)*('Evolução rebanho'!$P$83+'Evolução rebanho'!$P$168),0),\"\")","v":0}]
[{"$f":"IF(Pecuária!A127=\"\",\"\",Pecuária!A127)","v":""},{"$f":"IF(Pecuária!$E$127=1,Pecuária!C127*Pecuária!D127,\"\")","v":""},{"$f":"IF(Pecuária!$E$127<=2,Pecuária!C127*Pecuária!D127,\"\")","v":0},{"$f":"IF(Pecuária!$E$127<=3,Pecuária!C127*Pecuária!D127,\"\")","v":0},{"$f":"IF(Pecuária!$E$127<=4,Pecuária!$C127*Pecuária!$D127,\"\")","v":0},{"$f":"IF(Pecuária!$E$127<=5,Pecuária!$C127*Pecuária!$D127,\"\")","v":0},{"$f":"IF(Pecuária!$E$127<=6,Pecuária!$C127*Pecuária!$D127,\"\")","v":0},{"$f":"IF(Pecuária!$E$127<=7,Pecuária!$C127*Pecuária!$D127,\"\")","v":0},{"$f":"IF(Pecuária!$E$127<=8,Pecuária!$C127*Pecuária!$D127,\"\")","v":0},{"$f":"IF(Pecuária!$E$127<=9,Pecuária!$C127*Pecuária!$D127,\"\")","v":0},{"$f":"IF(Pecuária!$E$127<=10,Pecuária!$C127*Pecuária!$D127,\"\")","v":0},{"$f":"IF(Pecuária!$E$127<=11,Pecuária!$C127*Pecuária!$D127,\"\")","v":0},{"$f":"IF(Pecuária!$E$127<=12,Pecuária!$C127*Pecuária!$D127,\"\")","v":0}]
[{"$f":"IF(Pecuária!A128=\"\",\"\",Pecuária!A128)","v":""},{"$f":"IF(Pecuária!$E$127=1,Pecuária!C128*Pecuária!D128,\"\")","v":""},{"$f":"IF(Pecuária!$E$127<=2,Pecuária!C128*Pecuária!D128,\"\")","v":0},{"$f":"IF(Pecuária!$E$127<=3,Pecuária!C128*Pecuária!D128,\"\")","v":0},{"$f":"IF(Pecuária!$E$127<=4,Pecuária!$C128*Pecuária!$D128,\"\")","v":0},{"$f":"IF(Pecuária!$E$127<=5,Pecuária!$C128*Pecuária!$D128,\"\")","v":0},{"$f":"IF(Pecuária!$E$127<=6,Pecuária!$C128*Pecuária!$D128,\"\")","v":0},{"$f":"IF(Pecuária!$E$127<=7,Pecuária!$C128*Pecuária!$D128,\"\")","v":0},{"$f":"IF(Pecuária!$E$127<=8,Pecuária!$C128*Pecuária!$D128,\"\")","v":0},{"$f":"IF(Pecuária!$E$127<=9,Pecuária!$C128*Pecuária!$D128,\"\")","v":0},{"$f":"IF(Pecuária!$E$127<=10,Pecuária!$C128*Pecuária!$D128,\"\")","v":0},{"$f":"IF(Pecuária!$E$127<=11,Pecuária!$C128*Pecuária!$D128,\"\")","v":0},{"$f":"IF(Pecuária!$E$127<=12,Pecuária!$C128*Pecuária!$D128,\"\")","v":0}]
[{"$f":"IF(Pecuária!A129=\"\",\"\",Pecuária!A129)","v":""},{"$f":"IF(Pecuária!$E$127=1,Pecuária!C129*Pecuária!D129,\"\")","v":""},{"$f":"IF(Pecuária!$E$127<=2,Pecuária!C129*Pecuária!D129,\"\")","v":0},{"$f":"IF(Pecuária!$E$127<=3,Pecuária!C129*Pecuária!D129,\"\")","v":0},{"$f":"IF(Pecuária!$E$127<=4,Pecuária!$C129*Pecuária!$D129,\"\")","v":0},{"$f":"IF(Pecuária!$E$127<=5,Pecuária!$C129*Pecuária!$D129,\"\")","v":0},{"$f":"IF(Pecuária!$E$127<=6,Pecuária!$C129*Pecuária!$D129,\"\")","v":0},{"$f":"IF(Pecuária!$E$127<=7,Pecuária!$C129*Pecuária!$D129,\"\")","v":0},{"$f":"IF(Pecuária!$E$127<=8,Pecuária!$C129*Pecuária!$D129,\"\")","v":0},{"$f":"IF(Pecuária!$E$127<=9,Pecuária!$C129*Pecuária!$D129,\"\")","v":0},{"$f":"IF(Pecuária!$E$127<=10,Pecuária!$C129*Pecuária!$D129,\"\")","v":0},{"$f":"IF(Pecuária!$E$127<=11,Pecuária!$C129*Pecuária!$D129,\"\")","v":0},{"$f":"IF(Pecuária!$E$127<=12,Pecuária!$C129*Pecuária!$D129,\"\")","v":0}]
[{"$f":"IF(Pecuária!A130=\"\",\"\",Pecuária!A130)","v":""},{"$f":"IF(Pecuária!$E$127=1,Pecuária!C130*Pecuária!D130,\"\")","v":""},{"$f":"IF(Pecuária!$E$127<=2,Pecuária!C130*Pecuária!D130,\"\")","v":0},{"$f":"IF(Pecuária!$E$127<=3,Pecuária!C130*Pecuária!D130,\"\")","v":0},{"$f":"IF(Pecuária!$E$127<=4,Pecuária!$C130*Pecuária!$D130,\"\")","v":0},{"$f":"IF(Pecuária!$E$127<=5,Pecuária!$C130*Pecuária!$D130,\"\")","v":0},{"$f":"IF(Pecuária!$E$127<=6,Pecuária!$C130*Pecuária!$D130,\"\")","v":0},{"$f":"IF(Pecuária!$E$127<=7,Pecuária!$C130*Pecuária!$D130,\"\")","v":0},{"$f":"IF(Pecuária!$E$127<=8,Pecuária!$C130*Pecuária!$D130,\"\")","v":0},{"$f":"IF(Pecuária!$E$127<=9,Pecuária!$C130*Pecuária!$D130,\"\")","v":0},{"$f":"IF(Pecuária!$E$127<=10,Pecuária!$C130*Pecuária!$D130,\"\")","v":0},{"$f":"IF(Pecuária!$E$127<=11,Pecuária!$C130*Pecuária!$D130,\"\")","v":0},{"$f":"IF(Pecuária!$E$127<=12,Pecuária!$C130*Pecuária!$D130,\"\")","v":0}]
[{"$f":"IF(Pecuária!A131=\"\",\"\",Pecuária!A131)","v":""},{"$f":"IF(Pecuária!$E$127=1,Pecuária!C131*Pecuária!D131,\"\")","v":""},{"$f":"IF(Pecuária!$E$127<=2,Pecuária!C131*Pecuária!D131,\"\")","v":0},{"$f":"IF(Pecuária!$E$127<=3,Pecuária!C131*Pecuária!D131,\"\")","v":0},{"$f":"IF(Pecuária!$E$127<=4,Pecuária!$C131*Pecuária!$D131,\"\")","v":0},{"$f":"IF(Pecuária!$E$127<=5,Pecuária!$C131*Pecuária!$D131,\"\")","v":0},{"$f":"IF(Pecuária!$E$127<=6,Pecuária!$C131*Pecuária!$D131,\"\")","v":0},{"$f":"IF(Pecuária!$E$127<=7,Pecuária!$C131*Pecuária!$D131,\"\")","v":0},{"$f":"IF(Pecuária!$E$127<=8,Pecuária!$C131*Pecuária!$D131,\"\")","v":0},{"$f":"IF(Pecuária!$E$127<=9,Pecuária!$C131*Pecuária!$D131,\"\")","v":0},{"$f":"IF(Pecuária!$E$127<=10,Pecuária!$C131*Pecuária!$D131,\"\")","v":0},{"$f":"IF(Pecuária!$E$127<=11,Pecuária!$C131*Pecuária!$D131,\"\")","v":0},{"$f":"IF(Pecuária!$E$127<=12,Pecuária!$C131*Pecuária!$D131,\"\")","v":0}]
[{"$f":"IF(Pecuária!A132=\"\",\"\",Pecuária!A132)","v":""},{"$f":"IF(Pecuária!$E$127=1,Pecuária!C132*Pecuária!D132,\"\")","v":""},{"$f":"IF(Pecuária!$E$127<=2,Pecuária!C132*Pecuária!D132,\"\")","v":0},{"$f":"IF(Pecuária!$E$127<=3,Pecuária!C132*Pecuária!D132,\"\")","v":0},{"$f":"IF(Pecuária!$E$127<=4,Pecuária!$C132*Pecuária!$D132,\"\")","v":0},{"$f":"IF(Pecuária!$E$127<=5,Pecuária!$C132*Pecuária!$D132,\"\")","v":0},{"$f":"IF(Pecuária!$E$127<=6,Pecuária!$C132*Pecuária!$D132,\"\")","v":0},{"$f":"IF(Pecuária!$E$127<=7,Pecuária!$C132*Pecuária!$D132,\"\")","v":0},{"$f":"IF(Pecuária!$E$127<=8,Pecuária!$C132*Pecuária!$D132,\"\")","v":0},{"$f":"IF(Pecuária!$E$127<=9,Pecuária!$C132*Pecuária!$D132,\"\")","v":0},{"$f":"IF(Pecuária!$E$127<=10,Pecuária!$C132*Pecuária!$D132,\"\")","v":0},{"$f":"IF(Pecuária!$E$127<=11,Pecuária!$C132*Pecuária!$D132,\"\")","v":0},{"$f":"IF(Pecuária!$E$127<=12,Pecuária!$C132*Pecuária!$D132,\"\")","v":0}]
[{"$f":"IF(Pecuária!A134=\"\",\"\",Pecuária!A134)","v":""},{"$f":"IF(Pecuária!$E$134=1,Pecuária!C134*Pecuária!D134,\"\")","v":""},{"$f":"IF(Pecuária!$E$134<=2,Pecuária!C134*Pecuária!D134,\"\")","v":0},{"$f":"IF(Pecuária!$E$134<=3,Pecuária!C134*Pecuária!D134,\"\")","v":0},{"$f":"IF(Pecuária!$E$134<=4,Pecuária!$C134*Pecuária!$D134,\"\")","v":0},{"$f":"IF(Pecuária!$E$134<=5,Pecuária!$C134*Pecuária!$D134,\"\")","v":0},{"$f":"IF(Pecuária!$E$134<=6,Pecuária!$C134*Pecuária!$D134,\"\")","v":0},{"$f":"IF(Pecuária!$E$134<=7,Pecuária!$C134*Pecuária!$D134,\"\")","v":0},{"$f":"IF(Pecuária!$E$134<=8,Pecuária!$C134*Pecuária!$D134,\"\")","v":0},{"$f":"IF(Pecuária!$E$134<=9,Pecuária!$C134*Pecuária!$D134,\"\")","v":0},{"$f":"IF(Pecuária!$E$134<=10,Pecuária!$C134*Pecuária!$D134,\"\")","v":0},{"$f":"IF(Pecuária!$E$134<=11,Pecuária!$C134*Pecuária!$D134,\"\")","v":0},{"$f":"IF(Pecuária!$E$134<=12,Pecuária!$C134*Pecuária!$D134,\"\")","v":0}]
[{"$f":"IF(Pecuária!A135=\"\",\"\",Pecuária!A135)","v":""},{"$f":"IF(Pecuária!$E$134=1,Pecuária!C135*Pecuária!D135,\"\")","v":""},{"$f":"IF(Pecuária!$E$134<=2,Pecuária!C135*Pecuária!D135,\"\")","v":0},{"$f":"IF(Pecuária!$E$134<=3,Pecuária!C135*Pecuária!D135,\"\")","v":0},{"$f":"IF(Pecuária!$E$134<=4,Pecuária!$C135*Pecuária!$D135,\"\")","v":0},{"$f":"IF(Pecuária!$E$134<=5,Pecuária!$C135*Pecuária!$D135,\"\")","v":0},{"$f":"IF(Pecuária!$E$134<=6,Pecuária!$C135*Pecuária!$D135,\"\")","v":0},{"$f":"IF(Pecuária!$E$134<=7,Pecuária!$C135*Pecuária!$D135,\"\")","v":0},{"$f":"IF(Pecuária!$E$134<=8,Pecuária!$C135*Pecuária!$D135,\"\")","v":0},{"$f":"IF(Pecuária!$E$134<=9,Pecuária!$C135*Pecuária!$D135,\"\")","v":0},{"$f":"IF(Pecuária!$E$134<=10,Pecuária!$C135*Pecuária!$D135,\"\")","v":0},{"$f":"IF(Pecuária!$E$134<=11,Pecuária!$C135*Pecuária!$D135,\"\")","v":0},{"$f":"IF(Pecuária!$E$134<=12,Pecuária!$C135*Pecuária!$D135,\"\")","v":0}]
[{"$f":"IF(Pecuária!A136=\"\",\"\",Pecuária!A136)","v":""},{"$f":"IF(Pecuária!$E$134=1,Pecuária!C136*Pecuária!D136,\"\")","v":""},{"$f":"IF(Pecuária!$E$134<=2,Pecuária!C136*Pecuária!D136,\"\")","v":0},{"$f":"IF(Pecuária!$E$134<=3,Pecuária!C136*Pecuária!D136,\"\")","v":0},{"$f":"IF(Pecuária!$E$134<=4,Pecuária!$C136*Pecuária!$D136,\"\")","v":0},{"$f":"IF(Pecuária!$E$134<=5,Pecuária!$C136*Pecuária!$D136,\"\")","v":0},{"$f":"IF(Pecuária!$E$134<=6,Pecuária!$C136*Pecuária!$D136,\"\")","v":0},{"$f":"IF(Pecuária!$E$134<=7,Pecuária!$C136*Pecuária!$D136,\"\")","v":0},{"$f":"IF(Pecuária!$E$134<=8,Pecuária!$C136*Pecuária!$D136,\"\")","v":0},{"$f":"IF(Pecuária!$E$134<=9,Pecuária!$C136*Pecuária!$D136,\"\")","v":0},{"$f":"IF(Pecuária!$E$134<=10,Pecuária!$C136*Pecuária!$D136,\"\")","v":0},{"$f":"IF(Pecuária!$E$134<=11,Pecuária!$C136*Pecuária!$D136,\"\")","v":0},{"$f":"IF(Pecuária!$E$134<=12,Pecuária!$C136*Pecuária!$D136,\"\")","v":0}]
[{"$f":"IF(Pecuária!A137=\"\",\"\",Pecuária!A137)","v":""},{"$f":"IF(Pecuária!$E$134=1,Pecuária!C137*Pecuária!D137,\"\")","v":""},{"$f":"IF(Pecuária!$E$134<=2,Pecuária!C137*Pecuária!D137,\"\")","v":0},{"$f":"IF(Pecuária!$E$134<=3,Pecuária!C137*Pecuária!D137,\"\")","v":0},{"$f":"IF(Pecuária!$E$134<=4,Pecuária!$C137*Pecuária!$D137,\"\")","v":0},{"$f":"IF(Pecuária!$E$134<=5,Pecuária!$C137*Pecuária!$D137,\"\")","v":0},{"$f":"IF(Pecuária!$E$134<=6,Pecuária!$C137*Pecuária!$D137,\"\")","v":0},{"$f":"IF(Pecuária!$E$134<=7,Pecuária!$C137*Pecuária!$D137,\"\")","v":0},{"$f":"IF(Pecuária!$E$134<=8,Pecuária!$C137*Pecuária!$D137,\"\")","v":0},{"$f":"IF(Pecuária!$E$134<=9,Pecuária!$C137*Pecuária!$D137,\"\")","v":0},{"$f":"IF(Pecuária!$E$134<=10,Pecuária!$C137*Pecuária!$D137,\"\")","v":0},{"$f":"IF(Pecuária!$E$134<=11,Pecuária!$C137*Pecuária!$D137,\"\")","v":0},{"$f":"IF(Pecuária!$E$134<=12,Pecuária!$C137*Pecuária!$D137,\"\")","v":0}]
[{"$f":"IF(Pecuária!A138=\"\",\"\",Pecuária!A138)","v":""},{"$f":"IF(Pecuária!$E$134=1,Pecuária!C138*Pecuária!D138,\"\")","v":""},{"$f":"IF(Pecuária!$E$134<=2,Pecuária!C138*Pecuária!D138,\"\")","v":0},{"$f":"IF(Pecuária!$E$134<=3,Pecuária!C138*Pecuária!D138,\"\")","v":0},{"$f":"IF(Pecuária!$E$134<=4,Pecuária!$C138*Pecuária!$D138,\"\")","v":0},{"$f":"IF(Pecuária!$E$134<=5,Pecuária!$C138*Pecuária!$D138,\"\")","v":0},{"$f":"IF(Pecuária!$E$134<=6,Pecuária!$C138*Pecuária!$D138,\"\")","v":0},{"$f":"IF(Pecuária!$E$134<=7,Pecuária!$C138*Pecuária!$D138,\"\")","v":0},{"$f":"IF(Pecuária!$E$134<=8,Pecuária!$C138*Pecuária!$D138,\"\")","v":0},{"$f":"IF(Pecuária!$E$134<=9,Pecuária!$C138*Pecuária!$D138,\"\")","v":0},{"$f":"IF(Pecuária!$E$134<=10,Pecuária!$C138*Pecuária!$D138,\"\")","v":0},{"$f":"IF(Pecuária!$E$134<=11,Pecuária!$C138*Pecuária!$D138,\"\")","v":0},{"$f":"IF(Pecuária!$E$134<=12,Pecuária!$C138*Pecuária!$D138,\"\")","v":0}]
[{"$f":"IF(Pecuária!A139=\"\",\"\",Pecuária!A139)","v":""},{"$f":"IF(Pecuária!$E$134=1,Pecuária!C139*Pecuária!D139,\"\")","v":""},{"$f":"IF(Pecuária!$E$134<=2,Pecuária!C139*Pecuária!D139,\"\")","v":0},{"$f":"IF(Pecuária!$E$134<=3,Pecuária!C139*Pecuária!D139,\"\")","v":0},{"$f":"IF(Pecuária!$E$134<=4,Pecuária!$C139*Pecuária!$D139,\"\")","v":0},{"$f":"IF(Pecuária!$E$134<=5,Pecuária!$C139*Pecuária!$D139,\"\")","v":0},{"$f":"IF(Pecuária!$E$134<=6,Pecuária!$C139*Pecuária!$D139,\"\")","v":0},{"$f":"IF(Pecuária!$E$134<=7,Pecuária!$C139*Pecuária!$D139,\"\")","v":0},{"$f":"IF(Pecuária!$E$134<=8,Pecuária!$C139*Pecuária!$D139,\"\")","v":0},{"$f":"IF(Pecuária!$E$134<=9,Pecuária!$C139*Pecuária!$D139,\"\")","v":0},{"$f":"IF(Pecuária!$E$134<=10,Pecuária!$C139*Pecuária!$D139,\"\")","v":0},{"$f":"IF(Pecuária!$E$134<=11,Pecuária!$C139*Pecuária!$D139,\"\")","v":0},{"$f":"IF(Pecuária!$E$134<=12,Pecuária!$C139*Pecuária!$D139,\"\")","v":0}]
[{"$f":"IF(Pecuária!A141=\"\",\"\",Pecuária!A141)","v":""},{"$f":"IF(Pecuária!$E$141=1,Pecuária!C141*Pecuária!D141,\"\")","v":""},{"$f":"IF(Pecuária!$E$141<=2,Pecuária!C141*Pecuária!D141,\"\")","v":0},{"$f":"IF(Pecuária!$E$141<=3,Pecuária!C141*Pecuária!D141,\"\")","v":0},{"$f":"IF(Pecuária!$E$141<=4,Pecuária!$C141*Pecuária!$D141,\"\")","v":0},{"$f":"IF(Pecuária!$E$141<=5,Pecuária!$C141*Pecuária!$D141,\"\")","v":0},{"$f":"IF(Pecuária!$E$141<=6,Pecuária!$C141*Pecuária!$D141,\"\")","v":0},{"$f":"IF(Pecuária!$E$141<=7,Pecuária!$C141*Pecuária!$D141,\"\")","v":0},{"$f":"IF(Pecuária!$E$141<=8,Pecuária!$C141*Pecuária!$D141,\"\")","v":0},{"$f":"IF(Pecuária!$E$141<=9,Pecuária!$C141*Pecuária!$D141,\"\")","v":0},{"$f":"IF(Pecuária!$E$141<=10,Pecuária!$C141*Pecuária!$D141,\"\")","v":0},{"$f":"IF(Pecuária!$E$141<=11,Pecuária!$C141*Pecuária!$D141,\"\")","v":0},{"$f":"IF(Pecuária!$E$141<=12,Pecuária!$C141*Pecuária!$D141,\"\")","v":0}]
[{"$f":"IF(Pecuária!A142=\"\",\"\",Pecuária!A142)","v":""},{"$f":"IF(Pecuária!$E$141=1,Pecuária!C142*Pecuária!D142,\"\")","v":""},{"$f":"IF(Pecuária!$E$141<=2,Pecuária!C142*Pecuária!D142,\"\")","v":0},{"$f":"IF(Pecuária!$E$141<=3,Pecuária!C142*Pecuária!D142,\"\")","v":0},{"$f":"IF(Pecuária!$E$141<=4,Pecuária!$C142*Pecuária!$D142,\"\")","v":0},{"$f":"IF(Pecuária!$E$141<=5,Pecuária!$C142*Pecuária!$D142,\"\")","v":0},{"$f":"IF(Pecuária!$E$141<=6,Pecuária!$C142*Pecuária!$D142,\"\")","v":0},{"$f":"IF(Pecuária!$E$141<=7,Pecuária!$C142*Pecuária!$D142,\"\")","v":0},{"$f":"IF(Pecuária!$E$141<=8,Pecuária!$C142*Pecuária!$D142,\"\")","v":0},{"$f":"IF(Pecuária!$E$141<=9,Pecuária!$C142*Pecuária!$D142,\"\")","v":0},{"$f":"IF(Pecuária!$E$141<=10,Pecuária!$C142*Pecuária!$D142,\"\")","v":0},{"$f":"IF(Pecuária!$E$141<=11,Pecuária!$C142*Pecuária!$D142,\"\")","v":0},{"$f":"IF(Pecuária!$E$141<=12,Pecuária!$C142*Pecuária!$D142,\"\")","v":0}]
[{"$f":"IF(Pecuária!A143=\"\",\"\",Pecuária!A143)","v":""},{"$f":"IF(Pecuária!$E$141=1,Pecuária!C143*Pecuária!D143,\"\")","v":""},{"$f":"IF(Pecuária!$E$141<=2,Pecuária!C143*Pecuária!D143,\"\")","v":0},{"$f":"IF(Pecuária!$E$141<=3,Pecuária!C143*Pecuária!D143,\"\")","v":0},{"$f":"IF(Pecuária!$E$141<=4,Pecuária!$C143*Pecuária!$D143,\"\")","v":0},{"$f":"IF(Pecuária!$E$141<=5,Pecuária!$C143*Pecuária!$D143,\"\")","v":0},{"$f":"IF(Pecuária!$E$141<=6,Pecuária!$C143*Pecuária!$D143,\"\")","v":0},{"$f":"IF(Pecuária!$E$141<=7,Pecuária!$C143*Pecuária!$D143,\"\")","v":0},{"$f":"IF(Pecuária!$E$141<=8,Pecuária!$C143*Pecuária!$D143,\"\")","v":0},{"$f":"IF(Pecuária!$E$141<=9,Pecuária!$C143*Pecuária!$D143,\"\")","v":0},{"$f":"IF(Pecuária!$E$141<=10,Pecuária!$C143*Pecuária!$D143,\"\")","v":0},{"$f":"IF(Pecuária!$E$141<=11,Pecuária!$C143*Pecuária!$D143,\"\")","v":0},{"$f":"IF(Pecuária!$E$141<=12,Pecuária!$C143*Pecuária!$D143,\"\")","v":0}]
[{"$f":"IF(Pecuária!A144=\"\",\"\",Pecuária!A144)","v":""},{"$f":"IF(Pecuária!$E$141=1,Pecuária!C144*Pecuária!D144,\"\")","v":""},{"$f":"IF(Pecuária!$E$141<=2,Pecuária!C144*Pecuária!D144,\"\")","v":0},{"$f":"IF(Pecuária!$E$141<=3,Pecuária!C144*Pecuária!D144,\"\")","v":0},{"$f":"IF(Pecuária!$E$141<=4,Pecuária!$C144*Pecuária!$D144,\"\")","v":0},{"$f":"IF(Pecuária!$E$141<=5,Pecuária!$C144*Pecuária!$D144,\"\")","v":0},{"$f":"IF(Pecuária!$E$141<=6,Pecuária!$C144*Pecuária!$D144,\"\")","v":0},{"$f":"IF(Pecuária!$E$141<=7,Pecuária!$C144*Pecuária!$D144,\"\")","v":0},{"$f":"IF(Pecuária!$E$141<=8,Pecuária!$C144*Pecuária!$D144,\"\")","v":0},{"$f":"IF(Pecuária!$E$141<=9,Pecuária!$C144*Pecuária!$D144,\"\")","v":0},{"$f":"IF(Pecuária!$E$141<=10,Pecuária!$C144*Pecuária!$D144,\"\")","v":0},{"$f":"IF(Pecuária!$E$141<=11,Pecuária!$C144*Pecuária!$D144,\"\")","v":0},{"$f":"IF(Pecuária!$E$141<=12,Pecuária!$C144*Pecuária!$D144,\"\")","v":0}]
["Total",{"$f":"SUM(B74:B96)","v":0},{"$f":"SUM(C74:C96)","v":0},0,0,0,0,0,0,0,0,0,{"$f":"SUM(M74:M96)","v":0}]
[]
["Categoria","Aquisição Programada de Animais (Rebanho de Corte  e Rebanho de Leite)"]
[null,"Ano 1","Ano 2","Ano 3","Ano 4","Ano 5","Ano 6","Ano 7","Ano 8","Ano 9","Ano 10","Ano 11","Ano 12"]
[null,"Valor Total","Valor Total","Valor Total","Valor Total","Valor Total","Valor Total","Valor Total","Valor Total","Valor Total","Valor Total","Valor Total","Valor Total"]
["Reprodutores",{"$f":"(Pecuária!$B$19*Pecuária!C19)+(Pecuária!$B$30*Pecuária!C30)","v":0},{"$f":"(Pecuária!$B$19*Pecuária!D19)+(Pecuária!$B$30*Pecuária!D30)","v":0},{"$f":"(Pecuária!$B$19*Pecuária!$E$19)+(Pecuária!$B$30*Pecuária!$E$30)","v":0},{"$f":"(Pecuária!$B$19*Pecuária!$E$19)+(Pecuária!$B$30*Pecuária!$E$30)","v":0},{"$f":"(Pecuária!$B$19*Pecuária!$E$19)+(Pecuária!$B$30*Pecuária!$E$30)","v":0},{"$f":"(Pecuária!$B$19*Pecuária!$E$19)+(Pecuária!$B$30*Pecuária!$E$30)","v":0},{"$f":"(Pecuária!$B$19*Pecuária!$E$19)+(Pecuária!$B$30*Pecuária!$E$30)","v":0},{"$f":"(Pecuária!$B$19*Pecuária!$E$19)+(Pecuária!$B$30*Pecuária!$E$30)","v":0},{"$f":"(Pecuária!$B$19*Pecuária!$E$19)+(Pecuária!$B$30*Pecuária!$E$30)","v":0},{"$f":"(Pecuária!$B$19*Pecuária!$E$19)+(Pecuária!$B$30*Pecuária!$E$30)","v":0},{"$f":"(Pecuária!$B$19*Pecuária!$E$19)+(Pecuária!$B$30*Pecuária!$E$30)","v":0},{"$f":"(Pecuária!$B$19*Pecuária!$E$19)+(Pecuária!$B$30*Pecuária!$E$30)","v":0}]
["Matrizes",{"$f":"(Pecuária!$B$20*Pecuária!C20)+(Pecuária!$B$31*Pecuária!C31)","v":0},{"$f":"(Pecuária!$B$20*Pecuária!D20)+(Pecuária!$B$31*Pecuária!D31)","v":0},{"$f":"(Pecuária!$B$20*Pecuária!$E$20)+(Pecuária!$B$31*Pecuária!$E$31)","v":0},{"$f":"(Pecuária!$B$20*Pecuária!$E$20)+(Pecuária!$B$31*Pecuária!$E$31)","v":0},{"$f":"(Pecuária!$B$20*Pecuária!$E$20)+(Pecuária!$B$31*Pecuária!$E$31)","v":0},{"$f":"(Pecuária!$B$20*Pecuária!$E$20)+(Pecuária!$B$31*Pecuária!$E$31)","v":0},{"$f":"(Pecuária!$B$20*Pecuária!$E$20)+(Pecuária!$B$31*Pecuária!$E$31)","v":0},{"$f":"(Pecuária!$B$20*Pecuária!$E$20)+(Pecuária!$B$31*Pecuária!$E$31)","v":0},{"$f":"(Pecuária!$B$20*Pecuária!$E$20)+(Pecuária!$B$31*Pecuária!$E$31)","v":0},{"$f":"(Pecuária!$B$20*Pecuária!$E$20)+(Pecuária!$B$31*Pecuária!$E$31)","v":0},{"$f":"(Pecuária!$B$20*Pecuária!$E$20)+(Pecuária!$B$31*Pecuária!$E$31)","v":0},{"$f":"(Pecuária!$B$20*Pecuária!$E$20)+(Pecuária!$B$31*Pecuária!$E$31)","v":0}]
["Bois",{"$f":"(Pecuária!$B$21*Pecuária!C21)+(Pecuária!$B$32*Pecuária!C32)","v":0},{"$f":"(Pecuária!$B$21*Pecuária!D21)+(Pecuária!$B$32*Pecuária!D32)","v":0},{"$f":"(Pecuária!$B$21*Pecuária!$E$21)+(Pecuária!$B$32*Pecuária!$E$32)","v":0},{"$f":"(Pecuária!$B$21*Pecuária!$E$21)+(Pecuária!$B$32*Pecuária!$E$32)","v":0},{"$f":"(Pecuária!$B$21*Pecuária!$E$21)+(Pecuária!$B$32*Pecuária!$E$32)","v":0},{"$f":"(Pecuária!$B$21*Pecuária!$E$21)+(Pecuária!$B$32*Pecuária!$E$32)","v":0},{"$f":"(Pecuária!$B$21*Pecuária!$E$21)+(Pecuária!$B$32*Pecuária!$E$32)","v":0},{"$f":"(Pecuária!$B$21*Pecuária!$E$21)+(Pecuária!$B$32*Pecuária!$E$32)","v":0},{"$f":"(Pecuária!$B$21*Pecuária!$E$21)+(Pecuária!$B$32*Pecuária!$E$32)","v":0},{"$f":"(Pecuária!$B$21*Pecuária!$E$21)+(Pecuária!$B$32*Pecuária!$E$32)","v":0},{"$f":"(Pecuária!$B$21*Pecuária!$E$21)+(Pecuária!$B$32*Pecuária!$E$32)","v":0},{"$f":"(Pecuária!$B$21*Pecuária!$E$21)+(Pecuária!$B$32*Pecuária!$E$32)","v":0}]
["Novilhos",{"$f":"(Pecuária!$B$22*Pecuária!C22)+(Pecuária!$B$33*Pecuária!C33)","v":0},{"$f":"(Pecuária!$B$22*Pecuária!D22)+(Pecuária!$B$33*Pecuária!D33)","v":0},{"$f":"(Pecuária!$B$22*Pecuária!$E$22)+(Pecuária!$B$33*Pecuária!$E$33)","v":0},{"$f":"(Pecuária!$B$22*Pecuária!$E$22)+(Pecuária!$B$33*Pecuária!$E$33)","v":0},{"$f":"(Pecuária!$B$22*Pecuária!$E$22)+(Pecuária!$B$33*Pecuária!$E$33)","v":0},{"$f":"(Pecuária!$B$22*Pecuária!$E$22)+(Pecuária!$B$33*Pecuária!$E$33)","v":0},{"$f":"(Pecuária!$B$22*Pecuária!$E$22)+(Pecuária!$B$33*Pecuária!$E$33)","v":0},{"$f":"(Pecuária!$B$22*Pecuária!$E$22)+(Pecuária!$B$33*Pecuária!$E$33)","v":0},{"$f":"(Pecuária!$B$22*Pecuária!$E$22)+(Pecuária!$B$33*Pecuária!$E$33)","v":0},{"$f":"(Pecuária!$B$22*Pecuária!$E$22)+(Pecuária!$B$33*Pecuária!$E$33)","v":0},{"$f":"(Pecuária!$B$22*Pecuária!$E$22)+(Pecuária!$B$33*Pecuária!$E$33)","v":0},{"$f":"(Pecuária!$B$22*Pecuária!$E$22)+(Pecuária!$B$33*Pecuária!$E$33)","v":0}]
["Novilhas",{"$f":"(Pecuária!$B$23*Pecuária!C23)+(Pecuária!$B$34*Pecuária!C34)","v":0},{"$f":"(Pecuária!$B$23*Pecuária!D23)+(Pecuária!$B$34*Pecuária!D34)","v":0},{"$f":"(Pecuária!$B$23*Pecuária!$E$23)+(Pecuária!$B$34*Pecuária!$E$34)","v":0},{"$f":"(Pecuária!$B$23*Pecuária!$E$23)+(Pecuária!$B$34*Pecuária!$E$34)","v":0},{"$f":"(Pecuária!$B$23*Pecuária!$E$23)+(Pecuária!$B$34*Pecuária!$E$34)","v":0},{"$f":"(Pecuária!$B$23*Pecuária!$E$23)+(Pecuária!$B$34*Pecuária!$E$34)","v":0},{"$f":"(Pecuária!$B$23*Pecuária!$E$23)+(Pecuária!$B$34*Pecuária!$E$34)","v":0},{"$f":"(Pecuária!$B$23*Pecuária!$E$23)+(Pecuária!$B$34*Pecuária!$E$34)","v":0},{"$f":"(Pecuária!$B$23*Pecuária!$E$23)+(Pecuária!$B$34*Pecuária!$E$34)","v":0},{"$f":"(Pecuária!$B$23*Pecuária!$E$23)+(Pecuária!$B$34*Pecuária!$E$34)","v":0},{"$f":"(Pecuária!$B$23*Pecuária!$E$23)+(Pecuária!$B$34*Pecuária!$E$34)","v":0},{"$f":"(Pecuária!$B$23*Pecuária!$E$23)+(Pecuária!$B$34*Pecuária!$E$34)","v":0}]
["Garrotes ",{"$f":"(Pecuária!$B$24*Pecuária!C24)+(Pecuária!$B$35*Pecuária!C35)","v":0},{"$f":"(Pecuária!$B$24*Pecuária!D24)+(Pecuária!$B$35*Pecuária!D35)","v":0},{"$f":"(Pecuária!$B$24*Pecuária!$E$24)+(Pecuária!$B$35*Pecuária!$E$35)","v":0},{"$f":"(Pecuária!$B$24*Pecuária!$E$24)+(Pecuária!$B$35*Pecuária!$E$35)","v":0},{"$f":"(Pecuária!$B$24*Pecuária!$E$24)+(Pecuária!$B$35*Pecuária!$E$35)","v":0},{"$f":"(Pecuária!$B$24*Pecuária!$E$24)+(Pecuária!$B$35*Pecuária!$E$35)","v":0},{"$f":"(Pecuária!$B$24*Pecuária!$E$24)+(Pecuária!$B$35*Pecuária!$E$35)","v":0},{"$f":"(Pecuária!$B$24*Pecuária!$E$24)+(Pecuária!$B$35*Pecuária!$E$35)","v":0},{"$f":"(Pecuária!$B$24*Pecuária!$E$24)+(Pecuária!$B$35*Pecuária!$E$35)","v":0},{"$f":"(Pecuária!$B$24*Pecuária!$E$24)+(Pecuária!$B$35*Pecuária!$E$35)","v":0},{"$f":"(Pecuária!$B$24*Pecuária!$E$24)+(Pecuária!$B$35*Pecuária!$E$35)","v":0},{"$f":"(Pecuária!$B$24*Pecuária!$E$24)+(Pecuária!$B$35*Pecuária!$E$35)","v":0}]
["Garrotas ",{"$f":"(Pecuária!$B$25*Pecuária!C25)+(Pecuária!$B$36*Pecuária!C36)","v":0},{"$f":"(Pecuária!$B$25*Pecuária!D25)+(Pecuária!$B$36*Pecuária!D36)","v":0},{"$f":"(Pecuária!$B$25*Pecuária!$E$25)+(Pecuária!$B$36*Pecuária!$E$36)","v":0},{"$f":"(Pecuária!$B$25*Pecuária!$E$25)+(Pecuária!$B$36*Pecuária!$E$36)","v":0},{"$f":"(Pecuária!$B$25*Pecuária!$E$25)+(Pecuária!$B$36*Pecuária!$E$36)","v":0},{"$f":"(Pecuária!$B$25*Pecuária!$E$25)+(Pecuária!$B$36*Pecuária!$E$36)","v":0},{"$f":"(Pecuária!$B$25*Pecuária!$E$25)+(Pecuária!$B$36*Pecuária!$E$36)","v":0},{"$f":"(Pecuária!$B$25*Pecuária!$E$25)+(Pecuária!$B$36*Pecuária!$E$36)","v":0},{"$f":"(Pecuária!$B$25*Pecuária!$E$25)+(Pecuária!$B$36*Pecuária!$E$36)","v":0},{"$f":"(Pecuária!$B$25*Pecuária!$E$25)+(Pecuária!$B$36*Pecuária!$E$36)","v":0},{"$f":"(Pecuária!$B$25*Pecuária!$E$25)+(Pecuária!$B$36*Pecuária!$E$36)","v":0},{"$f":"(Pecuária!$B$25*Pecuária!$E$25)+(Pecuária!$B$36*Pecuária!$E$36)","v":0}]
["Bezerros ",{"$f":"(Pecuária!$B$26*Pecuária!C26)+(Pecuária!$B$37*Pecuária!C37)","v":0},{"$f":"(Pecuária!$B$26*Pecuária!D26)+(Pecuária!$B$37*Pecuária!D37)","v":0},{"$f":"(Pecuária!$B$26*Pecuária!$E$26)+(Pecuária!$B$37*Pecuária!$E$37)","v":0},{"$f":"(Pecuária!$B$26*Pecuária!$E$26)+(Pecuária!$B$37*Pecuária!$E$37)","v":0},{"$f":"(Pecuária!$B$26*Pecuária!$E$26)+(Pecuária!$B$37*Pecuária!$E$37)","v":0},{"$f":"(Pecuária!$B$26*Pecuária!$E$26)+(Pecuária!$B$37*Pecuária!$E$37)","v":0},{"$f":"(Pecuária!$B$26*Pecuária!$E$26)+(Pecuária!$B$37*Pecuária!$E$37)","v":0},{"$f":"(Pecuária!$B$26*Pecuária!$E$26)+(Pecuária!$B$37*Pecuária!$E$37)","v":0},{"$f":"(Pecuária!$B$26*Pecuária!$E$26)+(Pecuária!$B$37*Pecuária!$E$37)","v":0},{"$f":"(Pecuária!$B$26*Pecuária!$E$26)+(Pecuária!$B$37*Pecuária!$E$37)","v":0},{"$f":"(Pecuária!$B$26*Pecuária!$E$26)+(Pecuária!$B$37*Pecuária!$E$37)","v":0},{"$f":"(Pecuária!$B$26*Pecuária!$E$26)+(Pecuária!$B$37*Pecuária!$E$37)","v":0}]
["Bezerras ",{"$f":"(Pecuária!$B$27*Pecuária!C27)+(Pecuária!$B$38*Pecuária!C38)","v":0},{"$f":"(Pecuária!$B$27*Pecuária!D27)+(Pecuária!$B$38*Pecuária!D38)","v":0},{"$f":"(Pecuária!$B$27*Pecuária!$E$27)+(Pecuária!$B$38*Pecuária!$E$38)","v":0},{"$f":"(Pecuária!$B$27*Pecuária!$E$27)+(Pecuária!$B$38*Pecuária!$E$38)","v":0},{"$f":"(Pecuária!$B$27*Pecuária!$E$27)+(Pecuária!$B$38*Pecuária!$E$38)","v":0},{"$f":"(Pecuária!$B$27*Pecuária!$E$27)+(Pecuária!$B$38*Pecuária!$E$38)","v":0},{"$f":"(Pecuária!$B$27*Pecuária!$E$27)+(Pecuária!$B$38*Pecuária!$E$38)","v":0},{"$f":"(Pecuária!$B$27*Pecuária!$E$27)+(Pecuária!$B$38*Pecuária!$E$38)","v":0},{"$f":"(Pecuária!$B$27*Pecuária!$E$27)+(Pecuária!$B$38*Pecuária!$E$38)","v":0},{"$f":"(Pecuária!$B$27*Pecuária!$E$27)+(Pecuária!$B$38*Pecuária!$E$38)","v":0},{"$f":"(Pecuária!$B$27*Pecuária!$E$27)+(Pecuária!$B$38*Pecuária!$E$38)","v":0},{"$f":"(Pecuária!$B$27*Pecuária!$E$27)+(Pecuária!$B$38*Pecuária!$E$38)","v":0}]
["Total",{"$f":"SUM(B102:B110)","v":0},{"$f":"SUM(C102:C110)","v":0},0,0,0,0,0,0,0,0,0,{"$f":"SUM(M102:M110)","v":0}]
[]
["Resumo Pecuária "]
["Ano",1,2,3,4,5,6,7,8,9,10,11,12]
["Média de animais",{"$f":"'Evolução rebanho'!H14+'Evolução rebanho'!H98","v":0},{"$f":"'Evolução rebanho'!P14+'Evolução rebanho'!P98","v":0},{"$f":"'Evolução rebanho'!H28+'Evolução rebanho'!H112","v":0},{"$f":"'Evolução rebanho'!P28+'Evolução rebanho'!P112","v":0},{"$f":"'Evolução rebanho'!H42+'Evolução rebanho'!H126","v":0},{"$f":"'Evolução rebanho'!P42+'Evolução rebanho'!P126","v":0},{"$f":"'Evolução rebanho'!H140+'Evolução rebanho'!H56","v":0},{"$f":"'Evolução rebanho'!P56+'Evolução rebanho'!P140","v":0},{"$f":"'Evolução rebanho'!H154+'Evolução rebanho'!H70","v":0},{"$f":"'Evolução rebanho'!P70+'Evolução rebanho'!P154","v":0},{"$f":"'Evolução rebanho'!H83+'Evolução rebanho'!H168","v":0},{"$f":"'Evolução rebanho'!P168+'Evolução rebanho'!P83","v":0}]
["Suporte Forrageiro",{"$f":"'Suporte forrageiro'!F41","v":0},{"$f":"'Suporte forrageiro'!F42","v":0},{"$f":"'Suporte forrageiro'!F43","v":0},{"$f":"'Suporte forrageiro'!F44","v":0},{"$f":"'Suporte forrageiro'!F45","v":0},{"$f":"'Suporte forrageiro'!F46","v":0},{"$f":"'Suporte forrageiro'!F47","v":0},{"$f":"'Suporte forrageiro'!F48","v":0},{"$f":"'Suporte forrageiro'!F49","v":0},{"$f":"'Suporte forrageiro'!F50","v":0},{"$f":"'Suporte forrageiro'!F51","v":0},{"$f":"'Suporte forrageiro'!F52","v":0}]
["Receitas",{"$f":"C17+C52","v":0},{"$f":"E52+E17","v":0},{"$f":"G52+G17","v":0},{"$f":"I52+I17","v":0},{"$f":"K52+K17","v":0},{"$f":"M52+M17","v":0},{"$f":"C69+C34","v":0},{"$f":"E69+E34","v":0},{"$f":"G69+G34","v":0},{"$f":"I69+I34","v":0},{"$f":"K69+K34","v":0},{"$f":"M69+M34","v":0}]
["Despesas",{"$f":"B97+B111","v":0},{"$f":"C97+C111","v":0},0,0,0,0,0,0,0,0,0,{"$f":"M97+M111","v":0}]

{"sheet":"Mem despesas fixas","index":22,"n_rows":56,"n_cols":6,"rows_kept":56,"cut":false,"hidden":true,"merged":[[0,0,0,6]]}
["Despesas Fixas"]
["Discriminação","Ano 1","Ano 2","Ano 3","Ano 4","Ano 5"]
[{"$f":"IF('Despesas Fixas'!A5=\"\",\"\",'Despesas Fixas'!A5)","v":""},{"$f":"IF('Despesas Fixas'!$A$5=\"\",\"\",('Despesas Fixas'!$B$5*'Despesas Fixas'!$C$5)*12)","v":""},{"$f":"IF('Despesas Fixas'!$A$5=\"\",\"\",('Despesas Fixas'!$B$5*'Despesas Fixas'!$C$5)*12)","v":""},{"$f":"IF('Despesas Fixas'!$A$5=\"\",\"\",('Despesas Fixas'!$B$5*'Despesas Fixas'!$C$5)*12)","v":""},{"$f":"IF('Despesas Fixas'!$A$5=\"\",\"\",('Despesas Fixas'!$B$5*'Despesas Fixas'!$C$5)*12)","v":""},{"$f":"IF('Despesas Fixas'!$A$5=\"\",\"\",('Despesas Fixas'!$B$5*'Despesas Fixas'!$C$5)*12)","v":""}]
[{"$f":"IF('Despesas Fixas'!A6=\"\",\"\",'Despesas Fixas'!A6)","v":""},{"$f":"IF('Despesas Fixas'!$A$6=\"\",\"\",('Despesas Fixas'!$B$6*'Despesas Fixas'!$C$6)*12)","v":""},{"$f":"IF('Despesas Fixas'!$A$6=\"\",\"\",('Despesas Fixas'!$B$6*'Despesas Fixas'!$C$6)*12)","v":""},{"$f":"IF('Despesas Fixas'!$A$6=\"\",\"\",('Despesas Fixas'!$B$6*'Despesas Fixas'!$C$6)*12)","v":""},{"$f":"IF('Despesas Fixas'!$A$6=\"\",\"\",('Despesas Fixas'!$B$6*'Despesas Fixas'!$C$6)*12)","v":""},{"$f":"IF('Despesas Fixas'!$A$6=\"\",\"\",('Despesas Fixas'!$B$6*'Despesas Fixas'!$C$6)*12)","v":""}]
[{"$f":"IF('Despesas Fixas'!A7=\"\",\"\",'Despesas Fixas'!A7)","v":""},{"$f":"IF('Despesas Fixas'!$A$7=\"\",\"\",('Despesas Fixas'!$B$7*'Despesas Fixas'!$C$7)*12)","v":""},{"$f":"IF('Despesas Fixas'!$A$7=\"\",\"\",('Despesas Fixas'!$B$7*'Despesas Fixas'!$C$7)*12)","v":""},{"$f":"IF('Despesas Fixas'!$A$7=\"\",\"\",('Despesas Fixas'!$B$7*'Despesas Fixas'!$C$7)*12)","v":""},{"$f":"IF('Despesas Fixas'!$A$7=\"\",\"\",('Despesas Fixas'!$B$7*'Despesas Fixas'!$C$7)*12)","v":""},{"$f":"IF('Despesas Fixas'!$A$7=\"\",\"\",('Despesas Fixas'!$B$7*'Despesas Fixas'!$C$7)*12)","v":""}]
[{"$f":"IF('Despesas Fixas'!A8=\"\",\"\",'Despesas Fixas'!A8)","v":""},{"$f":"IF('Despesas Fixas'!$A$8=\"\",\"\",('Despesas Fixas'!$B$8*'Despesas Fixas'!$C$8)*12)","v":""},{"$f":"IF('Despesas Fixas'!$A$8=\"\",\"\",('Despesas Fixas'!$B$8*'Despesas Fixas'!$C$8)*12)","v":""},{"$f":"IF('Despesas Fixas'!$A$8=\"\",\"\",('Despesas Fixas'!$B$8*'Despesas Fixas'!$C$8)*12)","v":""},{"$f":"IF('Despesas Fixas'!$A$8=\"\",\"\",('Despesas Fixas'!$B$8*'Despesas Fixas'!$C$8)*12)","v":""},{"$f":"IF('Despesas Fixas'!$A$8=\"\",\"\",('Despesas Fixas'!$B$8*'Despesas Fixas'!$C$8)*12)","v":""}]
["Encargos Sociais - 80%",{"$f":"(SUM(B3:B6))*80%","v":0},{"$f":"(SUM(C3:C6))*80%","v":0},0,0,0]
["Manutenção",{"$f":"SUM('Despesas Fixas'!$E$11:$E$13)","v":0},{"$f":"SUM('Despesas Fixas'!$E$11:$E$13)","v":0},{"$f":"SUM('Despesas Fixas'!$E$11:$E$13)","v":0},{"$f":"SUM('Despesas Fixas'!$E$11:$E$13)","v":0},{"$f":"SUM('Despesas Fixas'!$E$11:$E$13)","v":0}]
["Depreciação ",{"$f":"SUM('Despesas Fixas'!$E$16:$E$18)","v":0},{"$f":"SUM('Despesas Fixas'!$E$16:$E$18)","v":0},{"$f":"SUM('Despesas Fixas'!$E$16:$E$18)","v":0},{"$f":"SUM('Despesas Fixas'!$E$16:$E$18)","v":0},{"$f":"SUM('Despesas Fixas'!$E$16:$E$18)","v":0}]
["Seguros",{"$f":"SUM('Despesas Fixas'!$E$21:$E$23)","v":0},{"$f":"SUM('Despesas Fixas'!$E$21:$E$23)","v":0},{"$f":"SUM('Despesas Fixas'!$E$21:$E$23)","v":0},{"$f":"SUM('Despesas Fixas'!$E$21:$E$23)","v":0},{"$f":"SUM('Despesas Fixas'!$E$21:$E$23)","v":0}]
[{"$f":"IF('Despesas Fixas'!A26=\"\",\"\",'Despesas Fixas'!A26)","v":""},{"$f":"IF('Despesas Fixas'!$A$26=\"\",\"\",'Despesas Fixas'!$D$26*'Despesas Fixas'!$C$26)","v":""},{"$f":"IF('Despesas Fixas'!$A$26=\"\",\"\",'Despesas Fixas'!$D$26*'Despesas Fixas'!$C$26)","v":""},{"$f":"IF('Despesas Fixas'!$A$26=\"\",\"\",'Despesas Fixas'!$D$26*'Despesas Fixas'!$C$26)","v":""},{"$f":"IF('Despesas Fixas'!$A$26=\"\",\"\",'Despesas Fixas'!$D$26*'Despesas Fixas'!$C$26)","v":""},{"$f":"IF('Despesas Fixas'!$A$26=\"\",\"\",'Despesas Fixas'!$D$26*'Despesas Fixas'!$C$26)","v":""}]
[{"$f":"IF('Despesas Fixas'!A27=\"\",\"\",'Despesas Fixas'!A27)","v":""},{"$f":"IF('Despesas Fixas'!$A$27=\"\",\"\",'Despesas Fixas'!$D$27*'Despesas Fixas'!$C$27)","v":""},{"$f":"IF('Despesas Fixas'!$A$27=\"\",\"\",'Despesas Fixas'!$D$27*'Despesas Fixas'!$C$27)","v":""},{"$f":"IF('Despesas Fixas'!$A$27=\"\",\"\",'Despesas Fixas'!$D$27*'Despesas Fixas'!$C$27)","v":""},{"$f":"IF('Despesas Fixas'!$A$27=\"\",\"\",'Despesas Fixas'!$D$27*'Despesas Fixas'!$C$27)","v":""},{"$f":"IF('Despesas Fixas'!$A$27=\"\",\"\",'Despesas Fixas'!$D$27*'Despesas Fixas'!$C$27)","v":""}]
[{"$f":"IF('Despesas Fixas'!A28=\"\",\"\",'Despesas Fixas'!A28)","v":""},{"$f":"IF('Despesas Fixas'!$A$28=\"\",\"\",'Despesas Fixas'!$D$28*'Despesas Fixas'!$C$28)","v":""},{"$f":"IF('Despesas Fixas'!$A$28=\"\",\"\",'Despesas Fixas'!$D$28*'Despesas Fixas'!$C$28)","v":""},{"$f":"IF('Despesas Fixas'!$A$28=\"\",\"\",'Despesas Fixas'!$D$28*'Despesas Fixas'!$C$28)","v":""},{"$f":"IF('Despesas Fixas'!$A$28=\"\",\"\",'Despesas Fixas'!$D$28*'Despesas Fixas'!$C$28)","v":""},{"$f":"IF('Despesas Fixas'!$A$28=\"\",\"\",'Despesas Fixas'!$D$28*'Despesas Fixas'!$C$28)","v":""}]
["Total ",{"$f":"SUM(B3:B13)","v":0},0,0,0,0]
[]
["Discriminação","Ano 6","Ano 7","Ano 8","Ano 9","Ano 10"]
[{"$f":"IF('Despesas Fixas'!A5=\"\",\"\",'Despesas Fixas'!A5)","v":""},{"$f":"IF('Despesas Fixas'!$A$5=\"\",\"\",('Despesas Fixas'!$B$5*'Despesas Fixas'!$C$5)*12)","v":""},{"$f":"IF('Despesas Fixas'!$A$5=\"\",\"\",('Despesas Fixas'!$B$5*'Despesas Fixas'!$C$5)*12)","v":""},{"$f":"IF('Despesas Fixas'!$A$5=\"\",\"\",('Despesas Fixas'!$B$5*'Despesas Fixas'!$C$5)*12)","v":""},{"$f":"IF('Despesas Fixas'!$A$5=\"\",\"\",('Despesas Fixas'!$B$5*'Despesas Fixas'!$C$5)*12)","v":""},{"$f":"IF('Despesas Fixas'!$A$5=\"\",\"\",('Despesas Fixas'!$B$5*'Despesas Fixas'!$C$5)*12)","v":""}]
[{"$f":"IF('Despesas Fixas'!A6=\"\",\"\",'Despesas Fixas'!A6)","v":""},{"$f":"IF('Despesas Fixas'!$A$6=\"\",\"\",('Despesas Fixas'!$B$6*'Despesas Fixas'!$C$6)*12)","v":""},{"$f":"IF('Despesas Fixas'!$A$6=\"\",\"\",('Despesas Fixas'!$B$6*'Despesas Fixas'!$C$6)*12)","v":""},{"$f":"IF('Despesas Fixas'!$A$6=\"\",\"\",('Despesas Fixas'!$B$6*'Despesas Fixas'!$C$6)*12)","v":""},{"$f":"IF('Despesas Fixas'!$A$6=\"\",\"\",('Despesas Fixas'!$B$6*'Despesas Fixas'!$C$6)*12)","v":""},{"$f":"IF('Despesas Fixas'!$A$6=\"\",\"\",('Despesas Fixas'!$B$6*'Despesas Fixas'!$C$6)*12)","v":""}]
[{"$f":"IF('Despesas Fixas'!A7=\"\",\"\",'Despesas Fixas'!A7)","v":""},{"$f":"IF('Despesas Fixas'!$A$7=\"\",\"\",('Despesas Fixas'!$B$7*'Despesas Fixas'!$C$7)*12)","v":""},{"$f":"IF('Despesas Fixas'!$A$7=\"\",\"\",('Despesas Fixas'!$B$7*'Despesas Fixas'!$C$7)*12)","v":""},{"$f":"IF('Despesas Fixas'!$A$7=\"\",\"\",('Despesas Fixas'!$B$7*'Despesas Fixas'!$C$7)*12)","v":""},{"$f":"IF('Despesas Fixas'!$A$7=\"\",\"\",('Despesas Fixas'!$B$7*'Despesas Fixas'!$C$7)*12)","v":""},{"$f":"IF('Despesas Fixas'!$A$7=\"\",\"\",('Despesas Fixas'!$B$7*'Despesas Fixas'!$C$7)*12)","v":""}]
[{"$f":"IF('Despesas Fixas'!A8=\"\",\"\",'Despesas Fixas'!A8)","v":""},{"$f":"IF('Despesas Fixas'!$A$8=\"\",\"\",('Despesas Fixas'!$B$8*'Despesas Fixas'!$C$8)*12)","v":""},{"$f":"IF('Despesas Fixas'!$A$8=\"\",\"\",('Despesas Fixas'!$B$8*'Despesas Fixas'!$C$8)*12)","v":""},{"$f":"IF('Despesas Fixas'!$A$8=\"\",\"\",('Despesas Fixas'!$B$8*'Despesas Fixas'!$C$8)*12)","v":""},{"$f":"IF('Despesas Fixas'!$A$8=\"\",\"\",('Despesas Fixas'!$B$8*'Despesas Fixas'!$C$8)*12)","v":""},{"$f":"IF('Despesas Fixas'!$A$8=\"\",\"\",('Despesas Fixas'!$B$8*'Despesas Fixas'!$C$8)*12)","v":""}]
["Encargos Sociais - 80%",{"$f":"(SUM(B17:B20))*80%","v":0},{"$f":"(SUM(C17:C20))*80%","v":0},{"$f":"(SUM(D17:D20))*80%","v":0},0,0]
["Manutenção",{"$f":"SUM('Despesas Fixas'!$E$11:$E$13)","v":0},{"$f":"SUM('Despesas Fixas'!$E$11:$E$13)","v":0},{"$f":"SUM('Despesas Fixas'!$E$11:$E$13)","v":0},{"$f":"SUM('Despesas Fixas'!$E$11:$E$13)","v":0},{"$f":"SUM('Despesas Fixas'!$E$11:$E$13)","v":0}]
["Depreciação ",{"$f":"SUM('Despesas Fixas'!$E$16:$E$18)","v":0},{"$f":"SUM('Despesas Fixas'!$E$16:$E$18)","v":0},{"$f":"SUM('Despesas Fixas'!$E$16:$E$18)","v":0},{"$f":"SUM('Despesas Fixas'!$E$16:$E$18)","v":0},{"$f":"SUM('Despesas Fixas'!$E$16:$E$18)","v":0}]
["Seguros",{"$f":"SUM('Despesas Fixas'!$E$21:$E$23)","v":0},{"$f":"SUM('Despesas Fixas'!$E$21:$E$23)","v":0},{"$f":"SUM('Despesas Fixas'!$E$21:$E$23)","v":0},{"$f":"SUM('Despesas Fixas'!$E$21:$E$23)","v":0},{"$f":"SUM('Despesas Fixas'!$E$21:$E$23)","v":0}]
[{"$f":"IF('Despesas Fixas'!A26=\"\",\"\",'Despesas Fixas'!A26)","v":""},{"$f":"IF('Despesas Fixas'!$A$26=\"\",\"\",'Despesas Fixas'!$D$26*'Despesas Fixas'!$C$26)","v":""},{"$f":"IF('Despesas Fixas'!$A$26=\"\",\"\",'Despesas Fixas'!$D$26*'Despesas Fixas'!$C$26)","v":""},{"$f":"IF('Despesas Fixas'!$A$26=\"\",\"\",'Despesas Fixas'!$D$26*'Despesas Fixas'!$C$26)","v":""},{"$f":"IF('Despesas Fixas'!$A$26=\"\",\"\",'Despesas Fixas'!$D$26*'Despesas Fixas'!$C$26)","v":""},{"$f":"IF('Despesas Fixas'!$A$26=\"\",\"\",'Despesas Fixas'!$D$26*'Despesas Fixas'!$C$26)","v":""}]
[{"$f":"IF('Despesas Fixas'!A27=\"\",\"\",'Despesas Fixas'!A27)","v":""},{"$f":"IF('Despesas Fixas'!$A$27=\"\",\"\",'Despesas Fixas'!$D$27*'Despesas Fixas'!$C$27)","v":""},{"$f":"IF('Despesas Fixas'!$A$27=\"\",\"\",'Despesas Fixas'!$D$27*'Despesas Fixas'!$C$27)","v":""},{"$f":"IF('Despesas Fixas'!$A$27=\"\",\"\",'Despesas Fixas'!$D$27*'Despesas Fixas'!$C$27)","v":""},{"$f":"IF('Despesas Fixas'!$A$27=\"\",\"\",'Despesas Fixas'!$D$27*'Despesas Fixas'!$C$27)","v":""},{"$f":"IF('Despesas Fixas'!$A$27=\"\",\"\",'Despesas Fixas'!$D$27*'Despesas Fixas'!$C$27)","v":""}]
[{"$f":"IF('Despesas Fixas'!A28=\"\",\"\",'Despesas Fixas'!A28)","v":""},{"$f":"IF('Despesas Fixas'!$A$28=\"\",\"\",'Despesas Fixas'!$D$28*'Despesas Fixas'!$C$28)","v":""},{"$f":"IF('Despesas Fixas'!$A$28=\"\",\"\",'Despesas Fixas'!$D$28*'Despesas Fixas'!$C$28)","v":""},{"$f":"IF('Despesas Fixas'!$A$28=\"\",\"\",'Despesas Fixas'!$D$28*'Despesas Fixas'!$C$28)","v":""},{"$f":"IF('Despesas Fixas'!$A$28=\"\",\"\",'Despesas Fixas'!$D$28*'Despesas Fixas'!$C$28)","v":""},{"$f":"IF('Despesas Fixas'!$A$28=\"\",\"\",'Despesas Fixas'!$D$28*'Despesas Fixas'!$C$28)","v":""}]
["Total",{"$f":"SUM(B17:B27)","v":0},{"$f":"SUM(C17:C27)","v":0},0,0,0]
[]
["Discriminação","Ano 11","Ano 12","Ano 13","Ano 14","Ano 15"]
[{"$f":"IF('Despesas Fixas'!A19=\"\",\"\",'Despesas Fixas'!A19)","v":"Seguros"},{"$f":"IF('Despesas Fixas'!$A$5=\"\",\"\",('Despesas Fixas'!$B$5*'Despesas Fixas'!$C$5)*12)","v":""},{"$f":"IF('Despesas Fixas'!$A$5=\"\",\"\",('Despesas Fixas'!$B$5*'Despesas Fixas'!$C$5)*12)","v":""},{"$f":"IF('Despesas Fixas'!$A$5=\"\",\"\",('Despesas Fixas'!$B$5*'Despesas Fixas'!$C$5)*12)","v":""},{"$f":"IF('Despesas Fixas'!$A$5=\"\",\"\",('Despesas Fixas'!$B$5*'Despesas Fixas'!$C$5)*12)","v":""},{"$f":"IF('Despesas Fixas'!$A$5=\"\",\"\",('Despesas Fixas'!$B$5*'Despesas Fixas'!$C$5)*12)","v":""}]
[{"$f":"IF('Despesas Fixas'!A20=\"\",\"\",'Despesas Fixas'!A20)","v":"Discriminação "},{"$f":"IF('Despesas Fixas'!$A$6=\"\",\"\",('Despesas Fixas'!$B$6*'Despesas Fixas'!$C$6)*12)","v":""},{"$f":"IF('Despesas Fixas'!$A$6=\"\",\"\",('Despesas Fixas'!$B$6*'Despesas Fixas'!$C$6)*12)","v":""},{"$f":"IF('Despesas Fixas'!$A$6=\"\",\"\",('Despesas Fixas'!$B$6*'Despesas Fixas'!$C$6)*12)","v":""},{"$f":"IF('Despesas Fixas'!$A$6=\"\",\"\",('Despesas Fixas'!$B$6*'Despesas Fixas'!$C$6)*12)","v":""},{"$f":"IF('Despesas Fixas'!$A$6=\"\",\"\",('Despesas Fixas'!$B$6*'Despesas Fixas'!$C$6)*12)","v":""}]
[{"$f":"IF('Despesas Fixas'!A21=\"\",\"\",'Despesas Fixas'!A21)","v":"Benfeitorias (Construções Civis)"},{"$f":"IF('Despesas Fixas'!$A$7=\"\",\"\",('Despesas Fixas'!$B$7*'Despesas Fixas'!$C$7)*12)","v":""},{"$f":"IF('Despesas Fixas'!$A$7=\"\",\"\",('Despesas Fixas'!$B$7*'Despesas Fixas'!$C$7)*12)","v":""},{"$f":"IF('Despesas Fixas'!$A$7=\"\",\"\",('Despesas Fixas'!$B$7*'Despesas Fixas'!$C$7)*12)","v":""},{"$f":"IF('Despesas Fixas'!$A$7=\"\",\"\",('Despesas Fixas'!$B$7*'Despesas Fixas'!$C$7)*12)","v":""},{"$f":"IF('Despesas Fixas'!$A$7=\"\",\"\",('Despesas Fixas'!$B$7*'Despesas Fixas'!$C$7)*12)","v":""}]
[{"$f":"IF('Despesas Fixas'!A22=\"\",\"\",'Despesas Fixas'!A22)","v":"Máquinas e Equipamentos"},{"$f":"IF('Despesas Fixas'!$A$8=\"\",\"\",('Despesas Fixas'!$B$8*'Despesas Fixas'!$C$8)*12)","v":""},{"$f":"IF('Despesas Fixas'!$A$8=\"\",\"\",('Despesas Fixas'!$B$8*'Despesas Fixas'!$C$8)*12)","v":""},{"$f":"IF('Despesas Fixas'!$A$8=\"\",\"\",('Despesas Fixas'!$B$8*'Despesas Fixas'!$C$8)*12)","v":""},{"$f":"IF('Despesas Fixas'!$A$8=\"\",\"\",('Despesas Fixas'!$B$8*'Despesas Fixas'!$C$8)*12)","v":""},{"$f":"IF('Despesas Fixas'!$A$8=\"\",\"\",('Despesas Fixas'!$B$8*'Despesas Fixas'!$C$8)*12)","v":""}]
["Encargos Sociais - 80%",{"$f":"(SUM(B31:B34))*80%","v":0},{"$f":"(SUM(C31:C34))*80%","v":0},{"$f":"(SUM(D31:D34))*80%","v":0},0,0]
["Manutenção",{"$f":"SUM('Despesas Fixas'!$E$11:$E$13)","v":0},{"$f":"SUM('Despesas Fixas'!$E$11:$E$13)","v":0},{"$f":"SUM('Despesas Fixas'!$E$11:$E$13)","v":0},{"$f":"SUM('Despesas Fixas'!$E$11:$E$13)","v":0},{"$f":"SUM('Despesas Fixas'!$E$11:$E$13)","v":0}]
["Depreciação ",{"$f":"SUM('Despesas Fixas'!$E$16:$E$18)","v":0},{"$f":"SUM('Despesas Fixas'!$E$16:$E$18)","v":0},{"$f":"SUM('Despesas Fixas'!$E$16:$E$18)","v":0},{"$f":"SUM('Despesas Fixas'!$E$16:$E$18)","v":0},{"$f":"SUM('Despesas Fixas'!$E$16:$E$18)","v":0}]
["Seguros",{"$f":"SUM('Despesas Fixas'!$E$21:$E$23)","v":0},{"$f":"SUM('Despesas Fixas'!$E$21:$E$23)","v":0},{"$f":"SUM('Despesas Fixas'!$E$21:$E$23)","v":0},{"$f":"SUM('Despesas Fixas'!$E$21:$E$23)","v":0},{"$f":"SUM('Despesas Fixas'!$E$21:$E$23)","v":0}]
[{"$f":"IF('Despesas Fixas'!A40=\"\",\"\",'Despesas Fixas'!A40)","v":""},{"$f":"IF('Despesas Fixas'!$A$26=\"\",\"\",'Despesas Fixas'!$D$26*'Despesas Fixas'!$C$26)","v":""},{"$f":"IF('Despesas Fixas'!$A$26=\"\",\"\",'Despesas Fixas'!$D$26*'Despesas Fixas'!$C$26)","v":""},{"$f":"IF('Despesas Fixas'!$A$26=\"\",\"\",'Despesas Fixas'!$D$26*'Despesas Fixas'!$C$26)","v":""},{"$f":"IF('Despesas Fixas'!$A$26=\"\",\"\",'Despesas Fixas'!$D$26*'Despesas Fixas'!$C$26)","v":""},{"$f":"IF('Despesas Fixas'!$A$26=\"\",\"\",'Despesas Fixas'!$D$26*'Despesas Fixas'!$C$26)","v":""}]
[{"$f":"IF('Despesas Fixas'!A41=\"\",\"\",'Despesas Fixas'!A41)","v":""},{"$f":"IF('Despesas Fixas'!$A$27=\"\",\"\",'Despesas Fixas'!$D$27*'Despesas Fixas'!$C$27)","v":""},{"$f":"IF('Despesas Fixas'!$A$27=\"\",\"\",'Despesas Fixas'!$D$27*'Despesas Fixas'!$C$27)","v":""},{"$f":"IF('Despesas Fixas'!$A$27=\"\",\"\",'Despesas Fixas'!$D$27*'Despesas Fixas'!$C$27)","v":""},{"$f":"IF('Despesas Fixas'!$A$27=\"\",\"\",'Despesas Fixas'!$D$27*'Despesas Fixas'!$C$27)","v":""},{"$f":"IF('Despesas Fixas'!$A$27=\"\",\"\",'Despesas Fixas'!$D$27*'Despesas Fixas'!$C$27)","v":""}]
[{"$f":"IF('Despesas Fixas'!A42=\"\",\"\",'Despesas Fixas'!A42)","v":""},{"$f":"IF('Despesas Fixas'!$A$28=\"\",\"\",'Despesas Fixas'!$D$28*'Despesas Fixas'!$C$28)","v":""},{"$f":"IF('Despesas Fixas'!$A$28=\"\",\"\",'Despesas Fixas'!$D$28*'Despesas Fixas'!$C$28)","v":""},{"$f":"IF('Despesas Fixas'!$A$28=\"\",\"\",'Despesas Fixas'!$D$28*'Despesas Fixas'!$C$28)","v":""},{"$f":"IF('Despesas Fixas'!$A$28=\"\",\"\",'Despesas Fixas'!$D$28*'Despesas Fixas'!$C$28)","v":""},{"$f":"IF('Despesas Fixas'!$A$28=\"\",\"\",'Despesas Fixas'!$D$28*'Despesas Fixas'!$C$28)","v":""}]
["Total",{"$f":"SUM(B31:B41)","v":0},{"$f":"SUM(C31:C41)","v":0},{"$f":"SUM(D31:D41)","v":0},0,0]
[]
["Discriminação","Ano 16","Ano 17","Ano 18","Ano 19","Ano 20"]
[{"$f":"IF('Despesas Fixas'!A33=\"\",\"\",'Despesas Fixas'!A33)","v":""},{"$f":"IF('Despesas Fixas'!$A$5=\"\",\"\",('Despesas Fixas'!$B$5*'Despesas Fixas'!$C$5)*12)","v":""},{"$f":"IF('Despesas Fixas'!$A$5=\"\",\"\",('Despesas Fixas'!$B$5*'Despesas Fixas'!$C$5)*12)","v":""},{"$f":"IF('Despesas Fixas'!$A$5=\"\",\"\",('Despesas Fixas'!$B$5*'Despesas Fixas'!$C$5)*12)","v":""},{"$f":"IF('Despesas Fixas'!$A$5=\"\",\"\",('Despesas Fixas'!$B$5*'Despesas Fixas'!$C$5)*12)","v":""},{"$f":"IF('Despesas Fixas'!$A$5=\"\",\"\",('Despesas Fixas'!$B$5*'Despesas Fixas'!$C$5)*12)","v":""}]
[{"$f":"IF('Despesas Fixas'!A34=\"\",\"\",'Despesas Fixas'!A34)","v":""},{"$f":"IF('Despesas Fixas'!$A$6=\"\",\"\",('Despesas Fixas'!$B$6*'Despesas Fixas'!$C$6)*12)","v":""},{"$f":"IF('Despesas Fixas'!$A$6=\"\",\"\",('Despesas Fixas'!$B$6*'Despesas Fixas'!$C$6)*12)","v":""},{"$f":"IF('Despesas Fixas'!$A$6=\"\",\"\",('Despesas Fixas'!$B$6*'Despesas Fixas'!$C$6)*12)","v":""},{"$f":"IF('Despesas Fixas'!$A$6=\"\",\"\",('Despesas Fixas'!$B$6*'Despesas Fixas'!$C$6)*12)","v":""},{"$f":"IF('Despesas Fixas'!$A$6=\"\",\"\",('Despesas Fixas'!$B$6*'Despesas Fixas'!$C$6)*12)","v":""}]
[{"$f":"IF('Despesas Fixas'!A35=\"\",\"\",'Despesas Fixas'!A35)","v":""},{"$f":"IF('Despesas Fixas'!$A$7=\"\",\"\",('Despesas Fixas'!$B$7*'Despesas Fixas'!$C$7)*12)","v":""},{"$f":"IF('Despesas Fixas'!$A$7=\"\",\"\",('Despesas Fixas'!$B$7*'Despesas Fixas'!$C$7)*12)","v":""},{"$f":"IF('Despesas Fixas'!$A$7=\"\",\"\",('Despesas Fixas'!$B$7*'Despesas Fixas'!$C$7)*12)","v":""},{"$f":"IF('Despesas Fixas'!$A$7=\"\",\"\",('Despesas Fixas'!$B$7*'Despesas Fixas'!$C$7)*12)","v":""},{"$f":"IF('Despesas Fixas'!$A$7=\"\",\"\",('Despesas Fixas'!$B$7*'Despesas Fixas'!$C$7)*12)","v":""}]
[{"$f":"IF('Despesas Fixas'!A36=\"\",\"\",'Despesas Fixas'!A36)","v":""},{"$f":"IF('Despesas Fixas'!$A$8=\"\",\"\",('Despesas Fixas'!$B$8*'Despesas Fixas'!$C$8)*12)","v":""},{"$f":"IF('Despesas Fixas'!$A$8=\"\",\"\",('Despesas Fixas'!$B$8*'Despesas Fixas'!$C$8)*12)","v":""},{"$f":"IF('Despesas Fixas'!$A$8=\"\",\"\",('Despesas Fixas'!$B$8*'Despesas Fixas'!$C$8)*12)","v":""},{"$f":"IF('Despesas Fixas'!$A$8=\"\",\"\",('Despesas Fixas'!$B$8*'Despesas Fixas'!$C$8)*12)","v":""},{"$f":"IF('Despesas Fixas'!$A$8=\"\",\"\",('Despesas Fixas'!$B$8*'Despesas Fixas'!$C$8)*12)","v":""}]
["Encargos Sociais - 80%",{"$f":"(SUM(B45:B48))*80%","v":0},{"$f":"(SUM(C45:C48))*80%","v":0},{"$f":"(SUM(D45:D48))*80%","v":0},{"$f":"(SUM(E45:E48))*80%","v":0},{"$f":"(SUM(F45:F48))*80%","v":0}]
["Manutenção",{"$f":"SUM('Despesas Fixas'!$E$11:$E$13)","v":0},{"$f":"SUM('Despesas Fixas'!$E$11:$E$13)","v":0},{"$f":"SUM('Despesas Fixas'!$E$11:$E$13)","v":0},{"$f":"SUM('Despesas Fixas'!$E$11:$E$13)","v":0},{"$f":"SUM('Despesas Fixas'!$E$11:$E$13)","v":0}]
["Depreciação ",{"$f":"SUM('Despesas Fixas'!$E$16:$E$18)","v":0},{"$f":"SUM('Despesas Fixas'!$E$16:$E$18)","v":0},{"$f":"SUM('Despesas Fixas'!$E$16:$E$18)","v":0},{"$f":"SUM('Despesas Fixas'!$E$16:$E$18)","v":0},{"$f":"SUM('Despesas Fixas'!$E$16:$E$18)","v":0}]
["Seguros",{"$f":"SUM('Despesas Fixas'!$E$21:$E$23)","v":0},{"$f":"SUM('Despesas Fixas'!$E$21:$E$23)","v":0},{"$f":"SUM('Despesas Fixas'!$E$21:$E$23)","v":0},{"$f":"SUM('Despesas Fixas'!$E$21:$E$23)","v":0},{"$f":"SUM('Despesas Fixas'!$E$21:$E$23)","v":0}]
[{"$f":"IF('Despesas Fixas'!A54=\"\",\"\",'Despesas Fixas'!A54)","v":""},{"$f":"IF('Despesas Fixas'!$A$26=\"\",\"\",'Despesas Fixas'!$D$26*'Despesas Fixas'!$C$26)","v":""},{"$f":"IF('Despesas Fixas'!$A$26=\"\",\"\",'Despesas Fixas'!$D$26*'Despesas Fixas'!$C$26)","v":""},{"$f":"IF('Despesas Fixas'!$A$26=\"\",\"\",'Despesas Fixas'!$D$26*'Despesas Fixas'!$C$26)","v":""},{"$f":"IF('Despesas Fixas'!$A$26=\"\",\"\",'Despesas Fixas'!$D$26*'Despesas Fixas'!$C$26)","v":""},{"$f":"IF('Despesas Fixas'!$A$26=\"\",\"\",'Despesas Fixas'!$D$26*'Despesas Fixas'!$C$26)","v":""}]
[{"$f":"IF('Despesas Fixas'!A55=\"\",\"\",'Despesas Fixas'!A55)","v":""},{"$f":"IF('Despesas Fixas'!$A$27=\"\",\"\",'Despesas Fixas'!$D$27*'Despesas Fixas'!$C$27)","v":""},{"$f":"IF('Despesas Fixas'!$A$27=\"\",\"\",'Despesas Fixas'!$D$27*'Despesas Fixas'!$C$27)","v":""},{"$f":"IF('Despesas Fixas'!$A$27=\"\",\"\",'Despesas Fixas'!$D$27*'Despesas Fixas'!$C$27)","v":""},{"$f":"IF('Despesas Fixas'!$A$27=\"\",\"\",'Despesas Fixas'!$D$27*'Despesas Fixas'!$C$27)","v":""},{"$f":"IF('Despesas Fixas'!$A$27=\"\",\"\",'Despesas Fixas'!$D$27*'Despesas Fixas'!$C$27)","v":""}]
[{"$f":"IF('Despesas Fixas'!A56=\"\",\"\",'Despesas Fixas'!A56)","v":""},{"$f":"IF('Despesas Fixas'!$A$28=\"\",\"\",'Despesas Fixas'!$D$28*'Despesas Fixas'!$C$28)","v":""},{"$f":"IF('Despesas Fixas'!$A$28=\"\",\"\",'Despesas Fixas'!$D$28*'Despesas Fixas'!$C$28)","v":""},{"$f":"IF('Despesas Fixas'!$A$28=\"\",\"\",'Despesas Fixas'!$D$28*'Despesas Fixas'!$C$28)","v":""},{"$f":"IF('Despesas Fixas'!$A$28=\"\",\"\",'Despesas Fixas'!$D$28*'Despesas Fixas'!$C$28)","v":""},{"$f":"IF('Despesas Fixas'!$A$28=\"\",\"\",'Despesas Fixas'!$D$28*'Despesas Fixas'!$C$28)","v":""}]
["Total",{"$f":"SUM(B45:B55)","v":0},{"$f":"SUM(C45:C55)","v":0},{"$f":"SUM(D45:D55)","v":0},{"$f":"SUM(E45:E55)","v":0},{"$f":"SUM(F45:F55)","v":0}]