{"text_format":"1","workbook":"xlsx","n_sheets":25,"sheets":["Menu","Dados Cadastrais","Informações","Empreendimento","Produto","Descrição do Projeto","Orçamento","Informações do Imóvel","Área do Empreendimento","Garantias","Atividades não financiadas","Agricultura","Piscicultura-Apicultura","Pecuária","Despesas Fixas","Análise","Enquadramento","Mem Atividades não financiadas","Mem agricultura","Mem piscicultura-apicultura","Suporte forrageiro","Evolução rebanho","Mem pecuaria","Mem despesas fixas","Relatório"],"not_rendered":{"charts":0,"images":23,"macros":1,"external_links":1,"defined_names":22,"comments":1,"pivot_tables":0},"unopened":[],"bounds":{"document_bytes":16777216,"sheet_cells":100000,"rows_first":2000,"rows_last":500,"rows_between":2000,"halvings":0,"cell_chars":16384,"cell_head_chars":4096},"cells_cut":0,"cells_raw":0,"read":"whole","date_system":"1900"}

{"sheet":"Menu","index":0,"n_rows":0,"n_cols":0,"rows_kept":0,"cut":false,"hidden":false,"merged":[]}

{"sheet":"Dados Cadastrais","index":1,"n_rows":74,"n_cols":8,"rows_kept":74,"cut":false,"hidden":false,"merged":[[2,4,2,9],[3,4,3,9],[4,4,4,9],[7,0,7,9],[11,0,11,3],[11,4,11,9],[12,0,12,3],[12,4,12,9],[13,0,13,3],[13,4,13,9],[8,0,8,3],[8,4,8,9],[9,0,9,3],[9,4,9,9],[10,0,10,3],[10,4,10,9],[17,0,17,3],[17,4,17,9],[18,0,18,3],[18,4,18,9],[19,0,19,9],[20,0,20,3],[20,4,20,9],[14,0,14,3],[14,4,14,9],[15,0,15,3],[15,4,15,9],[16,0,16,3],[16,4,16,9],[24,0,24,3],[24,4,24,9],[25,0,25,3],[25,4,25,9],[26,0,26,3],[26,4,26,9],[21,0,21,3],[21,4,21,9],[22,0,22,3],[22,4,22,9],[23,0,23,3],[23,4,23,9],[31,0,31,3],[31,4,31,9],[36,0,36,3],[36,4,36,6],[36,7,36,9],[37,0,37,3],[37,4,37,6],[37,7,37,9],[27,0,27,9],[28,0,28,3],[28,4,28,9],[29,0,29,3],[29,4,29,9],[30,0,30,3],[30,4,30,9],[33,4,33,9],[32,4,32,9],[32,0,32,3],[33,0,33,3],[41,0,41,3],[41,4,41,6],[41,7,41,9],[42,0,42,3],[42,4,42,6],[42,7,42,9],[38,0,38,3],[38,4,38,6],[38,7,38,9],[39,0,39,3],[39,4,39,6],[39,7,39,9],[40,0,40,3],[40,7,40,9],[40,4,40,6],[45,0,45,3],[45,4,45,6],[45,7,45,9],[47,0,47,3],[47,4,47,6],[47,7,47,9],[43,0,43,3],[43,4,43,6],[43,7,43,9],[44,0,44,3],[44,4,44,6],[44,7,44,9],[46,0,46,3],[46,4,46,6],[46,7,46,9],[52,0,52,1],[52,2,52,5],[52,6,52,9],[53,0,53,1],[53,2,53,5],[53,6,53,9],[50,0,50,1],[50,2,50,5],[50,6,50,9],[51,0,51,1],[51,2,51,5],[51,6,51,9],[56,0,56,1],[56,2,56,5],[56,6,56,9],[57,0,57,1],[57,2,57,5],[57,6,57,9],[54,0,54,1],[54,2,54,5],[54,6,54,9],[55,0,55,1],[55,2,55,5],[55,6,55,9],[60,0,60,1],[60,2,60,5],[60,6,60,9],[61,0,61,1],[61,2,61,5],[61,6,61,9],[58,0,58,1],[58,2,58,5],[58,6,58,9],[59,0,59,1],[59,2,59,5],[59,6,59,9],[64,0,64,1],[64,2,64,5],[64,6,64,9],[65,0,65,1],[65,2,65,5],[65,6,65,9],[62,0,62,1],[62,2,62,5],[62,6,62,9],[63,0,63,1],[63,2,63,5],[63,6,63,9],[68,0,68,1],[68,2,68,5],[68,6,68,9],[69,0,69,1],[69,2,69,5],[69,6,69,9],[66,0,66,1],[66,2,66,5],[66,6,66,9],[67,0,67,1],[67,2,67,5],[67,6,67,9],[72,0,72,1],[72,2,72,5],[72,6,72,9],[73,0,73,1],[73,2,73,5],[73,6,73,9],[70,0,70,1],[70,2,70,5],[70,6,70,9],[71,0,71,1],[71,2,71,5],[71,6,71,9]]}
[]
["1. Produto"]
["Linha de Finacimanento"]
["Data:"]
["Agência:"]
[]
["2. Informações do Proponente"]
["Pessoa Física"]
["Nome Completo:"]
["CPF:"]
["Estado Civil:"]
["Nome Cônjuge:"]
["CPF:"]
["Endereço:"]
["Bairro:"]
["Cidade/UF:"]
["CEP:"]
["Telefone:"]
["Renda Bruta Anual:"]
["Pessoa Jurídica"]
["Razão Social:"]
["CNPJ:"]
["Endereço:"]
["Insc. Estadual:"]
["Telefone:"]
["Email:"]
["Renda Bruta Anual:"]
["Assistência Técnica"]
["Nome:"]
["CPF/CNPJ:"]
["Telefone:"]
["Cidade/UF:"]
["Assistência Técnica Financiada:"]
["N° Parcelas de Assistência Técnica:"]
[]
["3. Endividamento (Banpará, Outros Bancos, Fornecedores, etc.)"]
["Informações do Endividamento",null,null,null,"Endividamento 1",null,null,"Endividamento 2"]
["Credor"]
["Data da contratação"]
["Data de Vencimento"]
["Finalidade"]
["Valor Contratado"]
["Informações do Endividamento",null,null,null,"Endividamento 3",null,null,"Endividamento 4"]
["Credor"]
["Data da contratação"]
["Data de Vencimento"]
["Finalidade"]
["Valor Contratado"]
[]
["4. Parcelas em ser "]
["Ano 1",null,"Ano 2",null,null,null,"Ano 3"]
[]
[]
[]
[]
[{"$f":"SUM(A52:B55)","v":0},null,{"$f":"SUM(C52:F55)","v":0},null,null,null,{"$f":"SUM(G52:J55)","v":0}]
["Ano 4",null,"Ano 5",null,null,null,"Ano 6"]
[]
[]
[]
[]
[{"$f":"SUM(A58:B61)","v":0},null,{"$f":"SUM(C58:F61)","v":0},null,null,null,{"$f":"SUM(G58:J61)","v":0}]
["Ano 7",null,"Ano 8",null,null,null,"Ano 9"]
[]
[]
[]
[]
[{"$f":"SUM(A64:B67)","v":0},null,{"$f":"SUM(C64:F67)","v":0},null,null,null,{"$f":"SUM(G64:J67)","v":0}]
["Ano 10",null,"Ano 11",null,null,null,"Ano 12"]
[]
[]
[]
[]
[{"$f":"SUM(A70:B73)","v":0},null,{"$f":"SUM(C70:F73)","v":0},null,null,null,{"$f":"SUM(G70:J73)","v":0}]

{"sheet":"Informações","index":2,"n_rows":156,"n_cols":17,"rows_kept":156,"cut":false,"hidden":true,"merged":[]}
["Agência",null,"Unidade de medida",null,"Código UF","Unidade da Federação","UF",null,null,"Subcategoria",null,"Codigo de Investimento","Codigo de Custeio",null,"Codigo de Investimento",null,"Código"]
["2-CASTANHAL",null,"Arroba",null,12,"Acre","AC",null,null,"CDB Banpará",null,{"$f":"Empreendimento!B6","v":""},{"$f":"Empreendimento!B22","v":""},null,{"$f":"IFERROR(INDEX($L$2:$L$15,_xlfn.AGGREGATE(15,6,(ROW($L$2:$L$15)-ROW($L$1))/($L$2:$L$15<>\"\"),ROWS($P$2:P2))),\"\")","v":""},null,{"$f":"IFERROR(INDEX($O$2:$O$29,_xlfn.AGGREGATE(15,6,(ROW($O$2:$O$29)-ROW($O$1))/($O$2:$O$29<>\"\"),ROWS($P$2:P2))),\"\")","v":""}]
["3-SANTARÉM",null,"Aves",null,27,"Alagoas","AL",null,null,"Equipamento ",null,{"$f":"Empreendimento!B7","v":""},{"$f":"Empreendimento!B23","v":""},null,{"$f":"IFERROR(INDEX($L$2:$L$15,_xlfn.AGGREGATE(15,6,(ROW($L$2:$L$15)-ROW($L$1))/($L$2:$L$15<>\"\"),ROWS($P$2:P3))),\"\")","v":""},null,{"$f":"IFERROR(INDEX($O$2:$O$29,_xlfn.AGGREGATE(15,6,(ROW($O$2:$O$29)-ROW($O$1))/($O$2:$O$29<>\"\"),ROWS($P$2:P3))),\"\")","v":""}]
["5-PARAGOMINAS",null,"Cabeça",null,16,"Amapá","AP",null,null,"Fiança Bancária",null,{"$f":"Empreendimento!B8","v":""},{"$f":"Empreendimento!B24","v":""},null,{"$f":"IFERROR(INDEX($L$2:$L$15,_xlfn.AGGREGATE(15,6,(ROW($L$2:$L$15)-ROW($L$1))/($L$2:$L$15<>\"\"),ROWS($P$2:P4))),\"\")","v":""},null,{"$f":"IFERROR(INDEX($O$2:$O$29,_xlfn.AGGREGATE(15,6,(ROW($O$2:$O$29)-ROW($O$1))/($O$2:$O$29<>\"\"),ROWS($P$2:P4))),\"\")","v":""}]
["6-ABAETETUBA",null,"Caixa",null,13,"Amazonas","AM",null,null,"Fundo de Aval",null,{"$f":"Empreendimento!B9","v":""},{"$f":"Empreendimento!B25","v":""},null,{"$f":"IFERROR(INDEX($L$2:$L$15,_xlfn.AGGREGATE(15,6,(ROW($L$2:$L$15)-ROW($L$1))/($L$2:$L$15<>\"\"),ROWS($P$2:P5))),\"\")","v":""},null,{"$f":"IFERROR(INDEX($O$2:$O$29,_xlfn.AGGREGATE(15,6,(ROW($O$2:$O$29)-ROW($O$1))/($O$2:$O$29<>\"\"),ROWS($P$2:P5))),\"\")","v":""}]
["7-CAPITÃO POÇO",null,"Diária",null,29,"Bahia","BA",null,null,"Aval de Terceiros",null,{"$f":"Empreendimento!B10","v":""},{"$f":"Empreendimento!B26","v":""},null,{"$f":"IFERROR(INDEX($L$2:$L$15,_xlfn.AGGREGATE(15,6,(ROW($L$2:$L$15)-ROW($L$1))/($L$2:$L$15<>\"\"),ROWS($P$2:P6))),\"\")","v":""},null,{"$f":"IFERROR(INDEX($O$2:$O$29,_xlfn.AGGREGATE(15,6,(ROW($O$2:$O$29)-ROW($O$1))/($O$2:$O$29<>\"\"),ROWS($P$2:P6))),\"\")","v":""}]
["8-CONCEIÇÃO DO ARAGUAIA",null,"Dúzia",null,23,"Ceará","CE",null,null,"Aval Solidário",null,{"$f":"Empreendimento!B11","v":""},{"$f":"Empreendimento!B27","v":""},null,{"$f":"IFERROR(INDEX($L$2:$L$15,_xlfn.AGGREGATE(15,6,(ROW($L$2:$L$15)-ROW($L$1))/($L$2:$L$15<>\"\"),ROWS($P$2:P7))),\"\")","v":""},null,{"$f":"IFERROR(INDEX($O$2:$O$29,_xlfn.AGGREGATE(15,6,(ROW($O$2:$O$29)-ROW($O$1))/($O$2:$O$29<>\"\"),ROWS($P$2:P7))),\"\")","v":""}]
["9-MARACANÃ",null,"Galão",null,53,"Distrito Federal","DF",null,null,"Imoveis - Rurais",null,{"$f":"Empreendimento!B12","v":""},{"$f":"Empreendimento!B28","v":""},null,{"$f":"IFERROR(INDEX($L$2:$L$15,_xlfn.AGGREGATE(15,6,(ROW($L$2:$L$15)-ROW($L$1))/($L$2:$L$15<>\"\"),ROWS($P$2:P8))),\"\")","v":""},null,{"$f":"IFERROR(INDEX($O$2:$O$29,_xlfn.AGGREGATE(15,6,(ROW($O$2:$O$29)-ROW($O$1))/($O$2:$O$29<>\"\"),ROWS($P$2:P8))),\"\")","v":""}]
["11-BELÉM CENTRO",null,"garrafa",null,32,"Espírito Santo","ES",null,null,"Máquinas",null,{"$f":"Empreendimento!B14","v":""},{"$f":"Empreendimento!B30","v":""},null,{"$f":"IFERROR(INDEX($L$2:$L$15,_xlfn.AGGREGATE(15,6,(ROW($L$2:$L$15)-ROW($L$1))/($L$2:$L$15<>\"\"),ROWS($P$2:P9))),\"\")","v":""},null,{"$f":"IFERROR(INDEX($O$2:$O$29,_xlfn.AGGREGATE(15,6,(ROW($O$2:$O$29)-ROW($O$1))/($O$2:$O$29<>\"\"),ROWS($P$2:P9))),\"\")","v":""}]
["12-ÓBIDOS",null,"Hectare",null,52,"Goiás","GO",null,null,"Primeiro Grau - imoveis residenciais",null,{"$f":"Empreendimento!B15","v":""},{"$f":"Empreendimento!B31","v":""},null,{"$f":"IFERROR(INDEX($L$2:$L$15,_xlfn.AGGREGATE(15,6,(ROW($L$2:$L$15)-ROW($L$1))/($L$2:$L$15<>\"\"),ROWS($P$2:P10))),\"\")","v":""},null,{"$f":"IFERROR(INDEX($O$2:$O$29,_xlfn.AGGREGATE(15,6,(ROW($O$2:$O$29)-ROW($O$1))/($O$2:$O$29<>\"\"),ROWS($P$2:P10))),\"\")","v":""}]
["13-MARABÁ",null,"Hectare (lâmina d'água)",null,21,"Maranhão","MA",null,null,"Primeiro Grau - Outros",null,{"$f":"Empreendimento!B16","v":""},{"$f":"Empreendimento!B32","v":""},null,{"$f":"IFERROR(INDEX($L$2:$L$15,_xlfn.AGGREGATE(15,6,(ROW($L$2:$L$15)-ROW($L$1))/($L$2:$L$15<>\"\"),ROWS($P$2:P11))),\"\")","v":""},null,{"$f":"IFERROR(INDEX($O$2:$O$29,_xlfn.AGGREGATE(15,6,(ROW($O$2:$O$29)-ROW($O$1))/($O$2:$O$29<>\"\"),ROWS($P$2:P11))),\"\")","v":""}]
["14-TELÉGRAFO",null,"Hectolitro",null,51,"Mato Grosso","MT",null,null,"Veiculos",null,{"$f":"Empreendimento!B17","v":""},{"$f":"Empreendimento!B33","v":""},null,{"$f":"IFERROR(INDEX($L$2:$L$15,_xlfn.AGGREGATE(15,6,(ROW($L$2:$L$15)-ROW($L$1))/($L$2:$L$15<>\"\"),ROWS($P$2:P12))),\"\")","v":""},null,{"$f":"IFERROR(INDEX($O$2:$O$29,_xlfn.AGGREGATE(15,6,(ROW($O$2:$O$29)-ROW($O$1))/($O$2:$O$29<>\"\"),ROWS($P$2:P12))),\"\")","v":""}]
["15-SENADOR LEMOS",null,"Hora Homem",null,50,"Mato Grosso do Sul","MS",null,null,"Animais",null,{"$f":"Empreendimento!B18","v":""},{"$f":"Empreendimento!B34","v":""},null,{"$f":"IFERROR(INDEX($L$2:$L$15,_xlfn.AGGREGATE(15,6,(ROW($L$2:$L$15)-ROW($L$1))/($L$2:$L$15<>\"\"),ROWS($P$2:P13))),\"\")","v":""},null,{"$f":"IFERROR(INDEX($O$2:$O$29,_xlfn.AGGREGATE(15,6,(ROW($O$2:$O$29)-ROW($O$1))/($O$2:$O$29<>\"\"),ROWS($P$2:P13))),\"\")","v":""}]
["16-TUCURUÍ",null,"Hora Maquina",null,31,"Minas Gerais","MG",null,null,null,null,{"$f":"Empreendimento!B19","v":""},{"$f":"Empreendimento!B35","v":""},null,{"$f":"IFERROR(INDEX($L$2:$L$15,_xlfn.AGGREGATE(15,6,(ROW($L$2:$L$15)-ROW($L$1))/($L$2:$L$15<>\"\"),ROWS($P$2:P14))),\"\")","v":""},null,{"$f":"IFERROR(INDEX($O$2:$O$29,_xlfn.AGGREGATE(15,6,(ROW($O$2:$O$29)-ROW($O$1))/($O$2:$O$29<>\"\"),ROWS($P$2:P14))),\"\")","v":""}]
["18-BRAGANÇA",null,"Hora Trator Esteira",null,15,"Pará","PA",null,null,null,null,{"$f":"Empreendimento!B20","v":""},{"$f":"Empreendimento!B36","v":""},null,{"$f":"IFERROR(INDEX($L$2:$L$15,_xlfn.AGGREGATE(15,6,(ROW($L$2:$L$15)-ROW($L$1))/($L$2:$L$15<>\"\"),ROWS($P$2:P15))),\"\")","v":""},null,{"$f":"IFERROR(INDEX($O$2:$O$29,_xlfn.AGGREGATE(15,6,(ROW($O$2:$O$29)-ROW($O$1))/($O$2:$O$29<>\"\"),ROWS($P$2:P15))),\"\")","v":""}]
["19-BREVES",null,"Hora Trator Pneu",null,25,"Paraíba","PB",null,null,null,null,null,null,null,{"$f":"IFERROR(INDEX($M$2:$M$15,_xlfn.AGGREGATE(15,6,(ROW($M$2:$M$15)-ROW($M$1))/($M$2:$M$15<>\"\"),ROWS($P$2:P2))),\"\")","v":""}]
["20-ANANINDEUA",null,"Kg",null,41,"Paraná","PR",null,null,null,null,null,null,null,{"$f":"IFERROR(INDEX($M$2:$M$15,_xlfn.AGGREGATE(15,6,(ROW($M$2:$M$15)-ROW($M$1))/($M$2:$M$15<>\"\"),ROWS($P$2:P3))),\"\")","v":""}]
["21-ESTRADA NOVA",null,"Lata",null,26,"Pernambuco","PE",null,null,null,null,null,null,null,{"$f":"IFERROR(INDEX($M$2:$M$15,_xlfn.AGGREGATE(15,6,(ROW($M$2:$M$15)-ROW($M$1))/($M$2:$M$15<>\"\"),ROWS($P$2:P4))),\"\")","v":""}]
["22-BARCARENA",null,"Litro",null,22,"Piauí","PI",null,null,null,null,null,null,null,{"$f":"IFERROR(INDEX($M$2:$M$15,_xlfn.AGGREGATE(15,6,(ROW($M$2:$M$15)-ROW($M$1))/($M$2:$M$15<>\"\"),ROWS($P$2:P5))),\"\")","v":""}]
["24-NAZARÉ",null,"Maço",null,33,"Rio de Janeiro","RJ",null,null,null,null,null,null,null,{"$f":"IFERROR(INDEX($M$2:$M$15,_xlfn.AGGREGATE(15,6,(ROW($M$2:$M$15)-ROW($M$1))/($M$2:$M$15<>\"\"),ROWS($P$2:P6))),\"\")","v":""}]
["25-SÃO BRÁS",null,"Metro Cúbico",null,24,"Rio Grande do Norte","RN",null,null,null,null,null,null,null,{"$f":"IFERROR(INDEX($M$2:$M$15,_xlfn.AGGREGATE(15,6,(ROW($M$2:$M$15)-ROW($M$1))/($M$2:$M$15<>\"\"),ROWS($P$2:P7))),\"\")","v":""}]
["26-PALÁCIO",null,"Metro Cúbico de Tanque",null,43,"Rio Grande do Sul (*)","RS",null,null,null,null,null,null,null,{"$f":"IFERROR(INDEX($M$2:$M$15,_xlfn.AGGREGATE(15,6,(ROW($M$2:$M$15)-ROW($M$1))/($M$2:$M$15<>\"\"),ROWS($P$2:P8))),\"\")","v":""}]
["27-ICOARACI",null,"Metro Quadrado",null,11,"Rondônia","RO",null,null,null,null,null,null,null,{"$f":"IFERROR(INDEX($M$2:$M$15,_xlfn.AGGREGATE(15,6,(ROW($M$2:$M$15)-ROW($M$1))/($M$2:$M$15<>\"\"),ROWS($P$2:P9))),\"\")","v":""}]
["28-REDENÇÃO",null,"Mil Aves (Lote)",null,14,"Roraima","RR",null,null,null,null,null,null,null,{"$f":"IFERROR(INDEX($M$2:$M$15,_xlfn.AGGREGATE(15,6,(ROW($M$2:$M$15)-ROW($M$1))/($M$2:$M$15<>\"\"),ROWS($P$2:P10))),\"\")","v":""}]
["29-ALTAMIRA",null,"Mil Cabeças",null,42,"Santa Catarina","SC",null,null,null,null,null,null,null,{"$f":"IFERROR(INDEX($M$2:$M$15,_xlfn.AGGREGATE(15,6,(ROW($M$2:$M$15)-ROW($M$1))/($M$2:$M$15<>\"\"),ROWS($P$2:P11))),\"\")","v":""}]
["30-CAMETÁ",null,"Mil Dúzias",null,35,"São Paulo","SP",null,null,null,null,null,null,null,{"$f":"IFERROR(INDEX($M$2:$M$15,_xlfn.AGGREGATE(15,6,(ROW($M$2:$M$15)-ROW($M$1))/($M$2:$M$15<>\"\"),ROWS($P$2:P12))),\"\")","v":""}]
["31-RONDON DO PARÁ",null,"Mil Litros",null,28,"Sergipe","SE",null,null,null,null,null,null,null,{"$f":"IFERROR(INDEX($M$2:$M$15,_xlfn.AGGREGATE(15,6,(ROW($M$2:$M$15)-ROW($M$1))/($M$2:$M$15<>\"\"),ROWS($P$2:P13))),\"\")","v":""}]
["32-CAPANEMA",null,"Mil Metros Quadrados de Aviário",null,17,"Tocantins","TO",null,null,null,null,null,null,null,{"$f":"IFERROR(INDEX($M$2:$M$15,_xlfn.AGGREGATE(15,6,(ROW($M$2:$M$15)-ROW($M$1))/($M$2:$M$15<>\"\"),ROWS($P$2:P14))),\"\")","v":""}]
["33-ALENQUER",null,"Mil Mudas",null,null,null,null,null,null,null,null,null,null,null,{"$f":"IFERROR(INDEX($M$2:$M$15,_xlfn.AGGREGATE(15,6,(ROW($M$2:$M$15)-ROW($M$1))/($M$2:$M$15<>\"\"),ROWS($P$2:P15))),\"\")","v":""}]
["34-CONCÓRDIA DO PARÁ",null,"Mil Pés"]
["35-ITUPIRANGA",null,"Mil Unidades"]
["36-VISEU",null,"Milimetro"]
["37-SANTA IZABEL DO PARÁ",null,"Outro"]
["38-ITAITUBA",null,"Pacote"]
["39-VIGIA",null,"Pés"]
["40-XINGUARA",null,"Quantidade"]
["41-DOM ELISEU",null,"Quilograma"]
["42-ORIXIMINÁ",null,"Quilograma (Peso Vivo)"]
["43-PARAUAPEBAS",null,"Saca de 60 Quilos"]
["44-BR-ANANINDEUA",null,"Tonelada"]
["45-CIDADE NOVA",null,"Unidade"]
["46-JURUTI",null,"Saco"]
["47-PEDREIRA",null,"Km"]
["48-CANAÃ DOS CARAJÁS"]
["49-PRIVATE"]
["50-TAPAJÓS"]
["51-MARABÁ CIDADE NOVA"]
["52-MARITUBA"]
["53-AUGUSTO MONTENEGRO"]
["54-TAILÂNDIA"]
["55-MOJU"]
["56-BARCARENA CENTRO"]
["57-SANTA BÁRBARA DO PARÁ"]
["58-TUCUMÃ"]
["59-BENEVIDES"]
["60-BOM JESUS DO TOCANTINS"]
["61-RIO MARIA"]
["62-SANTA LUZIA DO PARÁ"]
["63-CURUÇÁ"]
["64-JACUNDÁ"]
["65-SANTA MARIA DO PARÁ"]
["66-TOMÉ AÇÚ - QUATRO BOCAS"]
["67-BONITO"]
["68-FARO"]
["69-ALMEIRIM"]
["70-IGARAPE-MIRI"]
["71-SÃO MIGUEL DO GUAMÁ"]
["72-BAIÃO"]
["73-BREU BRANCO"]
["74-ANAJÁS"]
["75-ACARÁ"]
["76-SÃO GERALDO DO ARAGUAIA"]
["77-MOJUÍ DOS CAMPOS"]
["78-MUANÁ"]
["79-SANTANA DO ARAGUAIA"]
["80-MARAPANIM"]
["81-SÃO CAETANO DE ODIVELAS"]
["82-IGARAPÉ AÇU"]
["83-MOSQUEIRO"]
["84-MEDICILANDIA"]
["85-NOVO PROGRESSO"]
["86-OURILÂNDIA DO NORTE"]
["87-SOURE"]
["88-ITAITUBA CIDADE ALTA"]
["89-LIMOEIRO DO AJURU"]
["90-PONTA DE PEDRAS"]
["91-AFUÁ"]
["92-ELDORADO DO CARAJÁS"]
["93-SALVATERRA"]
["94-SÃO JOÃO DE PIRABAS"]
["95-SALINÓPOLIS"]
["96-GOIANÉSIA DO PARA"]
["97-BUJARU"]
["98-IPIXUNA DO PARÁ"]
["99-MONTE ALEGRE"]
["102-VITÓRIA DO XINGÚ"]
["103-FLORESTA DO ARAGUAIA"]
["104-GARRAFÃO DO NORTE"]
["105-ABEL FIGUEIREDO"]
["106-ÁGUA AZUL DO NORTE"]
["107-ANAPÚ"]
["108-BREJO GRANDE DO ARAGUAIA"]
["109-CURUÁ"]
["110-PRIMAVERA"]
["111-SANTO ANTÔNIO DO TAUÁ"]
["112-SAPUCAIA"]
["113-MELGAÇO"]
["114-CURRALINHO"]
["115-AUGUSTO CORREA"]
["116-CURIONÓPOLIS"]
["117-TERRA SANTA"]
["118-AURORA DO PARÁ"]
["119-CACHOEIRA DO ARARI"]
["120-TRACUATEUA"]
["121-SÃO FÉLIX DO XINGU"]
["122-TRAIRÃO"]
["123-MARABÁ SÃO FÉLIX"]
["124-OEIRAS DO PARÁ"]
["125-SENADOR JOSÉ PORFÍRIO"]
["126-PORTO DE MOZ"]
["127-CUMARU DO NORTE"]
["128-PAU D'ARCO"]
["129-MOCAJUBA"]
["130-PALESTINA DO PARÁ"]
["131-JACAREACANGA"]
["132-RURÓPOLIS"]
["133-CACHOEIRA DO PIRIÁ"]
["134-PACAJÁ"]
["135-PIÇARRA"]
["136-ULIANÓPOLIS"]
["137-BANNACH"]
["138-PRAINHA"]
["139-COLARES"]
["140-MAGALHÃES BARATA"]
["141-NOVA IPIXUNA"]
["142-CASA DE TÁBUA"]
["143-NOVA TIMBOTEUA"]
["144-BRASIL NOVO"]
["145-BAGRE"]
["146-INHANGAPI"]
["147-IRITUIA"]
["148-OURÉM"]
["149-SÃO DOMINGOS DO ARAGUAIA"]
["150-SANTARÉM NOVO"]
["151-QUATIPURU"]
["152-SÃO JOÃO DO ARAGUAIA"]
["153-TERRA ALTA "]
["154-CASTANHAL JADERLÂNDIA"]
["155-SÃO FRANCISCO DO PARÁ"]
["156-SÃO SEBASTIÃO DA BOA VISTA"]
["157-SANTA CRUZ DO ARARI"]
["158-URUARÁ"]
["159-SÃO DOMINGOS DO CAPIM"]
["160-MÃE DO RIO "]
["161-BELTERRA"]
["162-PEIXE BOI"]

{"sheet":"Empreendimento","index":3,"n_rows":36,"n_cols":4,"rows_kept":36,"cut":false,"hidden":false,"merged":[[20,0,20,3],[28,0,28,3],[2,0,3,0],[2,1,3,1],[2,2,3,2],[2,3,3,3],[4,0,4,3],[12,0,12,3]]}
[]
["5. Empreendimento financiado"]
["Especificação dos empreedimentos financiados","Codigo do empreendimento","Unidade","Quantidade"]
[]
["Investimento - Agricola"]
[null,{"$f":"IFERROR(VLOOKUP(A6,Produto!$A$253:$B$386,2,),\"\")","v":""}]
[null,{"$f":"IFERROR(VLOOKUP(A7,Produto!$A$253:$B$386,2,),\"\")","v":""}]
[null,{"$f":"IFERROR(VLOOKUP(A8,Produto!$A$253:$B$386,2,),\"\")","v":""}]
[null,{"$f":"IFERROR(VLOOKUP(A9,Produto!$A$253:$B$386,2,),\"\")","v":""}]
[null,{"$f":"IFERROR(VLOOKUP(A10,Produto!$A$253:$B$386,2,),\"\")","v":""}]
[null,{"$f":"IFERROR(VLOOKUP(A11,Produto!$A$253:$B$386,2,),\"\")","v":""}]
[null,{"$f":"IFERROR(VLOOKUP(A12,Produto!$A$253:$B$386,2,),\"\")","v":""}]
["Investimento - Pecuário"]
[null,{"$f":"IFERROR(VLOOKUP(Empreendimento!A14,Produto!$A$387:$B$500,2,TRUE),\"\")","v":""}]
[null,{"$f":"IFERROR(VLOOKUP(Empreendimento!A15,Produto!$A$387:$B$500,2,TRUE),\"\")","v":""}]
[null,{"$f":"IFERROR(VLOOKUP(Empreendimento!A16,Produto!$A$387:$B$500,2,TRUE),\"\")","v":""}]
[null,{"$f":"IFERROR(VLOOKUP(Empreendimento!A17,Produto!$A$387:$B$500,2,TRUE),\"\")","v":""}]
[null,{"$f":"IFERROR(VLOOKUP(Empreendimento!A18,Produto!$A$387:$B$500,2,TRUE),\"\")","v":""}]
[null,{"$f":"IFERROR(VLOOKUP(Empreendimento!A19,Produto!$A$387:$B$500,2,TRUE),\"\")","v":""}]
[null,{"$f":"IFERROR(VLOOKUP(Empreendimento!A20,Produto!$A$387:$B$500,2,TRUE),\"\")","v":""}]
["Custeio - Agricola"]
[null,{"$f":"IFERROR(VLOOKUP(Empreendimento!A22,Produto!$A$2:$B$203,2,TRUE),\"\")","v":""}]
[null,{"$f":"IFERROR(VLOOKUP(Empreendimento!A23,Produto!$A$2:$B$203,2,TRUE),\"\")","v":""}]
[null,{"$f":"IFERROR(VLOOKUP(Empreendimento!A24,Produto!$A$2:$B$203,2,TRUE),\"\")","v":""}]
[null,{"$f":"IFERROR(VLOOKUP(Empreendimento!A25,Produto!$A$2:$B$203,2,TRUE),\"\")","v":""}]
[null,{"$f":"IFERROR(VLOOKUP(Empreendimento!A26,Produto!$A$2:$B$203,2,TRUE),\"\")","v":""}]
[null,{"$f":"IFERROR(VLOOKUP(Empreendimento!A27,Produto!$A$2:$B$203,2,TRUE),\"\")","v":""}]
[null,{"$f":"IFERROR(VLOOKUP(Empreendimento!A28,Produto!$A$2:$B$203,2,TRUE),\"\")","v":""}]
["Custeio - Pecuario"]
[null,{"$f":"IFERROR(VLOOKUP(Empreendimento!A30,Produto!$A$204:$B$252,2,TRUE),\"\")","v":""}]
[null,{"$f":"IFERROR(VLOOKUP(Empreendimento!A31,Produto!$A$204:$B$252,2,TRUE),\"\")","v":""}]
[null,{"$f":"IFERROR(VLOOKUP(Empreendimento!A32,Produto!$A$204:$B$252,2,TRUE),\"\")","v":""}]
[null,{"$f":"IFERROR(VLOOKUP(Empreendimento!A33,Produto!$A$204:$B$252,2,TRUE),\"\")","v":""}]
[null,{"$f":"IFERROR(VLOOKUP(Empreendimento!A34,Produto!$A$204:$B$252,2,TRUE),\"\")","v":""}]
[null,{"$f":"IFERROR(VLOOKUP(Empreendimento!A35,Produto!$A$204:$B$252,2,TRUE),\"\")","v":""}]
[null,{"$f":"IFERROR(VLOOKUP(Empreendimento!A36,Produto!$A$204:$B$252,2,TRUE),\"\")","v":""}]

{"sheet":"Produto","index":4,"n_rows":500,"n_cols":2,"rows_kept":500,"cut":false,"hidden":true,"merged":[]}
["Item","Codigo"]
["Extrativismo De Espécies Nativas - Açaí - Não Se Aplica - Fruticultura / Olericultura",12020160000042]
["Extrativismo De Espécies Nativas - Castanha-Do-Brasil - Não Se Aplica - Ano Civil / Ano De Exploração",12022080000002]
["Extrativismo De Espécies Nativas - Coco - Babaçu - Ano Civil / Ano De Exploração",12022560052002]
["Extrativismo De Espécies Nativas - Coco - Macaúba - Ano Civil / Ano De Exploração",12022560200002]
["Extrativismo De Espécies Nativas - Coco-Da-Baia - Não Se Aplica - Ano Civil / Ano De Exploração",12022620000002]
["Extrativismo De Espécies Nativas - Dendê - Não Se Aplica - Ano Civil / Ano De Exploração",12023140000002]
["Extrativismo De Espécies Nativas - Piaçaba (Piaçava) - Não Se Aplica - Ano Civil / Ano De Exploração",12025900000002]
["Extrativismo De Espécies Nativas - Seringueira - Borracha Natural - Ano Civil / Ano De Exploração",12026640063002]
["Extrativismo De Espécies Nativas - Urucum - Não Se Aplica - Ano Civil / Ano De Exploração",12027240000002]
["Florestamento E Reflorestamento - Colheita, Destoca E Limpeza De Floresta Plantada - Não Se Aplica - Ano Civil / Ano De Exploração",12119500000408]
["Florestamento E Reflorestamento - Florestamento - Tratos Culturais - Não Se Aplica - Ano Civil / Ano De Exploração",12113630000002]
["Florestamento E Reflorestamento - Florestamento - Tratos Culturais - Não Se Aplica - Irrigadas",12113630000052]
["Florestamento E Reflorestamento - Sansão-Do-Campo - Tratos Culturais - Ano Civil / Ano De Exploração",12116550451002]
["Lavoura - Abacate - Não Se Aplica - Fruticultura / Olericultura",12010020000043]
["Lavoura - Abacaxi - Mudas - Fruticultura / Olericultura",12010040213042]
["Lavoura - Abacaxi - Não Se Aplica - Fruticultura / Olericultura",12010040000043]
["Lavoura - Abobrinha - Não Se Aplica - Fruticultura / Olericultura",12010100000043]
["Lavoura - Açaí - Não Se Aplica - Fruticultura / Olericultura",12010160000043]
["Lavoura - Acerola - Não Se Aplica - Fruticultura / Olericultura",12010320000043]
["Lavoura - Alface - Mudas - Fruticultura / Olericultura",12010520213042]
["Lavoura - Alface - Não Se Aplica - Fruticultura / Olericultura",12010520000043]
["Lavoura - Alho - Não Se Aplica - Fruticultura / Olericultura",12010580000043]
["Lavoura - Alho - Nobre - Fruticultura / Olericultura",12010580216043]
["Lavoura - Alho Poró - Não Se Aplica - Fruticultura / Olericultura",12010590000042]
["Lavoura - Amendoim - Não Se Aplica - Safra De Verão (1ª Safra)",12010640000012]
["Lavoura - Andiroba - Não Se Aplica - Fruticultura / Olericultura",12010680000042]
["Lavoura - Aroeira (Pimenta-Rosa) - Não Se Aplica - Fruticultura / Olericultura",12015930000042]
["Lavoura - Arroz - Não Se Aplica - Safra De Verão (1ª Safra)",12010900000013]
["Lavoura - Arroz - Semente - Safra De Verão (1ª Safra)",12010900370011]
["Lavoura - Aveia - Feno - Safra De Inverno (3ª Safra)",12011000414032]
["Lavoura - Aveia - Não Se Aplica - Safra De Inverno (3ª Safra)",12011000000033]
["Lavoura - Banana - Cavendish (Nanica) - Fruticultura / Olericultura",12011160502041]
["Lavoura - Banana - Maçã - Fruticultura / Olericultura",12011160501041]
["Lavoura - Banana - Não Se Aplica - Ano Civil / Ano De Exploração",12011160000001]
["Lavoura - Banana - Não Se Aplica - Fruticultura / Olericultura",12011160000043]
["Lavoura - Banana - Prata - Fruticultura / Olericultura",12011160500041]
["Lavoura - Cacau - Não Se Aplica - Fruticultura / Olericultura",12011420000842]
["Lavoura - Cacau - Saf - Fruticultura / Olericultura",12011420505041]
["Lavoura - Caju - Castanha - Fruticultura / Olericultura",12011780089043]
["Lavoura - Caju - Fruto - Fruticultura / Olericultura",12011780169043]
["Lavoura - Cana-De-Açucar - Açucar E Álcool - Safra De Verão (1ª Safra)",12011840021011]
["Lavoura - Cana-De-Açucar - Álcool Para Fins Carburantes - Safra De Verão (1ª Safra)",12011840026012]
["Lavoura - Cana-De-Açucar - Mudas - Safra De Verão (1ª Safra)",12011840213012]
["Lavoura - Cana-De-Açucar - Não Se Aplica - Safra De Verão (1ª Safra)",12011840000013]
["Lavoura - Castanha-Do-Brasil - Não Se Aplica - Fruticultura / Olericultura",12012080000042]
["Lavoura - Cebolinha Verde - Não Se Aplica - Fruticultura / Olericultura",12012220000042]
["Lavoura - Cevada - Não Se Aplica - Safra De Inverno (3ª Safra)",12012320000032]
["Lavoura - Chicoria - Não Se Aplica - Fruticultura / Olericultura",12012380000042]
["Lavoura - Coco - Não Se Aplica - Fruticultura / Olericultura",12012560000042]
["Lavoura - Coco-Da-Baia - Não Se Aplica - Fruticultura / Olericultura",12012620000042]
["Lavoura - Coentro - Não Se Aplica - Fruticultura / Olericultura",12012660000042]
["Lavoura - Cogumelo - Não Se Aplica - Fruticultura / Olericultura",12012680000043]
["Lavoura - Couve - Não Se Aplica - Fruticultura / Olericultura",12012800000042]
["Lavoura - Couve-Flor - Não Se Aplica - Fruticultura / Olericultura",12012820000043]
["Lavoura - Cupuaçu - Não Se Aplica - Fruticultura / Olericultura",12012980000042]
["Lavoura - Curauá - Não Se Aplica - Fruticultura / Olericultura",12013080000042]
["Lavoura - Dendê - Não Se Aplica - Fruticultura / Olericultura",12013140000042]
["Lavoura - Feijão - Caupi (Macaçar) - Fruticultura / Olericultura",12013560093043]
["Lavoura - Feijão - Não Se Aplica - Safra De Inverno (3ª Safra)",12013560000033]
["Lavoura - Feijão - Não Se Aplica - Safra De Verão (1ª Safra)",12013560000811]
["Lavoura - Feijão - Não Se Aplica - Safrinha (2ª Safra)",12013560000022]
["Lavoura - Feijão - Semente - Safra De Verão (1ª Safra)",12013560370011]
["Lavoura - Flores - Amarilis - Fruticultura / Olericultura",12013600030042]
["Lavoura - Flores - Camomila - Safra De Inverno (3ª Safra)",12013600425433]
["Lavoura - Flores - Flores Diversas - Fruticultura / Olericultura",12013600995042]
["Lavoura - Flores - Gypsophi - Fruticultura / Olericultura",12013600175042]
["Lavoura - Flores - Lavanda - Fruticultura / Olericultura",12013600449042]
["Lavoura - Flores - Lírio - Fruticultura / Olericultura",12013600196042]
["Lavoura - Flores - Lírio Da Paz - Fruticultura / Olericultura",12013600666042]
["Lavoura - Flores - Orquídea - Fruticultura / Olericultura",12013600227043]
["Lavoura - Flores - Rosa - Fruticultura / Olericultura",12013600261042]
["Lavoura - Florestamento E Reflorestamento - Mudas Diversas - Ano Civil / Ano De Exploração",12013620214002]
["Lavoura - Frutas Diversas N. E. - Mudas - Fruticultura / Olericultura",12013660213042]
["Lavoura - Fumo - Não Se Aplica - Safra De Verão (1ª Safra)",12013680000013]
["Lavoura - Gengibre - Não Se Aplica - Fruticultura / Olericultura",12013720000043]
["Lavoura - Girassol - Não Se Aplica - Safra De Verão (1ª Safra)",12013760000011]
["Lavoura - Girassol - Não Se Aplica - Safrinha (2ª Safra)",12013760000021]
["Lavoura - Goiaba - Não Se Aplica - Fruticultura / Olericultura",12013780000043]
["Lavoura - Graviola - Não Se Aplica - Fruticultura / Olericultura",12013860000043]
["Lavoura - Graviola - Não Se Aplica - Irrigadas",12013860000053]
["Lavoura - Hortaliças - Não É Aplicável - Fruticultura / Olericultura",12013920990042]
["Lavoura - Hortaliças - Não É Aplicável - Irrigadas",12013920990052]
["Lavoura - Hortaliças - Não Se Aplica - Fruticultura / Olericultura",12013920000042]
["Lavoura - Hortaliças - Não Se Aplica - Irrigadas",12013920000052]
["Lavoura - Hortelã - Não Se Aplica - Fruticultura / Olericultura",12013940000042]
["Lavoura - Hortelã - Não Se Aplica - Irrigadas",12013940000052]
["Lavoura - Laranja - Kinkan, Xinxam - Fruticultura / Olericultura",12014140355042]
["Lavoura - Laranja - Mudas - Irrigadas",12014140213053]
["Lavoura - Laranja - Não Se Aplica - Fruticultura / Olericultura",12014140000043]
["Lavoura - Laranja - Não Se Aplica - Irrigadas",12014140000051]
["Lavoura - Limão - Não Se Aplica - Fruticultura / Olericultura",12014460000043]
["Lavoura - Limão - Não Se Aplica - Irrigadas",12014460000053]
["Lavoura - Madeira - Ipê - Ano Civil / Ano De Exploração",12014660448002]
["Lavoura - Madeira - Resinas, Essências E Produtos Análogos - Ano Civil / Ano De Exploração",12014660259003]
["Lavoura - Madeira - Resinas, Essências E Produtos Análogos - Irrigadas",12014660259053]
["Lavoura - Mamão - Não Se Aplica - Fruticultura / Olericultura",12014700000842]
["Lavoura - Mamão - Não Se Aplica - Irrigadas",12014700000853]
["Lavoura - Mamona - Não Se Aplica - Irrigadas",12014720000052]
["Lavoura - Mamona - Não Se Aplica - Safra De Verão (1ª Safra)",12014720000011]
["Lavoura - Mandioca (Aipim, Macaxeira) - Álcool Para Fins Carburantes - Safra De Verão (1ª Safra)",12014760026012]
["Lavoura - Mandioca (Aipim, Macaxeira) - De Mesa - Irrigadas",12014760371052]
["Lavoura - Mandioca (Aipim, Macaxeira) - De Mesa - Safra De Verão (1ª Safra)",12014760371011]
["Lavoura - Mandioca (Aipim, Macaxeira) - Não Se Aplica - Irrigadas",12014760000052]
["Lavoura - Mandioca (Aipim, Macaxeira) - Não Se Aplica - Safra De Verão (1ª Safra)",12014760000013]
["Lavoura - Mandioquinha (Batata: Baroa, Salsa, Aipo) - Não Se Aplica - Fruticultura / Olericultura",12014780000043]
["Lavoura - Mandioquinha (Batata: Baroa, Salsa, Aipo) - Não Se Aplica - Irrigadas",12014780000053]
["Lavoura - Manga - Não É Aplicável - Irrigadas",12014800990052]
["Lavoura - Manga - Não Se Aplica - Fruticultura / Olericultura",12014800000043]
["Lavoura - Manga - Não Se Aplica - Irrigadas",12014800000053]
["Lavoura - Mangostão - Não Se Aplica - Fruticultura / Olericultura",12014815000042]
["Lavoura - Mangostão - Não Se Aplica - Irrigadas",12014815000052]
["Lavoura - Manjericão - Não Se Aplica - Fruticultura / Olericultura",12014820000042]
["Lavoura - Manjericão - Não Se Aplica - Irrigadas",12014820000052]
["Lavoura - Maracujá - Mudas - Irrigadas",12014920213052]
["Lavoura - Maracujá - Não Se Aplica - Fruticultura / Olericultura",12014920000043]
["Lavoura - Maracujá - Não Se Aplica - Irrigadas",12014920000053]
["Lavoura - Maxixe - Não Se Aplica - Fruticultura / Olericultura",12014960000042]
["Lavoura - Maxixe - Não Se Aplica - Irrigadas",12014960000053]
["Lavoura - Melancia - Clima Ameno - Fruticultura / Olericultura",12015000485041]
["Lavoura - Melancia - Clima Ameno - Irrigadas",12015000485051]
["Lavoura - Melancia - Clima Quente - Fruticultura / Olericultura",12015000480041]
["Lavoura - Melancia - Clima Quente - Irrigadas",12015000480051]
["Lavoura - Melancia - Não Se Aplica - Fruticultura / Olericultura",12015000000043]
["Lavoura - Melancia - Não Se Aplica - Irrigadas",12015000000053]
["Lavoura - Melão - Não Se Aplica - Fruticultura / Olericultura",12015020000043]
["Lavoura - Melão - Não Se Aplica - Irrigadas",12015020000053]
["Lavoura - Milheto - Não Se Aplica - Safrinha (2ª Safra)",12015060000022]
["Lavoura - Milho - Não É Aplicável - Irrigadas",12015080990051]
["Lavoura - Milho - Não Se Aplica - Irrigadas",12015080000053]
["Lavoura - Milho - Não Se Aplica - Safra De Verão (1ª Safra)",12015080000011]
["Lavoura - Milho - Não Se Aplica - Safrinha (2ª Safra)",12015080000023]
["Lavoura - Milho - Pipoca - Irrigadas",12015080244052]
["Lavoura - Milho - Pipoca - Safra De Verão (1ª Safra)",12015080244012]
["Lavoura - Milho - Semente - Safra De Verão (1ª Safra)",12015080370011]
["Lavoura - Milho Silagem - Não Se Aplica - Safra De Verão (1ª Safra)",12015081000011]
["Lavoura - Murici - Não Se Aplica - Fruticultura / Olericultura",12015200000042]
["Lavoura - Palma - Forrageira - Ano Civil / Ano De Exploração",12015640330408]
["Lavoura - Palma - Não É Aplicável - Irrigadas",12015640990052]
["Lavoura - Palma - Não Se Aplica - Fruticultura / Olericultura",12015640000042]
["Lavoura - Palmeira - Real - Fruticultura / Olericultura",12015660255043]
["Lavoura - Palmeira - Real - Irrigadas",12015660255052]
["Lavoura - Pastagem - Feno E Silagem - Ano Civil / Ano De Exploração",12015760162002]
["Lavoura - Pastagem - Feno E Silagem - Irrigadas",12015760162053]
["Lavoura - Pepino - Não Se Aplica - Fruticultura / Olericultura",12015800000043]
["Lavoura - Pepino - Não Se Aplica - Irrigadas",12015800000053]
["Lavoura - Pimenta - Hortícula - Fruticultura / Olericultura",12015920177043]
["Lavoura - Pimenta - Hortícula - Irrigadas",12015920177053]
["Lavoura - Pimenta-Do-Reino - Não Se Aplica - Fruticultura / Olericultura",12015940000043]
["Lavoura - Pimenta-Do-Reino - Não Se Aplica - Irrigadas",12015940000053]
["Lavoura - Pimentão - Não É Aplicável - Irrigadas",12015960990052]
["Lavoura - Pimentão - Não Se Aplica - Fruticultura / Olericultura",12015960000043]
["Lavoura - Pimentão - Não Se Aplica - Irrigadas",12015960000053]
["Lavoura - Pitaya - Não Se Aplica - Fruticultura / Olericultura",12016010000042]
["Lavoura - Pitaya - Não Se Aplica - Irrigadas",12016010000052]
["Lavoura - Plantas Ornamentais - Mudas - Fruticultura / Olericultura",12016040213042]
["Lavoura - Plantas Ornamentais - Não Se Aplica - Fruticultura / Olericultura",12016040000042]
["Lavoura - Plantas Ornamentais - Não Se Aplica - Irrigadas",12016040000053]
["Lavoura - Plantas Ornamentais - Não Se Aplica - Safra De Verão (1ª Safra)",12016040000013]
["Lavoura - Plantas Ornamentais - Ornamentais, Aromáticas, Essencias Florestais - Fruticultura / Olericultura",12016040464042]
["Lavoura - Plantas Ornamentais - Ornamentais, Aromáticas, Essencias Florestais - Irrigadas",12016040464052]
["Lavoura - Plantas Para Infusão - Não Se Aplica - Fruticultura / Olericultura",12016045000042]
["Lavoura - Plantas Para Infusão - Não Se Aplica - Irrigadas",12016045000052]
["Lavoura - Pupunha - Não Se Aplica - Fruticultura / Olericultura",12016260000043]
["Lavoura - Pupunha - Não Se Aplica - Irrigadas",12016260000051]
["Lavoura - Quiabo - Não Se Aplica - Fruticultura / Olericultura",12016300000043]
["Lavoura - Quiabo - Não Se Aplica - Irrigadas",12016300000052]
["Lavoura - Rúcula - Não Se Aplica - Fruticultura / Olericultura",12016480000042]
["Lavoura - Rúcula - Não Se Aplica - Irrigadas",12016480000052]
["Lavoura - Rúcula - Semente - Fruticultura / Olericultura",12016480370042]
["Lavoura - Rúcula - Semente - Irrigadas",12016480370052]
["Lavoura - Salsa - Não Se Aplica - Fruticultura / Olericultura",12016560000043]
["Lavoura - Salsa - Não Se Aplica - Irrigadas",12016560000053]
["Lavoura - Seringueira - Borracha Natural - Fruticultura / Olericultura",12016640063043]
["Lavoura - Seringueira - Borracha Natural - Irrigadas",12016640063052]
["Lavoura - Seringueira - Mudas - Fruticultura / Olericultura",12016640213043]
["Lavoura - Seringueira - Mudas - Irrigadas",12016640213052]
["Lavoura - Seringueira - Mudas - Safra De Verão (1ª Safra)",12016640213012]
["Lavoura - Soja - Não Se Aplica - Irrigadas",12016720000052]
["Lavoura - Soja - Não Se Aplica - Safra De Verão (1ª Safra)",12016720000013]
["Lavoura - Sorgo - Forrageira - Safra De Verão (1ª Safra)",12016740330011]
["Lavoura - Sorgo - Forrageira - Safrinha (2ª Safra)",12016740330021]
["Lavoura - Sorgo - Granífero - Safra De Verão (1ª Safra)",12016740174011]
["Lavoura - Sorgo - Granífero - Safrinha (2ª Safra)",12016740174021]
["Lavoura - Sorgo - Não Se Aplica - Irrigadas",12016740000052]
["Lavoura - Sorgo - Não Se Aplica - Safra De Verão (1ª Safra)",12016740000013]
["Lavoura - Sorgo - Não Se Aplica - Safrinha (2ª Safra)",12016740000023]
["Lavoura - Tangerina - Mudas - Fruticultura / Olericultura",12016780213043]
["Lavoura - Tangerina - Mudas - Irrigadas",12016780213053]
["Lavoura - Tangerina - Não Se Aplica - Fruticultura / Olericultura",12016780000043]
["Lavoura - Tangerina - Não Se Aplica - Irrigadas",12016780000051]
["Lavoura - Taperebá - Não Se Aplica - Fruticultura / Olericultura",12016900000042]
["Lavoura - Tomate - Cereja - Fruticultura / Olericultura",12016940432042]
["Lavoura - Tomate - Cereja - Irrigadas",12016940432053]
["Lavoura - Tomate - Estaqueado - Fruticultura / Olericultura",12016940148043]
["Lavoura - Tomate - Estaqueado - Irrigadas",12016940148053]
["Lavoura - Tomate - Não É Aplicável - Irrigadas",12016940990052]
["Lavoura - Tomate - Não Se Aplica - Fruticultura / Olericultura",12016940000842]
["Lavoura - Tomate - Não Se Aplica - Irrigadas",12016940000852]
["Lavoura - Tomate - Rasteiro - Fruticultura / Olericultura",12016940254043]
["Lavoura - Tomate - Rasteiro - Irrigadas",12016940254052]
["Lavoura - Trigo - Duplo Propósito - Safra De Inverno (3ª Safra)",12017100453031]
["Pastagem - Pastagem - Não Se Aplica - Ano Civil / Ano De Exploração",12105760000408]
["Apicultura - Abelha - Geléia Real - Ano Civil / Ano De Exploração",22550060460408]
["Apicultura - Abelha - Mel - Ano Civil / Ano De Exploração",22550060205408]
["Aquicultura - Alevinos - Criação De Peixes Em Tanques-Redes E/Ou Sistema Fluxo Continuo (Raceway) - Ano Civil / Ano De Exploração",22607470342408]
["Aquicultura - Armação Para Barco De Pesca - Manutenção/Aquisição - Ano Civil / Ano De Exploração",22607460333002]
["Aquicultura - Camarão E/Ou Lagosta - Não É Aplicável - Ano Civil / Ano De Exploração",22601790990408]
["Aquicultura - Camarão E/Ou Lagosta - Não Se Aplica - Ano Civil / Ano De Exploração",22601790000408]
["Aquicultura - Carcinicultura (Cultivo De Camarão E Lagosta) - Manutenção/Criação - Ano Civil / Ano De Exploração",22607495336002]
["Aquicultura - Carcinicultura (Cultivo De Camarão E Lagosta) - Produção De Larvas E Crias - Ano Civil / Ano De Exploração",22607495340002]
["Aquicultura - Peixe - Alevinos - Ano Civil / Ano De Exploração",22605830028408]
["Aquicultura - Peixe - Alevinoss - Ano Civil / Ano De Exploração",22605830888408]
["Aquicultura - Peixe - Não É Aplicável - Ano Civil / Ano De Exploração",22605830990408]
["Aquicultura - Peixe - Não Se Aplica - Ano Civil / Ano De Exploração",22605830000408]
["Aquicultura - Produtos Aquicolas (Armazenamento, Acondicionamento E Preservação, Inclusive Seguro, Impostos Etc) ",22607480334002]
["Aquicultura - Produtos Aquicolas (Armazenamento, Acondicionamento E Preservação, Inclusive Seguro, Impostos Etc) - Manutenção/Criação ",22607480336002]
["Aquicultura - Ranicultura (Cultivo De Rã) - Manutenção/Criação - Ano Civil / Ano De Exploração",22607520336002]
["Aquisição E Manutenção De Animais - Aves - Não Se Aplica - Ano Civil / Ano De Exploração",22311020000408]
["Aquisição E Manutenção De Animais - Bovinos - Não Se Aplica - Ano Civil / Ano De Exploração",22311300000408]
["Aquisição E Manutenção De Animais - Búfalos (Bubalinos) - Não Se Aplica - Ano Civil / Ano De Exploração",22311400000408]
["Aquisição E Manutenção De Animais - Ovinos - Não Se Aplica - Ano Civil / Ano De Exploração",22315580000408]
["Aquisição E Manutenção De Animais - Suínos - Não Se Aplica - Ano Civil / Ano De Exploração",22316760000408]
["Avicultura - Aves Exceto Galináceos - Carne - Ano Civil / Ano De Exploração",22393835074408]
["Avicultura - Aves Exceto Galináceos - Ovos De Pequeno Porte (Produção De) - Ano Civil / Ano De Exploração",22393835344408]
["Avicultura - Galináceos - Carne - Ano Civil / Ano De Exploração",22393830074408]
["Avicultura - Galináceos - Matrizes De Postura (Produção De) - Ano Civil / Ano De Exploração",22393830347408]
["Avicultura - Galináceos - Ovos - Ano Civil / Ano De Exploração",22393830406408]
["Avicultura - Galináceos - Ovos Férteis (Produção De) - Ano Civil / Ano De Exploração",22393830345408]
["Avicultura - Galináceos - Pintinho - Ano Civil / Ano De Exploração",22393830422408]
["Bovinocultura - Bovinos - Sêmen - Ano Civil / Ano De Exploração",22371300277008]
["Bubalinocultura - Búfalos (Bubalinos) - Carne - Ano Civil / Ano De Exploração",22631400074408]
["Bubalinocultura - Búfalos (Bubalinos) - Carnes - Ano Civil / Ano De Exploração",22631400951408]
["Bubalinocultura - Búfalos (Bubalinos) - Leite - Ano Civil / Ano De Exploração",22631400190408]
["Bubalinocultura - Búfalos (Bubalinos) - Leites - Ano Civil / Ano De Exploração",22631400952408]
["Minhocultura - Minhoca - Não Se Aplica - Ano Civil / Ano De Exploração",22565100000408]
["Ovinocultura - Ovinos - Carne - Ano Civil / Ano De Exploração",22775580074408]
["Ovinocultura - Ovinos - Carne E Lã - Ano Civil / Ano De Exploração",22775580083408]
["Ovinocultura - Ovinos - Carnes - Ano Civil / Ano De Exploração",22775580951408]
["Ovinocultura - Ovinos - Lâ - Ano Civil / Ano De Exploração",22775580455408]
["Ovinocultura - Ovinos - Leite - Ano Civil / Ano De Exploração",22775580190408]
["Ovinocultura - Ovinos - Leites - Ano Civil / Ano De Exploração",22775580952408]
["Pesca - Armação Para Barco De Pesca - Manutenção/Aquisição - Ano Civil / Ano De Exploração",22507460333408]
["Pesca - Pescado - Captura (Aquisição De Cordas, Redes, Anzois, Boias, Mão-De Obra, Seguros, Impostos, Fretes, Carretos, Conservação De Embarcações E Equipamentos ",22505860071408]
["Pesca - Pescado (Armazenamento, Acondicionamento E Preservacao, Inclusive Seguro, Impostos, Fretes Etc) - Beneficiamento E Industrialização - Ano Civil / Ano De Exploração",22505865334002]
["Pesca - Pescado (Armazenamento, Acondicionamento E Preservacao, Inclusive Seguro, Impostos, Fretes Etc) - Manutenção/Criação - Ano Civil / Ano De Exploração",22505865336408]
["Pesca - Petrechos Para Pesca (Anzóis, Iscas, Cordas, Bóias, Combustivel, Redes, Mão-De-Obra Etc) - Aquisição - Ano Civil / Ano De Exploração",22507615332408]
["Serviços Profissionais/Técnicos - Vacinas, Sais Minerais E Medicamentos - Não Se Aplica - Ano Civil / Ano De Exploração",22907300000408]
["Suinocultura - Suínos - Carne - Ano Civil / Ano De Exploração",22386760074408]
["Suinocultura - Suínos - Carnes - Ano Civil / Ano De Exploração",22386760951408]
["Suinocultura - Suínos - Leitão - Ano Civil / Ano De Exploração",22386760189408]
["Suinocultura - Suínos - Sêmen - Ano Civil / Ano De Exploração",22386760277408]
["Aquicultura - Embarcação Pequena (Até 20 A/B) - Aquisição - Ano Civil / Ano De Exploração",13607535332002]
["Aquisição De Ativos Operacionais - Agroindústria - Caseira ",13700440087408]
["Aquisição De Ativos Operacionais - Agroindústria - Instalação Completa Para Beneficiamento ",13700440183408]
["Aquisição De Ativos Operacionais - Armazém, Depósito, Silo, Galpão, Paiol, Estufa E Instalações Congêneres ",13703180110408]
["Aquisição De Ativos Operacionais - Biodigestor, Esterqueira, Tanques De Oxidação Biológica E Tratamento De Água E Esgoto ",13707695000408]
["Aquisição De Veículos - Aquisição De Empilhadeira(S)/Tombadora(S) - Não Se Aplica - Ano Civil / Ano De Exploração",13150855000408]
["Aquisição De Veículos - Caminhões - Não Se Aplica - Ano Civil / Ano De Exploração",13151800000002]
["Aquisição De Veículos - Camionetas - Não Se Aplica - Ano Civil / Ano De Exploração",13151820000002]
["Aquisição De Veículos - Carretas, Carroças E Vagões De Carga, Forrageiros E Demais - Não Se Aplica - Ano Civil / Ano De Exploração",13152040000002]
["Aquisição De Veículos - Motocicletas E Motonetas - Carga, Transporte E Turismo Rural - Ano Civil / Ano De Exploração",13155150356002]
["Aquisição De Veículos - Ônibus, Micro-Ônibus E Vans - Carga, Transporte E Turismo Rural - Ano Civil / Ano De Exploração",13155310356002]
["Aquisição De Veículos - Triciclos E Quadriclos - Carga, Transporte E Turismo Rural - Ano Civil / Ano De Exploração",13157230356002]
["Aquisição De Veículos - Veículo Aéreo Não Tripulado (Drone) - Não Se Aplica - Ano Civil / Ano De Exploração",13157330000408]
["Florestamento E Reflorestamento - Açaí - Não Se Aplica - Ano Civil / Ano De Exploração",13110160000408]
["Florestamento E Reflorestamento - Paricá - Não Se Aplica - Ano Civil / Ano De Exploração",13115720000408]
["Formação De Culturas Perenes - Abacate - Não Se Aplica - Ano Civil / Ano De Exploração",13120020000002]
["Formação De Culturas Perenes - Abacaxi - Não Se Aplica - Ano Civil / Ano De Exploração",13120040000002]
["Formação De Culturas Perenes - Açaí - Não Se Aplica - Ano Civil / Ano De Exploração",13120160000002]
["Formação De Culturas Perenes - Acerola - Não Se Aplica - Ano Civil / Ano De Exploração",13120320000002]
["Formação De Culturas Perenes - Andiroba - Não Se Aplica - Ano Civil / Ano De Exploração",13120680000002]
["Formação De Culturas Perenes - Banana - Cavendish (Nanica) - Fruticultura / Olericultura",13121160502041]
["Formação De Culturas Perenes - Banana - Cavendish (Nanica) - Irrigadas",13121160502051]
["Formação De Culturas Perenes - Banana - Maçã - Fruticultura / Olericultura",13121160501041]
["Formação De Culturas Perenes - Banana - Maçã - Irrigadas",13121160501051]
["Formação De Culturas Perenes - Banana - Não Se Aplica - Ano Civil / Ano De Exploração",13121160000002]
["Formação De Culturas Perenes - Banana - Não Se Aplica - Irrigadas",13121160000051]
["Formação De Culturas Perenes - Banana - Prata - Fruticultura / Olericultura",13121160500041]
["Formação De Culturas Perenes - Banana - Prata - Irrigadas",13121160500051]
["Formação De Culturas Perenes - Cacau - Não Se Aplica - Ano Civil / Ano De Exploração",13121420000002]
["Formação De Culturas Perenes - Cacau - Não Se Aplica - Fruticultura / Olericultura",13121420000041]
["Formação De Culturas Perenes - Cacau - Não Se Aplica - Irrigadas",13121420000051]
["Formação De Culturas Perenes - Cacau - Saf - Fruticultura / Olericultura",13121420505041]
["Formação De Culturas Perenes - Cacau - Saf - Irrigadas",13121420505051]
["Formação De Culturas Perenes - Caju - Não Se Aplica - Ano Civil / Ano De Exploração",13121780000002]
["Formação De Culturas Perenes - Cana-De-Açucar - Álcool Para Fins Carburantes - Ano Civil / Ano De Exploração",13121840026002]
["Formação De Culturas Perenes - Cana-De-Açucar - Fundação - Ano Civil / Ano De Exploração",13121840171002]
["Formação De Culturas Perenes - Cana-De-Açucar - Renovação - Ano Civil / Ano De Exploração",13121840257002]
["Formação De Culturas Perenes - Castanha-Do-Brasil - Não Se Aplica - Ano Civil / Ano De Exploração",13122080000002]
["Formação De Culturas Perenes - Coco - Babaçu - Fruticultura / Olericultura",13122560052042]
["Formação De Culturas Perenes - Coco-Da-Baia - Não Se Aplica - Ano Civil / Ano De Exploração",13122620000002]
["Formação De Culturas Perenes - Cupuaçu - Não Se Aplica - Ano Civil / Ano De Exploração",13122980000002]
["Formação De Culturas Perenes - Curauá - Não Se Aplica - Ano Civil / Ano De Exploração",13123080000002]
["Formação De Culturas Perenes - Dendê - Não Se Aplica - Ano Civil / Ano De Exploração",13123140000002]
["Formação De Culturas Perenes - Flores - Lavanda - Fruticultura / Olericultura",13123600449042]
["Formação De Culturas Perenes - Flores - Não Se Aplica - Ano Civil / Ano De Exploração",13123600000002]
["Formação De Culturas Perenes - Florestamento E Reflorestamento - Eucalipto Grandis - Ano Civil / Ano De Exploração",13123620152002]
["Formação De Culturas Perenes - Florestamento E Reflorestamento - Recuperação Ambiental - Ano Civil / Ano De Exploração",13123620452408]
["Formação De Culturas Perenes - Goiaba - Não Se Aplica - Ano Civil / Ano De Exploração",13123780000002]
["Formação De Culturas Perenes - Graviola - Não Se Aplica - Ano Civil / Ano De Exploração",13123860000002]
["Formação De Culturas Perenes - Laranja - Não Se Aplica - Ano Civil / Ano De Exploração",13124140000002]
["Formação De Culturas Perenes - Laranja - Não Se Aplica - Fruticultura / Olericultura",13124140000842]
["Formação De Culturas Perenes - Limão - Não Se Aplica - Ano Civil / Ano De Exploração",13124460000002]
["Formação De Culturas Perenes - Limão - Não Se Aplica - Fruticultura / Olericultura",13124460000041]
["Formação De Culturas Perenes - Madeira - Acácia Negra - Ano Civil / Ano De Exploração",13124660019002]
["Formação De Culturas Perenes - Madeira - Mogno - Ano Civil / Ano De Exploração",13124660994002]
["Formação De Culturas Perenes - Madeira - Pinus Oocarpa - Ano Civil / Ano De Exploração",13124660242002]
["Formação De Culturas Perenes - Madeira - Teca - Ano Civil / Ano De Exploração",13124660285002]
["Formação De Culturas Perenes - Mamão - Não Se Aplica - Ano Civil / Ano De Exploração",13124700000002]
["Formação De Culturas Perenes - Mamona - Não Se Aplica - Ano Civil / Ano De Exploração",13124720000002]
["Formação De Culturas Perenes - Mamona - Não Se Aplica - Irrigadas",13124720000052]
["Formação De Culturas Perenes - Mandioca (Aipim, Macaxeira) - Álcool Para Fins Carburantes - Ano Civil / Ano De Exploração",13124760026002]
["Formação De Culturas Perenes - Mandioca (Aipim, Macaxeira) - Não Se Aplica - Ano Civil / Ano De Exploração",13124760000002]
["Formação De Culturas Perenes - Manga - Não Se Aplica - Ano Civil / Ano De Exploração",13124800000002]
["Formação De Culturas Perenes - Maracujá - Não Se Aplica - Ano Civil / Ano De Exploração",13124920000002]
["Formação De Culturas Perenes - Murici - Não Se Aplica - Fruticultura / Olericultura",13125200000042]
["Formação De Culturas Perenes - Palma - Forrageira - Ano Civil / Ano De Exploração",13125640330408]
["Formação De Culturas Perenes - Palmeira - Real - Ano Civil / Ano De Exploração",13125660255408]
["Formação De Culturas Perenes - Pastagem - Feno E Silagem - Ano Civil / Ano De Exploração",13125760162408]
["Formação De Culturas Perenes - Pimenta - Hortícula - Ano Civil / Ano De Exploração",13125920177002]
["Formação De Culturas Perenes - Pimenta-Do-Reino - Não Se Aplica - Ano Civil / Ano De Exploração",13125940000002]
["Formação De Culturas Perenes - Pitaya - Não Se Aplica - Ano Civil / Ano De Exploração",13126010000408]
["Formação De Culturas Perenes - Pupunha - Não Se Aplica - Ano Civil / Ano De Exploração",13126260000002]
["Formação De Culturas Perenes - Sansão-Do-Campo - Não Se Aplica - Ano Civil / Ano De Exploração",13126550000408]
["Formação De Culturas Perenes - Seringueira - Borracha Natural - Ano Civil / Ano De Exploração",13126640063002]
["Formação De Culturas Perenes - Tangerina - Não Se Aplica - Ano Civil / Ano De Exploração",13126780000002]
["Formação De Culturas Perenes - Tangerina - Não Se Aplica - Fruticultura / Olericultura",13126780000041]
["Formação De Culturas Perenes - Taperebá - Não Se Aplica - Ano Civil / Ano De Exploração",13126900000002]
["Formação De Culturas Perenes - Toranja - Não Se Aplica - Fruticultura / Olericultura",13126960000041]
["Formação De Culturas Perenes - Urucum - Não Se Aplica - Ano Civil / Ano De Exploração",13127240000002]
["Máquinas, Equipamentos, Materiais E Utensílios - Aquisição De Aquecedores, Geradores, Incineradores, Compressores, Ventiladores E Apar. De Ar Condic. ",13140847000408]
["Máquinas, Equipamentos, Materiais E Utensílios - Aquisição De Caixas D'Água, Lonas, Toldos, Campânulas - Não Se Aplica - Ano Civil / Ano De Exploração",13147715000408]
["Máquinas, Equipamentos, Materiais E Utensílios - Aquisição De Destiladores, Filtros, Depuradores E Dosadores - Não Se Aplica - Ano Civil / Ano De Exploração",13140851000408]
["Máquinas, Equipamentos, Materiais E Utensílios - Aquisição De Equipamentos Para Moldagem, Tornos, Moinhos E Prensa - Não Se Aplica - Ano Civil / Ano De Exploração",13140848000408]
["Máquinas, Equipamentos, Materiais E Utensílios - Aquisição De Ferramenta Portátil Manual Para Tratos Culturais - Não Se Aplica - Ano Civil / Ano De Exploração",13140858000408]
["Máquinas, Equipamentos, Materiais E Utensílios - Aquisição De Ferramentas E Tubos - Não Se Aplica - Ano Civil / Ano De Exploração",13140852000408]
["Máquinas, Equipamentos, Materiais E Utensílios - Aquisição De Maquina(S)/Equipamento(S) Para Extração/Fabricação - Não Se Aplica - Ano Civil / Ano De Exploração",13140854000408]
["Máquinas, Equipamentos, Materiais E Utensílios - Aquisição De Material De Estocagem/Transporte/Sacaria/Caixas - Não Se Aplica - Ano Civil / Ano De Exploração",13140853000408]
["Máquinas, Equipamentos, Materiais E Utensílios - Aquisição De Motores E Elevadores - Não Se Aplica - Ano Civil / Ano De Exploração",13140849000408]
["Máquinas, Equipamentos, Materiais E Utensílios - Base Para Balança - Construção Ou Reforma - Ano Civil / Ano De Exploração",13141175108408]
["Máquinas, Equipamentos, Materiais E Utensílios - Cercas, Aramados, Telhas, Telas Para Sombreamento E Coberturas De Solo - Não É Aplicável - Ano Civil / Ano De Exploração",13140850990408]
["Máquinas, Equipamentos, Materiais E Utensílios - Colheitadeiras, Colhedeiras E Arrancadeiras - Ancinhos  Mecânicos, Ceifeiras-Atadeiras, Segadeiras, Trilhos, Trilhadeiras, Plataforma P/ Colheita ",13142700042002]
["Máquinas, Equipamentos, Materiais E Utensílios - Colheitadeiras, Colhedeiras E Arrancadeiras - Automotriz Importado - Ano Civil / Ano De Exploração",13142700050002]
["Máquinas, Equipamentos, Materiais E Utensílios - Colheitadeiras, Colhedeiras E Arrancadeiras - Automotriz Nacional - Ano Civil / Ano De Exploração",13142700051002]
["Máquinas, Equipamentos, Materiais E Utensílios - Colheitadeiras, Colhedeiras E Arrancadeiras - Importado - Ano Civil / Ano De Exploração",13142700178002]
["Máquinas, Equipamentos, Materiais E Utensílios - Colheitadeiras, Colhedeiras E Arrancadeiras - Nacional - Ano Civil / Ano De Exploração",13142700215002]
["Máquinas, Equipamentos, Materiais E Utensílios - Construção/Recuperação Barragem/Tanque, Sistemas Captação De Água - Não Se Aplica - Ano Civil / Ano De Exploração",13147705000408]
["Máquinas, Equipamentos, Materiais E Utensílios - Cultivador - Motorizado (Micro-Trator) - Ano Civil / Ano De Exploração",13142920212002]
["Máquinas, Equipamentos, Materiais E Utensílios - Despolpador - Não Se Aplica - Ano Civil / Ano De Exploração",13143240000002]
["Máquinas, Equipamentos, Materiais E Utensílios - Eletrificação Rural - Abrange A Instalação De Força E Luz Elétrica Em Benfeitorias - Ano Civil / Ano De Exploração",13143280014408]
["Máquinas, Equipamentos, Materiais E Utensílios - Equipamentos E Utensilios Para Agricultura De Precisão - Não Se Aplica - Ano Civil / Ano De Exploração",13140857000408]
["Máquinas, Equipamentos, Materiais E Utensílios - Estufas/Viveiros (Ilumin. Artificial, Mudas, Sementes, Sacos, Talagarças, Bandejas, Vasos) - Não Se Aplica - Ano Civil / Ano De Exploração",13143490000408]
["Máquinas, Equipamentos, Materiais E Utensílios - Hidroponia/Fazenda Vertical (Alvenaria, Madeira, Aço, Etc) - Não É Aplicável - Ano Civil / Ano De Exploração",13143550990408]
["Máquinas, Equipamentos, Materiais E Utensílios - Implantação De Tecnologias De Energia Renovável, Ambiental E Pequenas Aplicações Hidroenergéticas - Não Se Aplica - Ano Civil / Ano De Exploração",13147694000408]
["Máquinas, Equipamentos, Materiais E Utensílios - Instalação/Montagem/Transporte De Equipamento(S) - Não Se Aplica - Ano Civil / Ano De Exploração",13147730000408]
["Máquinas, Equipamentos, Materiais E Utensílios - Instalações Para Industrialização E Beneficiamento - Abrange A Compra De Maquinaria Necessária Ao Seu Funcionamento,  Balanças, Prensas, ",13144000012408]
["Máquinas, Equipamentos, Materiais E Utensílios - Irrigação - Construção Ou Reforma De Açudes, Abertura De Canais De Irrigação, Compra De Aparelhagem Necessária Aos Serviços De Irrigação ",13144020109408]
["Máquinas, Equipamentos, Materiais E Utensílios - Irrigação/Lixiviação (Gotejador, Aspersor, Nebulizador, Exaustor, Ventilador, Mangueiras, Canais Et) - Cultivo Protegido - Fruticultura / Olericultura",13143330352042]
["Máquinas, Equipamentos, Materiais E Utensílios - Lavador - Não Se Aplica - Ano Civil / Ano De Exploração",13144260000002]
["Máquinas, Equipamentos, Materiais E Utensílios - Máquinas E Implementos - Adaptação Do Solo  (Destocadores, Destorroadores, Niveladores, Terraceadores, Retroescavadeira,Etc) - Ano Civil / Ano De Exploração",13144860022002]
["Máquinas, Equipamentos, Materiais E Utensílios - Máquinas E Implementos - Correção Do Solo E Combate As  Pragas (Distribuidores De Calcarios E De Fertilizantes, Pulverizadores, Vaporizadores, Insufladores, Nebulizadores Etc)",13144860111002]
["Máquinas, Equipamentos, Materiais E Utensílios - Máquinas E Implementos - Cultivação Do Solo (Enxadas Rotativas, Plantadeiras, Semeadeiras Etc) - Ano Civil / Ano De Exploração",13144860116002]
["Máquinas, Equipamentos, Materiais E Utensílios - Máquinas E Implementos - Para Empacotar E Embalar Produtos - Ano Civil / Ano De Exploração",13144860233002]
["Máquinas, Equipamentos, Materiais E Utensílios - Máquinas E Implementos - Preparação Do Solo (Arados De  Tração Animal, Aivecas, Arados De Tração Mecânica, Grades De Disco) - Ano Civil / Ano De Exploração",13144860247002]
["Máquinas, Equipamentos, Materiais E Utensílios - Máquinas, Aparelhos E Instrumentos Para Processamento E Beneficiamento  De  Produtos - Engenhos, Alambiques, Trituradores, Vasilhames, Balanças Etc ",13144900145408]
["Máquinas, Equipamentos, Materiais E Utensílios - Materiais Industrializados - Aquisição De Máquinas E Equipamentos - Ano Civil / Ano De Exploração",13144567765008]
["Máquinas, Equipamentos, Materiais E Utensílios - Perfuração Poço, Cacimba/Cisterna - Não Se Aplica - Ano Civil / Ano De Exploração",13147706000408]
["Máquinas, Equipamentos, Materiais E Utensílios - Reboques, Semireboques, Caçambas E Cabines - Adaptação Em Veículos Agrícolas (Caminhões, Colheitadeiras, Tratores) - Ano Civil / Ano De Exploração",13146410350002]
["Máquinas, Equipamentos, Materiais E Utensílios - Reformas  De  Máquinas, Aparelhos, Equipamentos  E Veículos, Compra De Pecas E Acessrios - Não Se Aplica - Ano Civil / Ano De Exploração",13146420000002]
["Máquinas, Equipamentos, Materiais E Utensílios - Secador - Não Se Aplica - Ano Civil / Ano De Exploração",13146580000002]
["Máquinas, Equipamentos, Materiais E Utensílios - Tenda, Galpão, Túnel Plástico (Abrange Lonas, Filmes, Longarinas, Estacas E Mat. Sustentação) - Não É Aplicável - Ano Civil / Ano De Exploração",13147690990408]
["Máquinas, Equipamentos, Materiais E Utensílios - Terreiros - Não Se Aplica - Ano Civil / Ano De Exploração",13146920000408]
["Máquinas, Equipamentos, Materiais E Utensílios - Trator - Importado - Ano Civil / Ano De Exploração",13147080178002]
["Máquinas, Equipamentos, Materiais E Utensílios - Trator - Nacional - Ano Civil / Ano De Exploração",13147080215002]
["Melhoramento Das Explorações - Câmara Fria Para Armazenamento De Frutas - Construção Ou Reforma, Abrangendo A Compra De Aparelhagem Necessaria A Silagem, Expurgo E Defesa Dos Produtos Guardados ",13133170110002]
["Pastagem - Pastagem - Formação - Ano Civil / Ano De Exploração",13105760168408]
["Pastagem - Pastagem - Recuperação De Pastagem Degradada - Ano Civil / Ano De Exploração",13105760989408]
["Serviços Profissionais/Técnicos - Adubação Intensiva Do Solo - Não Se Aplica - Ano Civil / Ano De Exploração",13900360000408]
["Serviços Profissionais/Técnicos - Adubação Orgânica/Mineral, Calagem, Substratos Inertes(Pedra, Areia, Vermiculita, Silte, Argila Etc) - Não Se Aplica - Ano Civil / Ano De Exploração",13906750000408]
["Serviços Profissionais/Técnicos - Correção Intensiva Do Solo - Não Se Aplica - Ano Civil / Ano De Exploração",13902740000408]
["Serviços Profissionais/Técnicos - Desbravamento De Glebas Rurais - Abrange A Abertura De Estradas Internas, Desmatamento E Destocamento - Ano Civil / Ano De Exploração",13903200006408]
["Serviços Profissionais/Técnicos - Lago Artificial, Tanque, Barreiros, Canais, Reserv.Água Potavel - Não Se Aplica - Ano Civil / Ano De Exploração",13906050000408]
["Serviços Profissionais/Técnicos - Proteção Do Solo - Terraplanagem, Drenagem E Plantio De Espécies Vegetais Para Fixação Do Solo E Sombreamento - Ano Civil / Ano De Exploração",13906240217408]
["Serviços Profissionais/Técnicos - Residências Rurais - Construção Ou Reforma - Ano Civil / Ano De Exploração",13906460108408]
["Serviços Profissionais/Técnicos - Terraços, Porteiras, Mata-Burros, Currais, Cochos, Cercas - Construção Ou Reforma - Ano Civil / Ano De Exploração",13907710108408]
["Aquicultura - Aerador - Aquisição - Ano Civil / Ano De Exploração",23607465332002]
["Aquicultura - Alimentador De Peixe - Máquinas E Equipamentos - Ano Civil / Ano De Exploração",23607475337002]
["Aquicultura - Caminhões Frigoríficos - Aquisição - Ano Civil / Ano De Exploração",23607490332002]
["Aquicultura - Depósito Para Rações - Não Se Aplica - Ano Civil / Ano De Exploração",23607675000008]
["Aquicultura - Descamadora De Peixe - Aquisição - Ano Civil / Ano De Exploração",23607525332002]
["Aquicultura - Descascador De Camarão E Lagosta - Aquisição - Ano Civil / Ano De Exploração",23607530332002]
["Aquicultura - Despolpador De Pescado - Aquisição - Ano Civil / Ano De Exploração",23607680332002]
["Aquicultura - Embarcação Pequena (Até 20 A/B) - Aquisição - Ano Civil / Ano De Exploração",23607535332002]
["Aquicultura - Esteira - Aquisição - Ano Civil / Ano De Exploração",23607550332002]
["Aquicultura - Estufa - Aquisição - Ano Civil / Ano De Exploração",23607555332002]
["Aquicultura - Frigorífico - Melhoramento Das Explorações - Ano Civil / Ano De Exploração",23607565338002]
["Aquicultura - Matrizes E Reprodutores - Aquisição - Ano Civil / Ano De Exploração",23607580332002]
["Aquicultura - Mesa Para Filetagem - Aquisição - Ano Civil / Ano De Exploração",23607590332002]
["Aquicultura - Motobomba - Aquisição - Ano Civil / Ano De Exploração",23607600332002]
["Aquicultura - Tanques Escavados - Não Se Aplica - Ano Civil / Ano De Exploração",23607625000002]
["Aquicultura - Tanques Redes - Melhoramento Das Explorações - Ano Civil / Ano De Exploração",23607630338002]
["Aquicultura - Unidade De Beneficiamento Ou Processamento - Melhoramento Das Explorações - Ano Civil / Ano De Exploração",23607635338002]
["Aquisição De Animais - Animais Silvestres - Pacas, Capivaras, Queixadas, Catitus, Jacarés, Antas, Emas, Coelhos Etc, Para  Contemplação E Abate - Ano Civil / Ano De Exploração",23270800231002]
["Aquisição De Animais - Apicultura - Abrange Compra De Abelhas, Isoladamente Ou Em Colmeia - Ano Civil / Ano De Exploração",23270820015002]
["Aquisição De Animais - Avicultura - Abrange A  Compra De Aves E Ovos - Ano Civil / Ano De Exploração",23271080005002]
["Aquisição De Animais - Bovinos - Carne - Matrizes (Vacas E Crias Fêmeas Para Povoamento) - Ano Civil / Ano De Exploração",23271300078002]
["Aquisição De Animais - Bovinos - Carne - Reprodutores (Touros E  Tourinhos Para Povoamento) - Ano Civil / Ano De Exploração",23271300079002]
["Aquisição De Animais - Bovinos - Leite - Matrizes  (Vacas E Crias Fêmeas Para Povoamento) - Ano Civil / Ano De Exploração",23271300193002]
["Aquisição De Animais - Bovinos - Leite - Reprodutores (Touros E  Tourinhos Para Povoamento) - Ano Civil / Ano De Exploração",23271300194002]
["Aquisição De Animais - Búfalos (Bubalinos) - Não Se Aplica - Ano Civil / Ano De Exploração",23271400000002]
["Aquisição De Animais - Ovinos - Aquisição Ou Importação De Reprodutores De Alta Linhagem - Ano Civil / Ano De Exploração",23275580047002]
["Aquisição De Animais - Ovinos - Carne - Ano Civil / Ano De Exploração",23275580074002]
["Aquisição De Animais - Ovinos - Carne E Lã - Ano Civil / Ano De Exploração",23275580083002]
["Aquisição De Animais - Ovinos - Leite - Ano Civil / Ano De Exploração",23275580190002]
["Aquisição De Animais - Ovinos - Não Se Aplica - Ano Civil / Ano De Exploração",23275580000002]
["Aquisição De Animais - Ovinos - Produção De Lã - Ano Civil / Ano De Exploração",23275580187002]
["Aquisição De Animais - Sericicultura - Não Se Aplica - Ano Civil / Ano De Exploração",23276620000002]
["Aquisição De Animais - Suínos - Aquisição Ou Importação De Reprodutores De Alta Linhagem - Ano Civil / Ano De Exploração",23276760047002]
["Aquisição De Animais - Suínos - Não Se Aplica - Ano Civil / Ano De Exploração",23276760000002]
["Aquisição De Ativos Operacionais - Agroindústria - Instalação Completa De Agroindústria Para Beneficiamento ",23700440182408]
["Aquisição De Ativos Operacionais - Armazém, Depósito, Silo, Galpão, Paiol, Estufa E Instalações Congêneres - Construção Ou Reforma",23703180110408]
["Aquisição De Ativos Operacionais - Biodigestor, Esterqueira, Tanques De Oxidação Biológica E Tratamento De Água E Esgoto - Construção Ou Reforma - Ano Civil / Ano De Exploração",23707695108408]
["Aquisição De Veículos - Aquisição De Empilhadeira(S)/Tombadora(S) - Não Se Aplica - Ano Civil / Ano De Exploração",23150855000408]
["Aquisição De Veículos - Caminhões - Não Se Aplica - Ano Civil / Ano De Exploração",23151800000002]
["Aquisição De Veículos - Camionetas - Não Se Aplica - Ano Civil / Ano De Exploração",23151820000002]
["Aquisição De Veículos - Carretas, Carroças E Vagões De Carga, Forrageiros E Demais - Não Se Aplica - Ano Civil / Ano De Exploração",23152040000002]
["Aquisição De Veículos - Motocicletas E Motonetas - Carga, Transporte E Turismo Rural - Ano Civil / Ano De Exploração",23155150356002]
["Aquisição De Veículos - Ônibus, Micro-Ônibus E Vans - Carga, Transporte E Turismo Rural - Ano Civil / Ano De Exploração",23155310356002]
["Aquisição De Veículos - Triciclos E Quadriclos - Carga, Transporte E Turismo Rural - Ano Civil / Ano De Exploração",23157230356002]
["Aquisição De Veículos - Veículo Aéreo Não Tripulado (Drone) - Não Se Aplica - Ano Civil / Ano De Exploração",23157330000408]
["Máquinas, Equipamentos, Materiais E Utensílios - Aquecedor De Água (Boiler) - Não Se Aplica - Ano Civil / Ano De Exploração",23149876000408]
["Máquinas, Equipamentos, Materiais E Utensílios - Aquisição De Aquecedores, Geradores, Incineradores, Compressores, Ventiladores E Apar. De Ar Condic. - Não Se Aplica - Ano Civil / Ano De Exploração",23140847000408]
["Máquinas, Equipamentos, Materiais E Utensílios - Aquisição De Caixas D'Água, Lonas, Toldos, Campânulas - Não Se Aplica - Ano Civil / Ano De Exploração",23147715000408]
["Máquinas, Equipamentos, Materiais E Utensílios - Aquisição De Destiladores, Filtros, Depuradores E Dosadores - Não Se Aplica - Ano Civil / Ano De Exploração",23140851000408]
["Máquinas, Equipamentos, Materiais E Utensílios - Aquisição De Equipamentos Para Moldagem, Tornos, Moinhos E Prensa - Não Se Aplica - Ano Civil / Ano De Exploração",23140848000408]
["Máquinas, Equipamentos, Materiais E Utensílios - Aquisição De Ferramentas E Tubos - Não Se Aplica - Ano Civil / Ano De Exploração",23140852000408]
["Máquinas, Equipamentos, Materiais E Utensílios - Aquisição De Maquina(S)/Equipamento(S) Para Extração/Fabricação - Não Se Aplica - Ano Civil / Ano De Exploração",23140854000408]
["Máquinas, Equipamentos, Materiais E Utensílios - Aquisição De Material De Estocagem/Transporte/Sacaria/Caixas - Não Se Aplica - Ano Civil / Ano De Exploração",23140853000408]
["Máquinas, Equipamentos, Materiais E Utensílios - Aquisição De Motores E Elevadores - Não Se Aplica - Ano Civil / Ano De Exploração",23140849000408]
["Máquinas, Equipamentos, Materiais E Utensílios - Aquisição De Sistemas Para Rastreabilidade De Bovinos E Bubalinos - Não Se Aplica - Ano Civil / Ano De Exploração",23147720000408]
["Máquinas, Equipamentos, Materiais E Utensílios - Balança Para Animais - Aquisição - Ano Civil / Ano De Exploração",23143456332408]
["Máquinas, Equipamentos, Materiais E Utensílios - Base Para Balança - Construção Ou Reforma - Ano Civil / Ano De Exploração",23141175108408]
["Máquinas, Equipamentos, Materiais E Utensílios - Caixas De Abelhas, Favos, Centrifugas P/ Extração De Mel, Fumegadores - Não Se Aplica - Ano Civil / Ano De Exploração",23145678000008]
["Máquinas, Equipamentos, Materiais E Utensílios - Colheitadeiras, Colhedeiras E Arrancadeiras - Automotriz Importado - Ano Civil / Ano De Exploração",23142700050002]
["Máquinas, Equipamentos, Materiais E Utensílios - Colheitadeiras, Colhedeiras E Arrancadeiras - Automotriz Nacional - Ano Civil / Ano De Exploração",23142700051002]
["Máquinas, Equipamentos, Materiais E Utensílios - Colheitadeiras, Colhedeiras E Arrancadeiras - Importado - Ano Civil / Ano De Exploração",23142700178002]
["Máquinas, Equipamentos, Materiais E Utensílios - Colheitadeiras, Colhedeiras E Arrancadeiras - Nacional - Ano Civil / Ano De Exploração",23142700215002]
["Máquinas, Equipamentos, Materiais E Utensílios - Confinamento De Bovinos Free Stall\"\" - Construção Ou Reforma - Ano Civil / Ano De Exploração",23145555108408]
["Máquinas, Equipamentos, Materiais E Utensílios - Construção/Recuperação Barragem/Tanque, Sistemas Captação De Água - Não Se Aplica - Ano Civil / Ano De Exploração",23147705000408]
["Máquinas, Equipamentos, Materiais E Utensílios - Cultivadores Motorizados - Micro-Tratores - Ano Civil / Ano De Exploração",23142940206002]
["Máquinas, Equipamentos, Materiais E Utensílios - Eletrificação Rural - Abrange A Instalação De Força E Luz Elétrica Em Benfeitorias - Ano Civil / Ano De Exploração",23143280014408]
["Máquinas, Equipamentos, Materiais E Utensílios - Granjas Avícolas - Abrange A Compra De Equipamento Necessário A Sua Adequada Função - Ano Civil / Ano De Exploração",23143820009408]
["Máquinas, Equipamentos, Materiais E Utensílios - Granjas De Suínos - Abrange A Compra De Equipamento Necessário A Sua Adequada Função - Ano Civil / Ano De Exploração",23143821009408]
["Máquinas, Equipamentos, Materiais E Utensílios - Implantação De Tecnologias De Energia Renovável, Ambiental E Pequenas Aplicações Hidroenergéticas - Não Se Aplica - Ano Civil / Ano De Exploração",23147694000408]
["Máquinas, Equipamentos, Materiais E Utensílios - Inseminação Artificial - Abrange A Construção Ou Reforma De Instalações Adequadas",23143980013408]
["Máquinas, Equipamentos, Materiais E Utensílios - Instalação/Montagem/Transporte De Equipamento(S) - Não Se Aplica - Ano Civil / Ano De Exploração",23147730000408]
["Máquinas, Equipamentos, Materiais E Utensílios - Instalações Para Industrialização E Beneficiamento - Abrange A Compra De Maquinaria Necessária Ao Seu Funcionamento,  Balanças, Prensas",23144000012408]
["Máquinas, Equipamentos, Materiais E Utensílios - Irrigação - Construção Ou Reforma De Açudes, Abertura De Canais De Irrigação, Compra De Aparelhagem Necessária Aos Serviços De Irrigação ",23144020109408]
["Máquinas, Equipamentos, Materiais E Utensílios - Lavador - Não Se Aplica - Ano Civil / Ano De Exploração",23144260000408]
["Máquinas, Equipamentos, Materiais E Utensílios - Máquinas E Implementos - Adaptação Do Solo  (Destocadores, Destorroadores, Niveladores, Terraceadores, Retroescavadeira,Etc) - Ano Civil / Ano De Exploração",23144860022002]
["Máquinas, Equipamentos, Materiais E Utensílios - Máquinas E Implementos - Colheita (Ancinho Mecânico, Ceifeira Atadeira, Segadeira, Trilhadeira, Enfardadeira, Enleirador) - Ano Civil / Ano De Exploração",23144860101002]
["Máquinas, Equipamentos, Materiais E Utensílios - Máquinas E Implementos - Correção Do Solo E Combate Às Pragas, Ceifeiras, Ceifeiras-Atadeiras, Segadeiras, Trilhos, Trilhadeiras Etc - Ano Civil / Ano De Exploração",23144860112002]
["Máquinas, Equipamentos, Materiais E Utensílios - Máquinas E Implementos - Cultivação Do Solo (Enxadas Rotativas, Plantadeiras, Semeadeiras Etc) - Ano Civil / Ano De Exploração",23144860116002]
["Máquinas, Equipamentos, Materiais E Utensílios - Máquinas E Implementos - Empacotar E Embalar Produtos - Ano Civil / Ano De Exploração",23144860143002]
["Máquinas, Equipamentos, Materiais E Utensílios - Máquinas E Implementos - Preparação Do Solo (Arados De  Tração Animal, Aivecas, Arados De Tração Mecânica, Grades De Disco) - Ano Civil / Ano De Exploração",23144860247002]
["Máquinas, Equipamentos, Materiais E Utensílios - Máquinas, Aparelhos E Instrumentos - Ordenhadores, Tosquiadores, Batedeiras De Leite,  Desnatadeiras, Vasilhames, Resfriadores De Leite, Abatedouros",23144880225002]
["Máquinas, Equipamentos, Materiais E Utensílios - Máquinas, Aparelhos E Instrumentos Para Processamento E Beneficiamento  De  Produtos - Engenhos, Alambiques, Trituradores, Vasilhames, Balanças Etc",23144900145408]
["Máquinas, Equipamentos, Materiais E Utensílios - Materiais Industrializados - Aquisição De Máquinas E Equipamentos - Ano Civil / Ano De Exploração",23144567765008]
["Máquinas, Equipamentos, Materiais E Utensílios - Perfuração Poço, Cacimba/Cisterna - Não Se Aplica - Ano Civil / Ano De Exploração",23147706000408]
["Máquinas, Equipamentos, Materiais E Utensílios - Raspador - De Esterco - Ano Civil / Ano De Exploração",23146789789408]
["Máquinas, Equipamentos, Materiais E Utensílios - Reboques, Semireboques, Caçambas E Cabines - Adaptação Em Veículos Agrícolas (Caminhões, Colheitadeiras, Tratores) - Ano Civil / Ano De Exploração",23146410350002]
["Máquinas, Equipamentos, Materiais E Utensílios - Reformas  De  Máquinas, Aparelhos, Equipamentos  E Veículos, Compra De Pecas E Acessrios - Não Se Aplica - Ano Civil / Ano De Exploração",23146420000002]
["Máquinas, Equipamentos, Materiais E Utensílios - Sistemas De Captação, Retenção E Aproveitamento De Água - Reservatórios De Água, Bebedouros E Banheiros - Ano Civil / Ano De Exploração",23145540957408]
["Máquinas, Equipamentos, Materiais E Utensílios - Trator - Importado - Ano Civil / Ano De Exploração",23147080178002]
["Máquinas, Equipamentos, Materiais E Utensílios - Trator - Nacional - Ano Civil / Ano De Exploração",23147080215002]
["Pesca - Caminhões Frigoríficos - Aquisição - Ano Civil / Ano De Exploração",23507490332002]
["Pesca - Classificador De Pescado - Aquisição - Ano Civil / Ano De Exploração",23507655332002]
["Pesca - Cozedor De Pescado - Melhoramento Das Explorações - Ano Civil / Ano De Exploração",23507660338002]
["Pesca - Descamadora De Peixe - Aquisição - Ano Civil / Ano De Exploração",23507525332002]
["Pesca - Descascador De Camarão E Lagosta - Aquisição - Ano Civil / Ano De Exploração",23507530332002]
["Pesca - Embarcação Grande (A Partir De 100 A/B) - Aquisição - Ano Civil / Ano De Exploração",23507545332002]
["Pesca - Embarcação Média (Acima De 20 E Abaixo De 100 A/B) - Aquisição - Ano Civil / Ano De Exploração",23507540332002]
["Pesca - Embarcação Pequena (Até 20 A/B) - Aquisição - Ano Civil / Ano De Exploração",23507535332002]
["Pesca - Esteira - Aquisição - Ano Civil / Ano De Exploração",23507550332002]
["Pesca - Frigorífico - Melhoramento Das Explorações - Ano Civil / Ano De Exploração",23507565338002]
["Pesca - Mesa Para Descabeçamento De Pescado - Aquisição - Ano Civil / Ano De Exploração",23507670332002]
["Pesca - Mesa Para Filetagem - Aquisição - Ano Civil / Ano De Exploração",23507590332002]
["Pesca - Mesa Para Retirada De Pele, Escama E Carcaça De Pescado - Aquisição - Ano Civil / Ano De Exploração",23507665332002]
["Pesca - Pescado - Captura (Compreendem Os Bens De Capital Fixo E Semifixo Necessários À Exploração Da Pesca) - Ano Civil / Ano De Exploração",23505860072002]
["Pesca - Separador De Resíduos - Aquisição - Ano Civil / Ano De Exploração",23507650332002]
["Pesca - Unidade De Beneficiamento Ou Processamento - Melhoramento Das Explorações - Ano Civil / Ano De Exploração",23507635338002]
["Serviços Profissionais/Técnicos - Adubação Intensiva Do Solo - Não Se Aplica - Ano Civil / Ano De Exploração",23900360000408]
["Serviços Profissionais/Técnicos - Correção Intensiva Do Solo - Não Se Aplica - Ano Civil / Ano De Exploração",23902740000408]
["Serviços Profissionais/Técnicos - Desbravamento De Glebas Rurais - Abrange A Abertura De Estradas Internas, Desmatamento E Destocamento - Ano Civil / Ano De Exploração",23903200006408]
["Serviços Profissionais/Técnicos - Instalações Para Aves, Suínos E Coelhos - Construção Ou Reforma - Ano Civil / Ano De Exploração",23901070108408]
["Serviços Profissionais/Técnicos - Lago Artificial, Tanque, Barreiros, Canais, Reserv.Água Potavel - Não Se Aplica - Ano Civil / Ano De Exploração",23906050000408]
["Serviços Profissionais/Técnicos - Proteção Do Solo - Terraplanagem, Drenagem E Plantio De Espécies Vegetais Para Fixação Do Solo E Sombreamento - Ano Civil / Ano De Exploração",23906240217408]
["Serviços Profissionais/Técnicos - Residências Rurais - Construção Ou Reforma - Ano Civil / Ano De Exploração",23906460108408]
["Serviços Profissionais/Técnicos - Terraços, Porteiras, Mata-Burros, Currais, Cochos, Cercas - Construção Ou Reforma - Ano Civil / Ano De Exploração",23907710108408]

{"sheet":"Descrição do Projeto","index":5,"n_rows":54,"n_cols":1,"rows_kept":54,"cut":false,"hidden":false,"merged":[[25,0,34,2],[2,0,2,2],[3,0,12,2],[13,0,13,2],[14,0,23,2],[24,0,24,2],[53,0,53,2],[54,0,63,2],[35,0,35,2],[36,0,45,2],[46,0,46,2],[47,0,52,2]]}
[]
["6. Descrição do projeto"]
["Resumo do projeto"]
[]
[]
[]
[]
[]
[]
[]
[]
[]
[]
["Localização Geográfica e clima"]
[]
[]
[]
[]
[]
[]
[]
[]
[]
[]
["Recursos hídricos e meio ambiente"]
[]
[]
[]
[]
[]
[]
[]
[]
[]
[]
["Aspectos Técnicos (manejo produtivo e reprodutivo)"]
[]
[]
[]
[]
[]
[]
[]
[]
[]
[]
["Mercado"]
[]
[]
[]
[]
[]
[]
["Outros "]

{"sheet":"Orçamento","index":6,"n_rows":99,"n_cols":18,"rows_kept":99,"cut":false,"hidden":false,"merged":[[2,0,2,8],[98,0,98,4],[57,0,57,4],[38,0,38,4],[30,0,30,4],[5,0,5,4],[3,0,4,0],[3,1,4,1],[3,2,4,2],[3,3,4,3],[3,4,3,7],[3,8,4,8],[91,0,91,4]]}
[]
["7. Orçamento"]
["Orçamento e Cronograma de Liberação",null,null,null,null,null,null,null,null,null,null,null,null,null,null,{"$f":"IF('Dados Cadastrais'!E33=\"não\",\"0\",F6*2%)","v":0},{"$f":"IF('Dados Cadastrais'!E33=\"não\",\"0\",G6*2%)","v":0},{"$f":"IF('Dados Cadastrais'!E33=\"não\",\"0\",H6*2%)","v":0}]
["Código","Especificação","Unid","Quant","Valor",null,null,null,"Época de Realização",null,null,null,null,null,null,{"$f":"IF('Dados Cadastrais'!E33=\"não\",\"0\",F31*2%)","v":0},{"$f":"IF('Dados Cadastrais'!E33=\"não\",\"0\",G31*2%)","v":0},{"$f":"IF('Dados Cadastrais'!E33=\"não\",\"0\",H31*2%)","v":0}]
[null,null,null,null," Unitário","Total","Financiado","R. Próprio",null,null,null,null,null,null,null,{"$f":"IF('Dados Cadastrais'!$E$33=\"não\",\"0\",F39*2%)","v":0},{"$f":"IF('Dados Cadastrais'!$E$33=\"não\",\"0\",G39*2%)","v":0},{"$f":"IF('Dados Cadastrais'!$E$33=\"não\",\"0\",H39*2%)","v":0}]
["Investimentos Fixos",null,null,null,null,{"$f":"IFERROR(SUM(F7:F30),0)","v":0},{"$f":"IFERROR(SUM(G7:G30),0)","v":0},{"$f":"IFERROR(SUM(H7:H30),0)","v":0},"-",null,null,null,null,null,null,{"$f":"IF('Dados Cadastrais'!$E$33=\"não\",\"0\",F58*2%)","v":0},{"$f":"IF('Dados Cadastrais'!$E$33=\"não\",\"0\",G58*2%)","v":0},{"$f":"IF('Dados Cadastrais'!$E$33=\"não\",\"0\",H58*2%)","v":0}]
[null,null,null,null,null,{"$f":"IF(B7=\"\",\"\",D7*E7)","v":""},{"$f":"IF(B7=\"\",\"\",IFERROR(((100-Análise!$E$4)/100)*F7,0))","v":""},{"$f":"IF(B7=\"\",\"\",F7-G7)","v":""}]
[null,null,null,null,null,{"$f":"IF(B8=\"\",\"\",D8*E8)","v":""},{"$f":"IF(B8=\"\",\"\",IFERROR(((100-Análise!$E$4)/100)*F8,0))","v":""},""]
[null,null,null,null,null,"",{"$f":"IF(B9=\"\",\"\",IFERROR(((100-Análise!$E$4)/100)*F9,0))","v":""},""]
[null,null,null,null,null,"",{"$f":"IF(B10=\"\",\"\",IFERROR(((100-Análise!$E$4)/100)*F10,0))","v":""},""]
[null,null,null,null,null,"",{"$f":"IF(B11=\"\",\"\",IFERROR(((100-Análise!$E$4)/100)*F11,0))","v":""},""]
[null,null,null,null,null,"",{"$f":"IF(B12=\"\",\"\",IFERROR(((100-Análise!$E$4)/100)*F12,0))","v":""},""]
[null,null,null,null,null,"",{"$f":"IF(B13=\"\",\"\",IFERROR(((100-Análise!$E$4)/100)*F13,0))","v":""},""]
[null,null,null,null,null,{"$f":"IF(B14=\"\",\"\",D14*E14)","v":""},{"$f":"IF(B14=\"\",\"\",IFERROR(((100-Análise!$E$4)/100)*F14,0))","v":""},""]
[null,null,null,null,null,"",{"$f":"IF(B15=\"\",\"\",IFERROR(((100-Análise!$E$4)/100)*F15,0))","v":""},""]
[null,null,null,null,null,{"$f":"IF(B16=\"\",\"\",D16*E16)","v":""},{"$f":"IF(B16=\"\",\"\",IFERROR(((100-Análise!$E$4)/100)*F16,0))","v":""},""]
[null,null,null,null,null,"",{"$f":"IF(B17=\"\",\"\",IFERROR(((100-Análise!$E$4)/100)*F17,0))","v":""},""]
[null,null,null,null,null,"",{"$f":"IF(B18=\"\",\"\",IFERROR(((100-Análise!$E$4)/100)*F18,0))","v":""},""]
[null,null,null,null,null,"",{"$f":"IF(B19=\"\",\"\",IFERROR(((100-Análise!$E$4)/100)*F19,0))","v":""},""]
[null,null,null,null,null,"",{"$f":"IF(B20=\"\",\"\",IFERROR(((100-Análise!$E$4)/100)*F20,0))","v":""},""]
[null,null,null,null,null,"",{"$f":"IF(B21=\"\",\"\",IFERROR(((100-Análise!$E$4)/100)*F21,0))","v":""},""]
[null,null,null,null,null,{"$f":"IF(B22=\"\",\"\",D22*E22)","v":""},{"$f":"IF(B22=\"\",\"\",IFERROR(((100-Análise!$E$4)/100)*F22,0))","v":""},""]
[null,null,null,null,null,"",{"$f":"IF(B23=\"\",\"\",IFERROR(((100-Análise!$E$4)/100)*F23,0))","v":""},""]
[null,null,null,null,null,"",{"$f":"IF(B24=\"\",\"\",IFERROR(((100-Análise!$E$4)/100)*F24,0))","v":""},""]
[null,null,null,null,null,"",{"$f":"IF(B25=\"\",\"\",IFERROR(((100-Análise!$E$4)/100)*F25,0))","v":""},""]
[null,null,null,null,null,{"$f":"IF(B26=\"\",\"\",D26*E26)","v":""},{"$f":"IF(B26=\"\",\"\",IFERROR(((100-Análise!$E$4)/100)*F26,0))","v":""},{"$f":"IF(B26=\"\",\"\",F26-G26)","v":""}]
[null,null,null,null,null,"",{"$f":"IF(B27=\"\",\"\",IFERROR(((100-Análise!$E$4)/100)*F27,0))","v":""},""]
[null,null,null,null,null,"",{"$f":"IF(B28=\"\",\"\",IFERROR(((100-Análise!$E$4)/100)*F28,0))","v":""},""]
[null,null,null,null,null,{"$f":"IF(B29=\"\",\"\",D29*E29)","v":""},{"$f":"IF(B29=\"\",\"\",IFERROR(((100-Análise!$E$4)/100)*F29,0))","v":""},{"$f":"IF(B29=\"\",\"\",F29-G29)","v":""}]
[null,null,null,null,null,{"$f":"IF(B30=\"\",\"\",D30*E30)","v":""},{"$f":"IF(B30=\"\",\"\",IFERROR(((100-Análise!$E$4)/100)*F30,0))","v":""},{"$f":"IF(B30=\"\",\"\",F30-G30)","v":""}]
["Investimentos Semifixos - Aquisição de Animais",null,null,null,null,{"$f":"SUM(F32:F38)","v":0},{"$f":"IFERROR(SUM(G32:G38),0)","v":0},{"$f":"IFERROR(SUM(H32:H38),0)","v":0},"-"]
[null,null,null,null,null,{"$f":"IF(B32=\"\",\"\",D32*E32)","v":""},{"$f":"IF(B32=\"\",\"\",IFERROR(((100-Análise!$F$4)/100)*F32,0))","v":""},{"$f":"IF(B32=\"\",\"\",F32-G32)","v":""}]
[null,null,null,null,null,{"$f":"IF(B33=\"\",\"\",D33*E33)","v":""},{"$f":"IF(B33=\"\",\"\",IFERROR(((100-Análise!$F$4)/100)*F33,0))","v":""},{"$f":"IF(B33=\"\",\"\",F33-G33)","v":""}]
[null,null,null,null,null,"",{"$f":"IF(B34=\"\",\"\",IFERROR(((100-Análise!$F$4)/100)*F34,0))","v":""},""]
[null,null,null,null,null,"",{"$f":"IF(B35=\"\",\"\",IFERROR(((100-Análise!$F$4)/100)*F35,0))","v":""},""]
[null,null,null,null,null,"",{"$f":"IF(B36=\"\",\"\",IFERROR(((100-Análise!$F$4)/100)*F36,0))","v":""},""]
[null,null,null,null,null,"",{"$f":"IF(B37=\"\",\"\",IFERROR(((100-Análise!$F$4)/100)*F37,0))","v":""},""]
[null,null,null,null,null,"",{"$f":"IF(B38=\"\",\"\",IFERROR(((100-Análise!$F$4)/100)*F38,0))","v":""},""]
["Investimentos Semifixos - Máquinas e Equipamentos",null,null,null,null,{"$f":"SUM(F40:F57)","v":0},{"$f":"IFERROR(SUM(G40:G57),0)","v":0},{"$f":"IFERROR(SUM(H40:H57),0)","v":0},"-"]
[null,null,null,null,null,{"$f":"IF(B40=\"\",\"\",D40*E40)","v":""},{"$f":"IF(B40=\"\",\"\",IFERROR(((100-Análise!$G$4)/100)*F40,0))","v":""},{"$f":"IF(B40=\"\",\"\",F40-G40)","v":""}]
[null,null,null,null,null,{"$f":"IF(B41=\"\",\"\",D41*E41)","v":""},{"$f":"IF(B41=\"\",\"\",IFERROR(((100-Análise!$G$4)/100)*F41,0))","v":""},{"$f":"IF(B41=\"\",\"\",F41-G41)","v":""}]
[null,null,null,null,null,"",{"$f":"IF(B42=\"\",\"\",IFERROR(((100-Análise!$G$4)/100)*F42,0))","v":""},""]
[null,null,null,null,null,"",{"$f":"IF(B43=\"\",\"\",IFERROR(((100-Análise!$G$4)/100)*F43,0))","v":""},""]
[null,null,null,null,null,"",{"$f":"IF(B44=\"\",\"\",IFERROR(((100-Análise!$G$4)/100)*F44,0))","v":""},""]
[null,null,null,null,null,"",{"$f":"IF(B45=\"\",\"\",IFERROR(((100-Análise!$G$4)/100)*F45,0))","v":""},""]
[null,null,null,null,null,"",{"$f":"IF(B46=\"\",\"\",IFERROR(((100-Análise!$G$4)/100)*F46,0))","v":""},""]
[null,null,null,null,null,"",{"$f":"IF(B47=\"\",\"\",IFERROR(((100-Análise!$G$4)/100)*F47,0))","v":""},""]
[null,null,null,null,null,"",{"$f":"IF(B48=\"\",\"\",IFERROR(((100-Análise!$G$4)/100)*F48,0))","v":""},""]
[null,null,null,null,null,"",{"$f":"IF(B49=\"\",\"\",IFERROR(((100-Análise!$G$4)/100)*F49,0))","v":""},""]
[null,null,null,null,null,"",{"$f":"IF(B50=\"\",\"\",IFERROR(((100-Análise!$G$4)/100)*F50,0))","v":""},""]
[null,null,null,null,null,"",{"$f":"IF(B51=\"\",\"\",IFERROR(((100-Análise!$G$4)/100)*F51,0))","v":""},""]
[null,null,null,null,null,"",{"$f":"IF(B52=\"\",\"\",IFERROR(((100-Análise!$G$4)/100)*F52,0))","v":""},""]
[null,null,null,null,null,"",{"$f":"IF(B53=\"\",\"\",IFERROR(((100-Análise!$G$4)/100)*F53,0))","v":""},""]
[null,null,null,null,null,"",{"$f":"IF(B54=\"\",\"\",IFERROR(((100-Análise!$G$4)/100)*F54,0))","v":""},""]
[null,null,null,null,null,"",{"$f":"IF(B55=\"\",\"\",IFERROR(((100-Análise!$G$4)/100)*F55,0))","v":""},""]
[null,null,null,null,null,"",{"$f":"IF(B56=\"\",\"\",IFERROR(((100-Análise!$G$4)/100)*F56,0))","v":""},""]
[null,null,null,null,null,"",{"$f":"IF(B57=\"\",\"\",IFERROR(((100-Análise!$G$4)/100)*F57,0))","v":""},""]
["Custeio",null,null,null,null,{"$f":"SUM(F59:F91)","v":0},{"$f":"IFERROR(SUM(G59:G91),0)","v":0},{"$f":"IFERROR(SUM(H59:H91),0)","v":0},"-"]
[null,null,null,null,null,{"$f":"IF(B59=\"\",\"\",D59*E59)","v":""},{"$f":"IF(B59=\"\",\"\",IFERROR(((100-Análise!$H$4)/100)*F59,0))","v":""},{"$f":"IF(B59=\"\",\"\",F59-G59)","v":""}]
[null,null,null,null,null,{"$f":"IF(B60=\"\",\"\",D60*E60)","v":""},{"$f":"IF(B60=\"\",\"\",IFERROR(((100-Análise!$H$4)/100)*F60,0))","v":""},{"$f":"IF(B60=\"\",\"\",F60-G60)","v":""}]
[null,null,null,null,null,"",{"$f":"IF(B61=\"\",\"\",IFERROR(((100-Análise!$H$4)/100)*F61,0))","v":""},""]
[null,null,null,null,null,"",{"$f":"IF(B62=\"\",\"\",IFERROR(((100-Análise!$H$4)/100)*F62,0))","v":""},""]
[null,null,null,null,null,"",{"$f":"IF(B63=\"\",\"\",IFERROR(((100-Análise!$H$4)/100)*F63,0))","v":""},""]
[null,null,null,null,null,"",{"$f":"IF(B64=\"\",\"\",IFERROR(((100-Análise!$H$4)/100)*F64,0))","v":""},""]
[null,null,null,null,null,"",{"$f":"IF(B65=\"\",\"\",IFERROR(((100-Análise!$H$4)/100)*F65,0))","v":""},""]
[null,null,null,null,null,"",{"$f":"IF(B66=\"\",\"\",IFERROR(((100-Análise!$H$4)/100)*F66,0))","v":""},""]
[null,null,null,null,null,"",{"$f":"IF(B67=\"\",\"\",IFERROR(((100-Análise!$H$4)/100)*F67,0))","v":""},""]
[null,null,null,null,null,"",{"$f":"IF(B68=\"\",\"\",IFERROR(((100-Análise!$H$4)/100)*F68,0))","v":""},""]
[null,null,null,null,null,"",{"$f":"IF(B69=\"\",\"\",IFERROR(((100-Análise!$H$4)/100)*F69,0))","v":""},""]
[null,null,null,null,null,"",{"$f":"IF(B70=\"\",\"\",IFERROR(((100-Análise!$H$4)/100)*F70,0))","v":""},""]
[null,null,null,null,null,"",{"$f":"IF(B71=\"\",\"\",IFERROR(((100-Análise!$H$4)/100)*F71,0))","v":""},""]
[null,null,null,null,null,"",{"$f":"IF(B72=\"\",\"\",IFERROR(((100-Análise!$H$4)/100)*F72,0))","v":""},""]
[null,null,null,null,null,"",{"$f":"IF(B73=\"\",\"\",IFERROR(((100-Análise!$H$4)/100)*F73,0))","v":""},""]
[null,null,null,null,null,"",{"$f":"IF(B74=\"\",\"\",IFERROR(((100-Análise!$H$4)/100)*F74,0))","v":""},""]
[null,null,null,null,null,"",{"$f":"IF(B75=\"\",\"\",IFERROR(((100-Análise!$H$4)/100)*F75,0))","v":""},""]
[null,null,null,null,null,"",{"$f":"IF(B76=\"\",\"\",IFERROR(((100-Análise!$H$4)/100)*F76,0))","v":""},""]
[null,null,null,null,null,"",{"$f":"IF(B77=\"\",\"\",IFERROR(((100-Análise!$H$4)/100)*F77,0))","v":""},""]
[null,null,null,null,null,"",{"$f":"IF(B78=\"\",\"\",IFERROR(((100-Análise!$H$4)/100)*F78,0))","v":""},""]
[null,null,null,null,null,"",{"$f":"IF(B79=\"\",\"\",IFERROR(((100-Análise!$H$4)/100)*F79,0))","v":""},""]
[null,null,null,null,null,"",{"$f":"IF(B80=\"\",\"\",IFERROR(((100-Análise!$H$4)/100)*F80,0))","v":""},""]
[null,null,null,null,null,"",{"$f":"IF(B81=\"\",\"\",IFERROR(((100-Análise!$H$4)/100)*F81,0))","v":""},""]
[null,null,null,null,null,"",{"$f":"IF(B82=\"\",\"\",IFERROR(((100-Análise!$H$4)/100)*F82,0))","v":""},""]
[null,null,null,null,null,"",{"$f":"IF(B83=\"\",\"\",IFERROR(((100-Análise!$H$4)/100)*F83,0))","v":""},""]
[null,null,null,null,null,"",{"$f":"IF(B84=\"\",\"\",IFERROR(((100-Análise!$H$4)/100)*F84,0))","v":""},""]
[null,null,null,null,null,"",{"$f":"IF(B85=\"\",\"\",IFERROR(((100-Análise!$H$4)/100)*F85,0))","v":""},""]
[null,null,null,null,null,"",{"$f":"IF(B86=\"\",\"\",IFERROR(((100-Análise!$H$4)/100)*F86,0))","v":""},""]
[null,null,null,null,null,"",{"$f":"IF(B87=\"\",\"\",IFERROR(((100-Análise!$H$4)/100)*F87,0))","v":""},""]
[null,null,null,null,null,"",{"$f":"IF(B88=\"\",\"\",IFERROR(((100-Análise!$H$4)/100)*F88,0))","v":""},""]
[null,null,null,null,null,"",{"$f":"IF(B89=\"\",\"\",IFERROR(((100-Análise!$H$4)/100)*F89,0))","v":""},""]
[null,null,null,null,null,"",{"$f":"IF(B90=\"\",\"\",IFERROR(((100-Análise!$H$4)/100)*F90,0))","v":""},""]
[null,null,null,null,null,"",{"$f":"IF(B91=\"\",\"\",IFERROR(((100-Análise!$H$4)/100)*F91,0))","v":""},""]
["Outros Custos",null,null,null,null,{"$f":"IFERROR(SUM(F93:F98),0)","v":0},{"$f":"IFERROR(SUM(G93:G98),0)","v":0},{"$f":"IFERROR(SUM(H93:H98),0)","v":0},"-"]
[null,{"$f":"IF(OR('Dados Cadastrais'!E33=\"não\",'Dados Cadastrais'!E33=\"\"),\"\",\"Elaboração do Projeto\")","v":""},{"$f":"IF(B93=\"\",\"\",\"vb\")","v":""},{"$f":"IF(B93=\"\",\"\",1)","v":""},{"$f":"IF(B93=\"\",\"\",(TRUNC(Análise!$E$17*SUM($F$6,$F$31,$F$39,$F$58),2)))","v":""},{"$f":"IF(B93=\"\",\"\",IFERROR(D93*E93,0))","v":""},{"$f":"IF(D93=\"\",\"\",TRUNC(Análise!$E$17*SUM($G$6,$G$31,$G$39,$G$58),2))","v":""},{"$f":"IF(B93=\"\",\"\",F93-G93)","v":""}]
[null,{"$f":"IF(OR('Dados Cadastrais'!E33=\"não\",'Dados Cadastrais'!E33=\"\"),\"\",\"Assistência Técnica - Parcela 1\")","v":""},"","",{"$f":"IF(B94=\"\",\"\",(TRUNC(Análise!$E$18/'Dados Cadastrais'!$E$34*SUM($F$6,$F$31,$F$39,$F$58),2)))","v":""},{"$f":"IF(B94=\"\",\"\",IFERROR(D94*E94,0))","v":""},{"$f":"IF(D94=\"\",\"\",TRUNC(Análise!$E$18/'Dados Cadastrais'!$E$34*SUM($G$6,$G$31,$G$39,$G$58),2))","v":""},{"$f":"IF(B94=\"\",\"\",F94-G94)","v":""}]
[null,{"$f":"IF(OR('Dados Cadastrais'!E33=\"não\",'Dados Cadastrais'!E33=\"\"),\"\",IF('Dados Cadastrais'!$E$34>1,\"Assistência Técnica - Parcela 2\",\"\"))","v":""},"","",{"$f":"IF(B95=\"\",\"\",TRUNC(Análise!$E$18/'Dados Cadastrais'!$E$34*SUM($F$6,$F$31,$F$39,$F$58),2))","v":""},{"$f":"IF(B95=\"\",\"\",IFERROR(D95*E95,0))","v":""},{"$f":"IF(D95=\"\",\"\",TRUNC(Análise!$E$18/'Dados Cadastrais'!$E$34*SUM($G$6,$G$31,$G$39,$G$58),2))","v":""},""]
[null,{"$f":"IF(OR('Dados Cadastrais'!E33=\"não\",'Dados Cadastrais'!E33=\"\"),\"\",IF('Dados Cadastrais'!$E$34>2,\"Assistência Técnica - Parcela 3\",\"\"))","v":""},"","",{"$f":"IF(B96=\"\",\"\",TRUNC(Análise!$E$18/'Dados Cadastrais'!$E$34*SUM($F$6,$F$31,$F$39,$F$58),2))","v":""},{"$f":"IF(B96=\"\",\"\",D96*E96)","v":""},{"$f":"IF(D96=\"\",\"\",TRUNC(Análise!$E$18/'Dados Cadastrais'!$E$34*SUM($G$6,$G$31,$G$39,$G$58),2))","v":""},""]
[null,{"$f":"IF(OR('Dados Cadastrais'!E33=\"não\",'Dados Cadastrais'!E33=\"\"),\"\",IF('Dados Cadastrais'!$E$34>3,\"Assistência Técnica - Parcela 4\",\"\"))","v":""},"","",{"$f":"IF(B97=\"\",\"\",TRUNC(Análise!$E$18/'Dados Cadastrais'!$E$34*SUM($F$6,$F$31,$F$39,$F$58),2))","v":""},{"$f":"IF(B97=\"\",\"\",D97*E97)","v":""},{"$f":"IF(D97=\"\",\"\",TRUNC(Análise!$E$18/'Dados Cadastrais'!$E$34*SUM($G$6,$G$31,$G$39,$G$58),2))","v":""},""]
[null,{"$f":"IF(OR('Dados Cadastrais'!$E$33=\"não\",Análise!$E$17=\"\"),\"\",IF('Dados Cadastrais'!$E$34>4,\"Assistência Técnica - Parcela 5\",\"\"))","v":""},"","",{"$f":"IF(B98=\"\",\"\",TRUNC(Análise!$E$18/'Dados Cadastrais'!$E$34*SUM($F$6,$F$31,$F$39,$F$58),2))","v":""},{"$f":"IF(B98=\"\",\"\",D98*E98)","v":""},{"$f":"IF(D98=\"\",\"\",TRUNC(Análise!$E$18/'Dados Cadastrais'!$E$34*SUM($G$6,$G$31,$G$39,$G$58),2))","v":""},{"$f":"IF(B98=\"\",\"\",F98-G98)","v":""}]
["Total",null,null,null,null,{"$f":"F31+F58+F92+F39+F6","v":0},{"$f":"G31+G58+G92+G39+G6","v":0},{"$f":"H31+H58+H92+H39+H6","v":0},"-"]

{"sheet":"Informações do Imóvel","index":7,"n_rows":5,"n_cols":11,"rows_kept":5,"cut":false,"hidden":false,"merged":[[1,0,1,7]]}
[]
["8. Imóveis"]
["Descrição do Imóvel","Proprietário","N° CAR","CCIR","NIRF","Área (ha)","Consolidada (ha)","Situação do CAR","Benfeitorias (R$)","Máquinas (R$)","Veiculos (R$)"]
[]
["Total",null,{"$f":"SUBTOTAL(103,Tabela1[N° CAR])","v":0},null,null,{"$f":"SUBTOTAL(109,Tabela1[Área (ha)])","v":0},{"$f":"SUBTOTAL(109,Tabela1[Consolidada (ha)])","v":0},null,{"$f":"SUBTOTAL(109,Tabela1[Benfeitorias (R$)])","v":0},{"$f":"SUBTOTAL(109,Tabela1[Máquinas (R$)])","v":0},{"$f":"SUBTOTAL(109,Tabela1[Veiculos (R$)])","v":0}]

{"sheet":"Área do Empreendimento","index":8,"n_rows":3,"n_cols":9,"rows_kept":3,"cut":false,"hidden":false,"merged":[]}
[]
["9. Coordenadas do Empreendimento "]
["Código do empreendimento","Área (ha)","Imóvel de Localização","Vértice","Datum","Latitude (decimal)","Longitude (decimal)","Altitude (m)","Gleba"]

{"sheet":"Garantias","index":9,"n_rows":5,"n_cols":13,"rows_kept":5,"cut":false,"hidden":false,"merged":[]}
[]
["10. Garantias"]
["Categoria","Subcategoria","Descrição","Quantidade","Endereço","CEP","Municipio","UF","Matricula","Cartorio","Livro","Folha","Valor"]
[]
["Total",null,null,null,null,null,null,null,null,null,null,null,{"$f":"SUBTOTAL(109,Tabela7[Valor])","v":0}]

{"sheet":"Atividades não financiadas","index":10,"n_rows":55,"n_cols":7,"rows_kept":55,"cut":false,"hidden":false,"merged":[[2,0,3,0],[2,1,3,1],[2,2,3,2],[2,3,2,6],[15,0,16,0],[15,1,16,1],[15,2,16,2],[15,3,15,6],[28,0,29,0],[28,1,29,1],[28,2,29,2],[28,3,28,6],[42,0,42,1]]}
[]
["11. Atividades não financiadas"]
["Produto","Área (ha)","Unidade","Produtividade  (und/ha)"]
[null,null,null,"Ano 1","Ano 2","Ano 3","Ano 4"]
[]
[]
[]
[]
[]
[]
[]
[]
[]
[]
[]
["Produto","Área (ha)","Unidade","Produtividade  (und/ha)"]
[null,null,null,"Ano 5","Ano 6","Ano 7","Ano 8"]
[{"$f":"IF(A5=\"\",\"\",A5)","v":""}]
[{"$f":"IF(A6=\"\",\"\",A6)","v":""}]
[""]
[""]
[""]
[""]
[""]
[""]
[""]
[""]
[""]
["Produto","Área (ha)","Unidade","Produtividade  (und/ha)"]
[null,null,null,"Ano 9","Ano 10","Ano 11","Ano 12"]
[{"$f":"IF(A5=\"\",\"\",A5)","v":""}]
[{"$f":"IF(A6=\"\",\"\",A6)","v":""}]
[""]
[""]
[""]
[""]
[""]
[""]
[""]
[""]
[""]
[]
["12. Preço de Comercialização"]
["Produto","Valor Unitário "]
[{"$f":"IF(A5=\"\",\"\",CONCATENATE(A5,\" \",\"(\",C5,\")\"))","v":""}]
[{"$f":"IF(A6=\"\",\"\",CONCATENATE(A6,\" \",\"(\",C6,\")\"))","v":""}]
[""]
[""]
[""]
[""]
[""]
[""]
[""]
[""]
[""]

{"sheet":"Agricultura","index":11,"n_rows":109,"n_cols":7,"rows_kept":109,"cut":false,"hidden":true,"merged":[[2,0,3,0],[2,1,3,1],[2,2,3,2],[2,3,2,6],[16,0,17,0],[16,1,17,1],[16,2,17,2],[16,3,16,6],[30,0,31,0],[30,1,31,1],[30,2,31,2],[30,3,30,6],[61,0,62,1],[61,2,62,2],[61,3,62,3],[61,4,61,5],[61,6,62,6],[63,0,63,6],[64,0,64,6],[65,0,65,1],[65,6,68,6],[66,0,66,1],[67,0,67,1],[68,0,68,1],[69,0,69,4],[70,0,70,6],[71,0,71,1],[71,6,74,6],[72,0,72,1],[73,0,73,1],[74,0,74,1],[75,0,75,4],[76,0,76,6],[77,0,77,1],[77,6,80,6],[78,0,78,1],[79,0,79,1],[80,0,80,1],[81,0,81,4],[82,0,82,6],[83,0,83,6],[84,0,84,1],[84,6,87,6],[85,0,85,1],[86,0,86,1],[87,0,87,1],[88,0,88,4],[89,0,89,6],[90,0,90,1],[90,6,93,6],[91,0,91,1],[92,0,92,1],[93,0,93,1],[94,0,94,4],[95,0,95,6],[96,0,96,1],[96,6,99,6],[97,0,97,1],[98,0,98,1],[99,0,99,1],[109,0,119,6],[108,0,108,6],[106,0,106,4],[100,0,100,4],[101,0,101,6],[102,0,102,1],[102,6,105,6],[103,0,103,1],[104,0,104,1],[105,0,105,1]]}
[]
["13. Receitas Agricolas"]
["Produto","Área (ha)","Unidade","Produtividade  (und/ha)"]
[null,null,null,"Ano 1","Ano 2","Ano 3","Ano 4"]
[]
[]
[]
[]
[]
[]
[]
[]
[]
[]
[]
[]
["Produto","Área (ha)","Unidade","Produtividade  (und/ha)"]
[null,null,null,"Ano 5","Ano 6","Ano 7","Ano 8"]
[{"$f":"IF(A5=\"\",\"\",A5)","v":""}]
[{"$f":"IF(A6=\"\",\"\",A6)","v":""}]
[""]
[""]
[""]
[""]
[""]
[""]
[""]
[""]
[""]
[""]
["Produto","Área (ha)","Unidade","Produtividade  (und/ha)"]
[null,null,null,"Ano 9","Ano 10","Ano 11","Ano 12"]
[{"$f":"IF(A5=\"\",\"\",A5)","v":""}]
[{"$f":"IF(A6=\"\",\"\",A6)","v":""}]
[""]
[""]
[""]
[""]
[""]
[""]
[""]
[""]
[""]
[{"$f":"IF(A16=\"\",\"\",A16)","v":""}]
[]
["14. Preço de Comercialização"]
["Produto","Valor Unitário "]
[{"$f":"IF(A5=\"\",\"\",CONCATENATE(A5,\" \",\"(\",C5,\")\"))","v":""},null,{"$f":"IF(B48=\"\",IF(A5=\"\",\"\",\"*Preenchimento Obrigatório\"),\"\")","v":""}]
[{"$f":"IF(A6=\"\",\"\",CONCATENATE(A6,\" \",\"(\",C6,\")\"))","v":""},null,{"$f":"IF(B49=\"\",IF(A6=\"\",\"\",\"*Preenchimento Obrigatório\"),\"\")","v":""}]
["",null,""]
["",null,""]
["",null,""]
["",null,""]
["",null,""]
["",null,""]
["",null,""]
["",null,""]
["",null,""]
["",null,{"$f":"IF(B59=\"\",IF(A16=\"\",\"\",\"*Preenchimento Obrigatório\"),\"\")","v":""}]
[]
["15. Custo Operacional - Despesas não Financiadas"]
["Especificação",null,"Unid.","Quant.","Valor (R$)",null,"Ano de Inicio de Aplicação"]
[null,null,null,null,"Unit.","Total"]
["Insumos"]
[" 1 – Preparo do solo/plantio"]
[null,null,null,null,null,{"$f":"D66*E66","v":0},1]
[null,null,null,null,null,{"$f":"D67*E67","v":0}]
[null,null,null,null,null,{"$f":"D68*E68","v":0}]
[null,null,null,null,null,{"$f":"D69*E69","v":0}]
["Total",null,null,null,null,{"$f":"SUM(F66:F69)","v":0},"-"]
["2 – Tratos culturais"]
[null,null,null,null,null,{"$f":"D72*E72","v":0},1]
[null,null,null,null,null,{"$f":"D73*E73","v":0}]
[null,null,null,null,null,{"$f":"D74*E74","v":0}]
[null,null,null,null,null,{"$f":"D75*E75","v":0}]
["Total",null,null,null,null,{"$f":"SUM(F72:F75)","v":0},"-"]
["3 – Colheita "]
[null,null,null,null,null,{"$f":"D78*E78","v":0},1]
[null,null,null,null,null,{"$f":"D79*E79","v":0}]
[null,null,null,null,null,{"$f":"D80*E80","v":0}]
[null,null,null,null,null,{"$f":"D81*E81","v":0}]
["Total",null,null,null,null,{"$f":"SUM(F78:F81)","v":0},"-"]
["Serviços"]
["1 – Preparo do  solo/plantio"]
[null,null,null,null,null,{"$f":"D85*E85","v":0},1]
[null,null,null,null,null,{"$f":"D86*E86","v":0}]
[null,null,null,null,null,{"$f":"D87*E87","v":0}]
[null,null,null,null,null,{"$f":"D88*E88","v":0}]
["Total",null,null,null,null,{"$f":"SUM(F85:F88)","v":0},"-"]
["2 – Tratos culturais"]
[null,null,null,null,null,{"$f":"D91*E91","v":0},1]
[null,null,null,null,null,{"$f":"D92*E92","v":0}]
[null,null,null,null,null,{"$f":"D93*E93","v":0}]
[null,null,null,null,null,{"$f":"D94*E94","v":0}]
["Total",null,null,null,null,{"$f":"SUM(F91:F94)","v":0},"-"]
["3 – Colheita"]
[null,null,null,null,null,{"$f":"D97*E97","v":0},1]
[null,null,null,null,null,{"$f":"D98*E98","v":0}]
[null,null,null,null,null,{"$f":"D99*E99","v":0}]
[null,null,null,null,null,{"$f":"D100*E100","v":0}]
["Total",null,null,null,null,{"$f":"SUM(F97:F100)","v":0},"-"]
["Outros Desembolsos"]
["Energia elétrica",null,null,null,null,{"$f":"D103*E103","v":0},1]
["Combustível",null,null,null,null,{"$f":"D104*E104","v":0}]
["Transporte interno",null,null,null,null,{"$f":"D105*E105","v":0}]
["Outros",null,null,null,null,{"$f":"D106*E106","v":0}]
["Total",null,null,null,null,{"$f":"SUM(F103:F106)","v":0},"-"]
[]
["16. Justificativa Técnica"]

{"sheet":"Piscicultura-Apicultura","index":12,"n_rows":109,"n_cols":7,"rows_kept":109,"cut":false,"hidden":true,"merged":[[2,0,3,0],[2,1,3,1],[2,2,3,2],[2,3,2,6],[16,0,17,0],[16,1,17,1],[16,2,17,2],[16,3,16,6],[30,0,31,0],[30,1,31,1],[30,2,31,2],[30,3,30,6],[61,0,62,1],[61,2,62,2],[61,3,62,3],[61,4,61,5],[61,6,62,6],[63,0,63,6],[64,0,64,6],[65,0,65,1],[65,6,68,6],[66,0,66,1],[67,0,67,1],[68,0,68,1],[69,0,69,4],[70,0,70,6],[71,0,71,1],[71,6,74,6],[72,0,72,1],[73,0,73,1],[74,0,74,1],[75,0,75,4],[76,0,76,6],[77,0,77,1],[77,6,80,6],[78,0,78,1],[79,0,79,1],[80,0,80,1],[81,0,81,4],[82,0,82,6],[83,0,83,6],[84,0,84,1],[84,6,87,6],[85,0,85,1],[86,0,86,1],[87,0,87,1],[88,0,88,4],[89,0,89,6],[90,0,90,1],[90,6,93,6],[91,0,91,1],[92,0,92,1],[93,0,93,1],[94,0,94,4],[95,0,95,6],[96,0,96,1],[96,6,99,6],[97,0,97,1],[98,0,98,1],[99,0,99,1],[109,0,119,6],[106,0,106,4],[100,0,100,4],[101,0,101,6],[102,0,102,1],[102,6,105,6],[103,0,103,1],[104,0,104,1],[105,0,105,1]]}
[]
["17. Receitas de Piscicultura e/ou Apicultura"]
["Produto","Tanques - Colmeias (n°)","Unidade","Produtividade  (und/tanque-colmeia)"]
[null,null,null,"Ano 1","Ano 2","Ano 3","Ano 4"]
[]
[]
[]
[]
[]
[]
[]
[]
[]
[]
[]
[]
["Produto","Tanques - Colmeias (n°)","Unidade","Produtividade  (und/tanque-colmeia)"]
[null,null,null,"Ano 5","Ano 6","Ano 7","Ano 8"]
[{"$f":"IF(A5=\"\",\"\",A5)","v":""}]
[{"$f":"IF(A6=\"\",\"\",A6)","v":""}]
[""]
[""]
[""]
[""]
[""]
[""]
[""]
[""]
[""]
[""]
["Produto","Tanques - Colmeias (n°)","Unidade","Produtividade  (und/tanque-colmeia)"]
[null,null,null,"Ano 9","Ano 10","Ano 11","Ano 12"]
[{"$f":"IF(A5=\"\",\"\",A5)","v":""}]
[{"$f":"IF(A6=\"\",\"\",A6)","v":""}]
[""]
[""]
[""]
[""]
[""]
[""]
[""]
[""]
[""]
[""]
[]
["18. Preço de Comercialização "]
["Produto","Valor Unitário "]
[{"$f":"IF(A5=\"\",\"\",CONCATENATE(A5,\" \",\"(\",C5,\")\"))","v":""},null,{"$f":"IF(B48=\"\",IF(A48=\"\",\"\",\"*Preenchimento Obrigatório\"),\"\")","v":""}]
[{"$f":"IF(A6=\"\",\"\",CONCATENATE(A6,\" \",\"(\",C6,\")\"))","v":""},null,{"$f":"IF(B49=\"\",IF(A49=\"\",\"\",\"*Preenchimento Obrigatório\"),\"\")","v":""}]
["",null,""]
["",null,""]
["",null,""]
["",null,""]
["",null,""]
["",null,""]
["",null,""]
["",null,""]
["",null,""]
["",null,{"$f":"IF(B59=\"\",IF(A59=\"\",\"\",\"*Preenchimento Obrigatório\"),\"\")","v":""}]
[]
["19. Custo Operacional - Despesas não Financiadas"]
["Especificação",null,"Unid.","Quant.","Valor (R$)",null,"Ano de Inicio de Aplicação"]
[null,null,null,null,"Unit.","Total"]
["Insumos"]
[" 1 – Implantação"]
[null,null,null,null,null,{"$f":"D66*E66","v":0},1]
[null,null,null,null,null,{"$f":"D67*E67","v":0}]
[null,null,null,null,null,{"$f":"D68*E68","v":0}]
[null,null,null,null,null,{"$f":"D69*E69","v":0}]
["Total",null,null,null,null,{"$f":"SUM(F66:F69)","v":0},"-"]
["2 – Manutenção"]
[null,null,null,null,null,{"$f":"D72*E72","v":0},1]
[null,null,null,null,null,{"$f":"D73*E73","v":0}]
[null,null,null,null,null,{"$f":"D74*E74","v":0}]
[null,null,null,null,null,{"$f":"D75*E75","v":0}]
["Total",null,null,null,null,{"$f":"SUM(F72:F75)","v":0},"-"]
["3 – Comercialização"]
[null,null,null,null,null,{"$f":"D78*E78","v":0},1]
[null,null,null,null,null,{"$f":"D79*E79","v":0}]
[null,null,null,null,null,{"$f":"D80*E80","v":0}]
[null,null,null,null,null,{"$f":"D81*E81","v":0}]
["Total",null,null,null,null,{"$f":"SUM(F78:F81)","v":0},"-"]
["Serviços"]
[" 1 – Implantação"]
[null,null,null,null,null,{"$f":"D85*E85","v":0},1]
[null,null,null,null,null,{"$f":"D86*E86","v":0}]
[null,null,null,null,null,{"$f":"D87*E87","v":0}]
[null,null,null,null,null,{"$f":"D88*E88","v":0}]
["Total",null,null,null,null,{"$f":"SUM(F85:F88)","v":0},"-"]
["2 – Manutenção"]
[null,null,null,null,null,{"$f":"D91*E91","v":0},1]
[null,null,null,null,null,{"$f":"D92*E92","v":0}]
[null,null,null,null,null,{"$f":"D93*E93","v":0}]
[null,null,null,null,null,{"$f":"D94*E94","v":0}]
["Total",null,null,null,null,{"$f":"SUM(F91:F94)","v":0},"-"]
["3 – Comercialização"]
[null,null,null,null,null,{"$f":"D97*E97","v":0},1]
[null,null,null,null,null,{"$f":"D98*E98","v":0}]
[null,null,null,null,null,{"$f":"D99*E99","v":0}]
[null,null,null,null,null,{"$f":"D100*E100","v":0}]
["Total",null,null,null,null,{"$f":"SUM(F97:F100)","v":0},"-"]
["Outros Desembolsos"]
["1 - Energia elétrica",null,null,null,null,{"$f":"D103*E103","v":0},1]
["2 - Combustível",null,null,null,null,{"$f":"D104*E104","v":0}]
["3 - Transporte interno",null,null,null,null,{"$f":"D105*E105","v":0}]
["5 - Outros",null,null,null,null,{"$f":"D106*E106","v":0}]
["Total",null,null,null,null,{"$f":"SUM(F103:F106)","v":0},"-"]
[]
["20. Justificativa Técnica"]

{"sheet":"Pecuária","index":13,"n_rows":145,"n_cols":5,"rows_kept":145,"cut":false,"hidden":true,"merged":[[2,0,3,0],[2,1,2,2],[2,3,2,4],[16,0,17,0],[16,1,17,1],[16,2,16,4],[91,0,92,0],[27,0,28,0],[27,1,28,1],[27,2,27,4],[40,0,41,0],[40,1,40,2],[40,3,40,4],[60,0,61,0],[60,1,60,2],[60,3,60,4],[84,0,85,0],[86,0,87,0],[107,0,107,4],[108,0,109,0],[108,1,109,1],[108,2,109,2],[108,3,109,3],[108,4,109,4],[110,4,112,4],[114,0,114,4],[115,0,116,0],[115,1,116,1],[115,2,116,2],[115,3,116,3],[115,4,116,4],[145,0,155,4],[139,4,142,4],[117,4,120,4],[122,0,123,0],[122,1,123,1],[122,2,123,2],[122,3,123,3],[122,4,123,4],[124,0,124,4],[125,4,130,4],[131,0,131,4],[132,4,137,4],[138,0,138,4]]}
[]
["21. Rebanho existente e financiado"]
["Categoria","Rebanho - A",null,"Rebanho - B"]
[null,"Existente (cab)","Financiado (cab)","Existente (cab)","Financiado (cab)"]
["Reprodutores"]
["Matrizes"]
["Bois"]
["Novilhos"]
["Novilhas"]
["Garrotes "]
["Garrotas "]
["Bezerros "]
["Bezerras "]
["Total",{"$f":"SUM(B5:B13)","v":0},{"$f":"SUM(C5:C13)","v":0},{"$f":"SUM(D5:D13)","v":0},{"$f":"SUM(E5:E13)","v":0}]
[]
["22. Aquisições programada de bovinos  durante o tempo projetado (Inclusive substituição de matrizes e reprodutores)"]
["Categoria","Preço (R$)","Rebanho A - Aquisições (cab) "]
[null,null,"Ano 1","Ano 2","Demais Anos"]
["Reprodutores"]
["Matrizes"]
["Bois"]
["Novilhos"]
["Novilhas"]
["Garrotes "]
["Garrotas "]
["Bezerros "]
["Bezerras "]
["Categoria","Preço (R$)","Rebanho B - Aquisições (cab)"]
[null,null,"Ano 1","Ano 2","Demais Anos"]
["Reprodutores"]
["Matrizes"]
["Bois"]
["Novilhos"]
["Novilhas"]
["Garrotes "]
["Garrotas "]
["Bezerros "]
["Bezerras "]
[]
["23. Indices Técnicos"]
["Especificações","Coeficientes -  A",null,"Coeficientes - B"]
[null,"Padrão","Projetado","Padrão","Projetado"]
["Taxa de Natalidade (%)",0.8,null,0.8]
["Taxa de Mortalidade (%) - até 12 meses ",0.04,null,0.04]
["Taxa de Mortalidade (%) - de 12 a 24 meses ",0.03,null,0.03]
["Taxa de Mortalidade (%) - de  24 a 36 meses",0.02,null,0.02]
["Taxa de Mortalidade (%) - acima de 36 meses",0.01,null,0.01]
["Relação Matriz/Reprodutor",25,null,25]
["Idade de desmama (meses)",8,null,8]
["Idade ao 1º parto (meses)",36,null,36]
["Intervalo entre partos (meses)",14,null,14]
["Idade ao abate (meses)",36,null,36]
["Peso ao abate (kg)",457,null,457]
["Período de lactação (dias)",null,null,305]
["Produção leite/matriz/dia (l)",null,null,8]
["Relação Leite/Queijo (l/kg)",null,null,5]
["Relação Leite/Manteiga (l/kg)",null,null,5]
[]
["24. Suporte Forrageiro"]
["Tipo"]
["Pastagem","Área (ha)",null,"Capacidade (UA/ha)"]
[null,"Atual ","Projetado","Atual","Projetado"]
["Mecanizado - Sistema Rotacionado Intensivo"]
["Mecanizado - Tradicional"]
["Não Mecanizado "]
["Capineira"]
["Pastagens Nativas"]
[]
["25. Conversão do Rebanho em U.A."]
["Categorias","Cabeças","U.A. (Padrão)"]
["Reprodutores",1,1.25]
["Matrizes",1,1]
["Bois",1,1.25]
["Novilhos",1,0.75]
["Novilhas",1,0.75]
["Garrotes ",1,0.5]
["Garrotas ",1,0.5]
["Bezerros ",1,0.25]
["Bezerras ",1,0.25]
[]
["26. Comercialização"]
["Produto","Unidade","A","B","Padrão"]
["Touro descartado","cab",null,null,"até 10%"]
["Matriz descartada","cab",null,null,"até 10%"]
["Machos","cab"]
[null,"cab"]
["Fêmeas","cab"]
[null,"cab"]
["Outros Produtos","l"]
[]
["27. Preço de Comercialização"]
["Produto"," A","B"]
[null,"Valor Unitário ","Valor Unitário "]
["Touro descartado"]
["Matriz descartada"]
["Boi Gordo p/ abate"]
["Novilho Gordo"]
["Fêmea Excedente"]
["Garrotes "]
["Garrotas "]
["Bezerros "]
["Bezerras "]
["Leite (l)"]
["Queijo (kg)"]
["Manteiga (kg)"]
[]
["28. Custo Operacional - Despesas não Financiadas (Rebanho A e B)"]
["Alimentação"]
["Especificação","Unid.","Qtd/cab/dia","Valor Unit.(R$)","Ano de Inicio de Aplicação"]
[]
["Sal mineral","Quilograma",0.09,2.93,1]
[]
[]
[]
["Sanidade (vacinas e medicamentos)"]
["Especificação","Unid.","Dose/cab/ano","Valor Unit.(R$)","Ano de Inicio de Aplicação"]
[]
["Brucelose","Milimetro",1,2.2666666666666666,1]
["Aftosa","Milimetro",2,2]
["Carbúnculo/Manqueira","Milimetro",3,2.72]
["Botulismo","Milimetro",1,1.36]
[]
["Especificação","Unid.","Qtd (ano)","Valor Unit.(R$)","Ano de Inicio de Aplicação"]
[]
["Reforma/Manutenção de Pastagem"]
[null,null,null,null,1]
[]
[]
[]
[]
[]
["Construção/Manutenção de Cerca"]
[null,null,null,null,1]
[]
[]
[]
[]
[]
["Outros Desembolsos"]
["Energia elétrica",null,null,null,1]
["Combustível"]
["Transporte interno"]
["Outros"]
[]
["29. Justificativa Técnica"]

{"sheet":"Despesas Fixas","index":14,"n_rows":25,"n_cols":5,"rows_kept":25,"cut":false,"hidden":false,"merged":[[23,0,23,3],[1,0,1,3],[2,0,2,3],[8,0,8,3],[13,0,13,3],[18,0,18,3]]}
[]
["30. Despesas Fixas"]
["Mão de Obra Fixa e Encargos Sociais"]
["Cargo/Função","Nº de Funcionários","Salário","Encargos Sociais - 80%"]
[null,null,null,{"$f":"IF(A5=\"\",\"\",C5*80%)","v":""}]
[null,null,null,{"$f":"IF(A6=\"\",\"\",C6*80%)","v":""}]
[null,null,null,{"$f":"IF(A7=\"\",\"\",C7*80%)","v":""}]
[null,null,null,{"$f":"IF(A8=\"\",\"\",C8*80%)","v":""}]
["Manutenção"]
["Discriminação ","Valor (Existente)","Valor (Projetado)","Taxa Anual (%)"]
["Benfeitorias (Construções Civis)",{"$f":"'Informações do Imóvel'!$I$5","v":0},null,5.0000000000000001E-3,{"$f":"(B11+C11)*D11","v":0}]
["Máquinas e Equipamentos",{"$f":"'Informações do Imóvel'!$J$5","v":0},null,1.4999999999999999E-2,{"$f":"(B12+C12)*D12","v":0}]
["Veículos",{"$f":"'Informações do Imóvel'!$K$5","v":0},null,0.05,0]
["Depreciação"]
["Discriminação ","Valor (Existente)","Valor (Projetado)","Taxa Anual (%)"]
["Benfeitorias (Construções Civis)",{"$f":"'Informações do Imóvel'!$I$5","v":0},null,5.0000000000000001E-3,{"$f":"(B16+C16)*D16","v":0}]
["Máquinas e Equipamentos",{"$f":"'Informações do Imóvel'!$J$5","v":0},null,0.01,{"$f":"(B17+C17)*D17","v":0}]
["Veículos",{"$f":"'Informações do Imóvel'!$K$5","v":0},null,0.02,0]
["Seguros"]
["Discriminação ","Valor (Existente)","Valor (Projetado)","Taxa Anual (%)"]
["Benfeitorias (Construções Civis)",{"$f":"'Informações do Imóvel'!$I$5","v":0},null,5.0000000000000001E-3,{"$f":"(B21+C21)*D21","v":0}]
["Máquinas e Equipamentos",{"$f":"'Informações do Imóvel'!$J$5","v":0},null,0.01,{"$f":"(B22+C22)*D22","v":0}]
["Veículos",{"$f":"'Informações do Imóvel'!$K$5","v":0},null,0.03,0]
["Outros custos fixos"]
["Discriminação","Unid","Quantidade/ano","Valor"]

{"sheet":"Análise","index":15,"n_rows":117,"n_cols":39,"rows_kept":117,"cut":false,"hidden":false,"merged":[[1,0,1,7],[2,0,2,3],[4,10,4,11],[2,15,2,17],[9,0,9,3],[5,10,5,11],[3,15,3,17],[5,15,5,17],[3,10,3,11],[2,10,2,11],[4,0,4,3],[8,15,8,17],[5,0,5,3],[9,15,9,17],[3,23,3,29],[3,31,3,32],[3,33,3,34],[3,35,3,36],[3,37,3,38],[3,0,3,3],[4,15,4,17],[7,0,7,3],[14,15,14,17],[6,0,6,3],[11,15,11,17],[11,0,11,3],[6,15,6,17],[12,0,12,3],[7,15,7,17],[13,0,13,3],[10,15,10,17],[8,0,8,3],[10,0,10,3],[13,9,13,11],[6,10,6,11],[15,15,15,17],[17,0,17,3],[16,15,16,17],[17,15,17,17],[14,0,14,3],[12,15,12,17],[15,0,15,3],[13,15,13,17],[16,0,16,3],[19,0,19,9],[20,0,21,0],[20,1,21,1],[20,2,21,2],[20,3,21,3],[20,4,21,4],[20,5,21,5],[20,6,21,6],[20,7,21,7],[38,0,38,3],[38,4,38,9],[38,10,38,11],[39,0,39,3],[39,4,39,9],[39,10,39,11],[20,8,21,8],[20,9,20,10],[20,11,21,11],[36,0,36,11],[37,0,37,3],[37,4,37,9],[37,10,37,11],[42,0,42,3],[42,4,42,9],[42,10,42,11],[43,0,43,3],[43,4,43,9],[43,10,43,11],[40,0,40,3],[40,4,40,9],[40,10,40,11],[41,0,41,3],[41,4,41,9],[41,10,41,11],[47,6,48,6],[47,7,48,7],[47,8,48,8],[47,9,47,10],[47,11,48,11],[63,0,63,11],[44,0,44,3],[44,4,44,9],[44,10,44,11],[46,0,46,11],[47,0,48,0],[47,1,48,1],[47,2,48,2],[47,3,48,3],[47,4,48,4],[47,5,48,5],[66,0,66,3],[66,4,66,9],[66,10,66,11],[67,0,67,3],[67,4,67,9],[67,10,67,11],[64,0,64,3],[64,4,64,9],[64,10,64,11],[65,0,65,3],[65,4,65,9],[65,10,65,11],[70,0,70,3],[70,4,70,9],[70,10,70,11],[71,0,71,3],[71,4,71,9],[71,10,71,11],[68,0,68,3],[68,4,68,9],[68,10,68,11],[69,0,69,3],[69,4,69,9],[69,10,69,11],[73,0,73,11],[74,0,75,0],[74,1,75,1],[74,2,75,2],[74,3,75,3],[74,4,75,4],[74,5,75,5],[74,6,75,6],[74,7,75,7],[74,8,75,8],[93,0,93,3],[93,4,93,9],[93,10,93,11],[94,0,94,3],[94,4,94,9],[94,10,94,11],[74,9,74,10],[74,11,75,11],[91,0,91,11],[92,0,92,3],[92,4,92,9],[92,10,92,11],[97,0,97,3],[97,4,97,9],[97,10,97,11],[98,0,98,3],[98,4,98,9],[98,10,98,11],[95,0,95,3],[95,4,95,9],[95,10,95,11],[96,0,96,3],[96,4,96,9],[96,10,96,11],[116,1,116,3],[116,8,116,10],[99,0,99,3],[99,4,99,9],[99,10,99,11],[102,0,102,11],[103,0,111,11],[115,1,115,3],[115,8,115,10]]}
[]
["31. Condições de Financiamento",null,null,null,null,null,null,null,null,"32. Resumo"]
["Parametros",null,null,null,"Fixo","Animais","Máquinas","Custeio",null,"Total",{"$f":"SUM(E10:H10)","v":0},null,null,null,null,"CONDIÇÕES DO FINANCIAMENTO",null,null,"Fixo","Semifixo1","Semifixo2","Custeio"]
["Recursos Próprios/Contrapartida (%):",null,null,null,null,null,null,null,null,"Financiado",{"$f":"SUM(E11:H11)","v":0},null,null,null,{"$f":"LARGE(E9:H9,1)","v":100},"Valor do Financiamento (R$):",null,null,{"$f":"E11","v":0},0,0,0,null,"Quadro de Amortização ao Ano",null,null,null,null,null,null,null,"Amortização",null,"Amortização",null,"Amortização",null,"Amortização"]
["Carência em meses:",null,null,null,null,null,null,null,null,"Rec. Próprios",{"$f":"SUM(E12:H12)","v":0},null,null,null,null,"Valor da Contrapartida (R$):",null,null,0,0,0,0,null,"Data base","Ano","Fixo","Semifixo1","Semifxo2","Custeio","Total Prestação",null,"Data","Fixo","Data","Semifxo1","Data","Semifxo2","Data","Custeio"]
["Qtd. das Amortizações:",null,null,null,null,null,null,null,null,"IOF",{"$f":"K4*0.38%","v":0},null,null,null,{"$f":"SUM(E10:H10)","v":0},"Valor Total do Investimento (R$):",null,null,{"$f":"S4+S5","v":0},{"$f":"T4+T5","v":0},{"$f":"U4+U5","v":0},{"$f":"V4+V5","v":0},null,null,null,null,null,null,null,null,null,{"$f":"S9","v":"2023-02-28"},"-",{"$f":"T9","v":"2023-02-28"},"-",{"$f":"U9","v":"2023-02-28"},"-",{"$f":"V9","v":"2023-02-28"},"-"]
["Periodicidade de Amortização:",null,null,null,null,null,null,null,null,"Porte",{"$f":"Enquadramento!B20","v":""},null,null,null,{"$f":"SUM(E11:H11)","v":0},"Data da Contratação:",null,null,"2023-02-28","2023-02-28","2023-02-28","2023-02-28",null,{"$f":"EOMONTH(S7,12)","v":"2024-02-29"},1,{"$f":"SUMIFS($AG$6:$AG$856,$AF$6:$AF$856,\"<=\"&X7)","v":0},{"$f":"SUMIFS($AI$6:$AI$856,$AH$6:$AH$856,\"<=\"&$X7)","v":0},{"$f":"SUMIFS($AK$6:$AK$856,$AJ$6:$AJ$856,\"<=\"&$X7)","v":0},{"$f":"SUMIFS($AM$6:$AM$856,$AL$6:$AL$856,\"<=\"&$X7)","v":0},{"$f":"SUM(Z7:AC7)","v":0},null,{"$f":"IF(OR(AF6=\"\",AF6>=$S$13),\"\",IF($S$12=\"mensal\",EOMONTH(AF6,1),IF($S$12=\"bimestral\",EOMONTH(AF6,2),IF($S$12=\"trimestral\",EOMONTH(AF6,3),IF($S$12=\"quadrimestral\",EOMONTH(AF6,4),IF($S$12=\"semestral\",EOMONTH(AF6,6),IF($S$12=\"anual\",EOMONTH(AF6,12),\"\")))))))","v":""},{"$f":"IF(AF7=\"\",\"\",$S$18)","v":""},{"$f":"IF(OR(AH6=\"\",AH6>=$T$13),\"\",IF($T$12=\"mensal\",EOMONTH(AH6,1),IF($T$12=\"bimestral\",EOMONTH(AH6,2),IF($T$12=\"trimestral\",EOMONTH(AH6,3),IF($T$12=\"quadrimestral\",EOMONTH(AH6,4),IF($T$12=\"semestral\",EOMONTH(AH6,6),IF($T$12=\"anual\",EOMONTH(AH6,12),\"\")))))))","v":""},{"$f":"IF(AH7=\"\",\"\",$T$18)","v":""},{"$f":"IF(OR(AJ6=\"\",AJ6>=$U$13),\"\",IF($U$12=\"mensal\",EOMONTH(AJ6,1),IF($U$12=\"bimestral\",EOMONTH(AJ6,2),IF($U$12=\"trimestral\",EOMONTH(AJ6,3),IF($U$12=\"quadrimestral\",EOMONTH(AJ6,4),IF($U$12=\"semestral\",EOMONTH(AJ6,6),IF($U$12=\"anual\",EOMONTH(AJ6,12),\"\")))))))","v":""},{"$f":"IF(AJ7=\"\",\"\",$U$18)","v":""},{"$f":"IF(OR(AL6=\"\",AL6>=$V$13),\"\",IF($V$12=\"mensal\",EOMONTH(AL6,1),IF($V$12=\"bimestral\",EOMONTH(AL6,2),IF($V$12=\"trimestral\",EOMONTH(AL6,3),IF($V$12=\"quadrimestral\",EOMONTH(AL6,4),IF($V$12=\"semestral\",EOMONTH(AL6,6),IF($V$12=\"anual\",EOMONTH(AL6,12),\"\")))))))","v":""},{"$f":"IF(AL7=\"\",\"\",$V$18)","v":""}]
["Taxa de Juros (% a.a.):",null,null,null,null,null,null,null,null,null,null,null,null,null,{"$f":"SUM(E12:H12)","v":0},"Prazo de Carência (em meses):",null,null,{"$f":"E5","v":0},{"$f":"F5","v":0},{"$f":"G5","v":0},{"$f":"H5","v":0},null,{"$f":"EOMONTH(X7,12)","v":"2025-02-28"},2,{"$f":"SUMIFS($AG$6:$AG$856,$AF$6:$AF$856,\">\"&X7,$AF$6:$AF$856,\"<=\"&X8)","v":0},{"$f":"SUMIFS($AI$6:$AI$856,$AH$6:$AH$856,\">\"&$X7,$AH$6:$AH$856,\"<=\"&X8)","v":0},{"$f":"SUMIFS($AK$6:$AK$856,$AJ$6:$AJ$856,\">\"&$X7,$AJ$6:$AJ$856,\"<=\"&X8)","v":0},{"$f":"SUMIFS($AM$6:$AM$856,$AL$6:$AL$856,\">\"&$X7,$AL$6:$AL$856,\"<=\"&$X8)","v":0},0,null,{"$f":"IF(OR(AF7=\"\",AF7>=$S$13),\"\",IF($S$12=\"mensal\",EOMONTH(AF7,1),IF($S$12=\"bimestral\",EOMONTH(AF7,2),IF($S$12=\"trimestral\",EOMONTH(AF7,3),IF($S$12=\"quadrimestral\",EOMONTH(AF7,4),IF($S$12=\"semestral\",EOMONTH(AF7,6),IF($S$12=\"anual\",EOMONTH(AF7,12),\"\")))))))","v":""},{"$f":"IF(AF8=\"\",\"\",$S$18)","v":""},"","",{"$f":"IF(OR(AJ7=\"\",AJ7>=$U$13),\"\",IF($U$12=\"mensal\",EOMONTH(AJ7,1),IF($U$12=\"bimestral\",EOMONTH(AJ7,2),IF($U$12=\"trimestral\",EOMONTH(AJ7,3),IF($U$12=\"quadrimestral\",EOMONTH(AJ7,4),IF($U$12=\"semestral\",EOMONTH(AJ7,6),IF($U$12=\"anual\",EOMONTH(AJ7,12),\"\")))))))","v":""},{"$f":"IF(AJ8=\"\",\"\",$U$18)","v":""},{"$f":"IF(OR(AL7=\"\",AL7>=$V$13),\"\",IF($V$12=\"mensal\",EOMONTH(AL7,1),IF($V$12=\"bimestral\",EOMONTH(AL7,2),IF($V$12=\"trimestral\",EOMONTH(AL7,3),IF($V$12=\"quadrimestral\",EOMONTH(AL7,4),IF($V$12=\"semestral\",EOMONTH(AL7,6),IF($V$12=\"anual\",EOMONTH(AL7,12),\"\")))))))","v":""},{"$f":"IF(AL8=\"\",\"\",$V$18)","v":""}]
["Financiamento (%):",null,null,null,{"$f":"IFERROR(100-E4,0)","v":100},{"$f":"IFERROR(100-F4,0)","v":100},{"$f":"IFERROR(100-G4,0)","v":100},{"$f":"IFERROR(100-H4,0)","v":100},null,null,null,null,null,null,{"$f":"LARGE(E5:H5,1)","v":{"$error":"#NUM!"}},"Data Fim da Carência:",null,null,{"$f":"EOMONTH(S7,S8)","v":"2023-02-28"},{"$f":"EOMONTH(T7,T8)","v":"2023-02-28"},{"$f":"EOMONTH(U7,U8)","v":"2023-02-28"},{"$f":"EOMONTH(V7,V8)","v":"2023-02-28"},null,{"$f":"EOMONTH(X8,12)","v":"2026-02-28"},3,0,0,0,0,0,null,{"$f":"IF(OR(AF8=\"\",AF8>=$S$13),\"\",IF($S$12=\"mensal\",EOMONTH(AF8,1),IF($S$12=\"bimestral\",EOMONTH(AF8,2),IF($S$12=\"trimestral\",EOMONTH(AF8,3),IF($S$12=\"quadrimestral\",EOMONTH(AF8,4),IF($S$12=\"semestral\",EOMONTH(AF8,6),IF($S$12=\"anual\",EOMONTH(AF8,12),\"\")))))))","v":""},{"$f":"IF(AF9=\"\",\"\",$S$18)","v":""},"","","",{"$f":"IF(AJ9=\"\",\"\",$U$18)","v":""},"",""]
["Valor Total do Investimento (R$):",null,null,null,{"$f":"Orçamento!F6+Orçamento!P3","v":0},{"$f":"Orçamento!F31+Orçamento!P4","v":0},{"$f":"Orçamento!F39+Orçamento!P5","v":0},{"$f":"Orçamento!F58+Orçamento!P6","v":0},null,null,null,null,null,null,{"$f":"COUNTIF(E6:H6,\"> 0,00\")","v":0},"Saldo Deverdor no Fim da Carência:",null,null,{"$f":"FV(S17,S8,,-S4,0)","v":0},{"$f":"FV(T17,T8,,-T4,0)","v":0},{"$f":"FV(U17,U8,,-U4,0)","v":0},{"$f":"FV(V17,V8,,-V4,0)","v":0},null,{"$f":"EOMONTH(X9,12)","v":"2027-02-28"},4,0,0,0,0,0,null,"","",{"$f":"IF(OR(AH9=\"\",AH9>=$T$13),\"\",IF($T$12=\"mensal\",EOMONTH(AH9,1),IF($T$12=\"bimestral\",EOMONTH(AH9,2),IF($T$12=\"trimestral\",EOMONTH(AH9,3),IF($T$12=\"quadrimestral\",EOMONTH(AH9,4),IF($T$12=\"semestral\",EOMONTH(AH9,6),IF($T$12=\"anual\",EOMONTH(AH9,12),\"\")))))))","v":""},"","","","",""]
["Valor do Financiamento (R$):",null,null,null,{"$f":"Orçamento!G6+Orçamento!Q3","v":0},{"$f":"Orçamento!G31+Orçamento!Q4","v":0},{"$f":"Orçamento!G39+Orçamento!Q5","v":0},{"$f":"Orçamento!G58+Orçamento!Q6","v":0},null,null,null,null,null,null,"Não","Quantidade de Amortizações:",null,null,{"$f":"E6","v":0},0,0,0,null,"2028-02-29",5,0,0,0,0,0,null,"","","","","","","",""]
["Recursos Próprios/Contrapartida (R$):",null,null,null,{"$f":"E10-E11","v":0},{"$f":"F10-F11","v":0},{"$f":"G10-G11","v":0},{"$f":"H10-H11","v":0},null,null,null,null,null,null,{"$f":"E7","v":0},"Periodicidade de Amortização:",null,null,0,0,0,0,null,"2029-02-28",6,0,0,0,0,0,null,"","","","","",{"$f":"IF(AJ12=\"\",\"\",$U$18)","v":""},"",""]
["Pagamento Juros na Carência:",null,null,null,"Não","Não","Não","Não",null,null,null,null,null,null,{"$f":"O10*12","v":0},"Data de Vencimento da Operação:",null,null,{"$f":"EOMONTH(S7,S15)","v":"2023-02-28"},{"$f":"EOMONTH(T7,T15)","v":"2023-02-28"},{"$f":"EOMONTH(U7,U15)","v":"2023-02-28"},{"$f":"EOMONTH(V7,V15)","v":"2023-02-28"},null,"2030-02-28",7,0,0,0,0,0,null,"","","","",{"$f":"IF(OR(AJ12=\"\",AJ12>=$U$13),\"\",IF($U$12=\"mensal\",EOMONTH(AJ12,1),IF($U$12=\"bimestral\",EOMONTH(AJ12,2),IF($U$12=\"trimestral\",EOMONTH(AJ12,3),IF($U$12=\"quadrimestral\",EOMONTH(AJ12,4),IF($U$12=\"semestral\",EOMONTH(AJ12,6),IF($U$12=\"anual\",EOMONTH(AJ12,12),\"\")))))))","v":""},"","",""]
["Prazo de Amortização (em meses):",null,null,null,{"$f":"IF(E7=\"anual\",E6*12,IF(E7=\"semestral\",E6*6,IF(E7=\"quadrimestral\",E6*4,IF(E7=\"trimestral\",E6*3,IF(E7=\"bimestral\",E6*2,E6)))))","v":0},{"$f":"IF(F7=\"anual\",F6*12,IF(F7=\"semestral\",F6*6,IF(F7=\"quadrimestral\",F6*4,IF(F7=\"trimestral\",F6*3,IF(F7=\"bimestral\",F6*2,F6)))))","v":0},{"$f":"IF(G7=\"anual\",G6*12,IF(G7=\"semestral\",G6*6,IF(G7=\"quadrimestral\",G6*4,IF(G7=\"trimestral\",G6*3,IF(G7=\"bimestral\",G6*2,G6)))))","v":0},{"$f":"IF(H7=\"anual\",H6*12,IF(H7=\"semestral\",H6*6,IF(H7=\"quadrimestral\",H6*4,IF(H7=\"trimestral\",H6*3,IF(H7=\"bimestral\",H6*2,H6)))))","v":0},null,"33. Análise de Sensibilidade",null,null,null,null,{"$f":"LARGE(E15:H15,1)","v":0},"Prazo de Amortização (em meses):",null,null,{"$f":"E14","v":0},0,0,0,null,"2031-02-28",8,0,0,0,0,{"$f":"SUM(Z14:AC14)","v":0},null,"","","","","","","",""]
["Prazo Total em meses:",null,null,null,{"$f":"E5+E14","v":0},{"$f":"F5+F14","v":0},{"$f":"G5+G14","v":0},{"$f":"H5+H14","v":0},null,"Item","Cenário 1","Cenário 2",null,null,null,"Prazo Total (em meses):",null,null,0,0,0,0,null,"2032-02-29",9,0,0,0,0,{"$f":"SUM(Z15:AC15)","v":0},null,"","","","","","","",""]
["Valor da Prestação (previsto):",null,null,null,{"$f":"S18","v":0},{"$f":"T18","v":0},{"$f":"U18","v":0},{"$f":"V18","v":0},null,"R. Pecuária (%)",null,null,null,null,{"$f":"N18","v":0},"Taxa Efetiva de Juros (% a.a.):",null,null,{"$f":"E8","v":0},{"$f":"F8","v":0},{"$f":"G8","v":0},{"$f":"H8","v":0},null,"2033-02-28",10,0,0,0,0,{"$f":"SUM(Z16:AC16)","v":0},null,"","","","","","","",""]
["Taxa de Elaboração de Projetos:",null,null,null,{"$f":"IF('Dados Cadastrais'!$E$33=\"Sim\",0.5%,0)","v":0},{"$f":"IF('Dados Cadastrais'!$E$33=\"Sim\",0.5%,0)","v":0},{"$f":"IF('Dados Cadastrais'!$E$33=\"Sim\",0.5%,0)","v":0},{"$f":"IF('Dados Cadastrais'!$E$33=\"Sim\",0.5%,0)","v":0},null,"R. Agricola (%)",null,null,null,null,0,"Taxa Efetiva de Juros (% a.m.):",null,null,{"$f":"(1+S16)^(1/12)-1","v":0},{"$f":"(1+T16)^(1/12)-1","v":0},{"$f":"(1+U16)^(1/12)-1","v":0},{"$f":"(1+V16)^(1/12)-1","v":0},null,"2034-02-28",11,0,0,0,0,{"$f":"SUM(Z17:AC17)","v":0},null,"","","","","","","",""]
["Taxa de Assistência Técnica:",null,null,null,{"$f":"IF('Dados Cadastrais'!$E$33=\"Sim\",1.5%,0)","v":0},{"$f":"IF('Dados Cadastrais'!$E$33=\"Sim\",1.5%,0)","v":0},{"$f":"IF('Dados Cadastrais'!$E$33=\"Sim\",1.5%,0)","v":0},{"$f":"IF('Dados Cadastrais'!$E$33=\"Sim\",1.5%,0)","v":0},null,"Custos (%)",null,null,null,null,0,"Valor da Prestação (R$):",null,null,{"$f":"IFERROR(PMT(IF(S12=\"mensal\",(1+S16)^(1/12)-1,IF(S12=\"bimestral\",(1+S16)^(1/6)-1,IF(S12=\"trimestral\",(1+S16)^(1/4)-1,IF(S12=\"quadrimestral\",(1+S16)^(1/3)-1,IF(S12=\"semestral\",(1+S16)^(1/2)-1,IF(S12=\"anual\",(1+S16)^(1/1)-1)))))),S11,-S10,,0),0)","v":0},{"$f":"IFERROR(PMT(IF(T12=\"mensal\",(1+T16)^(1/12)-1,IF(T12=\"bimestral\",(1+T16)^(1/6)-1,IF(T12=\"trimestral\",(1+T16)^(1/4)-1,IF(T12=\"quadrimestral\",(1+T16)^(1/3)-1,IF(T12=\"semestral\",(1+T16)^(1/2)-1,IF(T12=\"anual\",(1+T16)^(1/1)-1)))))),T11,-T10,,0),0)","v":0},{"$f":"IFERROR(PMT(IF(U12=\"mensal\",(1+U16)^(1/12)-1,IF(U12=\"bimestral\",(1+U16)^(1/6)-1,IF(U12=\"trimestral\",(1+U16)^(1/4)-1,IF(U12=\"quadrimestral\",(1+U16)^(1/3)-1,IF(U12=\"semestral\",(1+U16)^(1/2)-1,IF(U12=\"anual\",(1+U16)^(1/1)-1)))))),U11,-U10,,0),0)","v":0},{"$f":"IFERROR(PMT(IF(V12=\"mensal\",(1+V16)^(1/12)-1,IF(V12=\"bimestral\",(1+V16)^(1/6)-1,IF(V12=\"trimestral\",(1+V16)^(1/4)-1,IF(V12=\"quadrimestral\",(1+V16)^(1/3)-1,IF(V12=\"semestral\",(1+V16)^(1/2)-1,IF(V12=\"anual\",(1+V16)^(1/1)-1)))))),V11,-V10,,0),0)","v":0},null,{"$f":"EOMONTH(X17,12)","v":"2035-02-28"},12,0,0,0,0,{"$f":"SUM(Z18:AC18)","v":0},null,"","","","","","","",""]
[null,null,null,null,null,null,null,null,null,null,null,null,null,null,null,null,null,null,null,null,null,null,null,null,null,null,null,null,null,null,null,{"$f":"IF(OR(AF18=\"\",AF18>=$S$13),\"\",IF($S$12=\"mensal\",EOMONTH(AF18,1),IF($S$12=\"bimestral\",EOMONTH(AF18,2),IF($S$12=\"trimestral\",EOMONTH(AF18,3),IF($S$12=\"quadrimestral\",EOMONTH(AF18,4),IF($S$12=\"semestral\",EOMONTH(AF18,6),IF($S$12=\"anual\",EOMONTH(AF18,12),\"\")))))))","v":""},{"$f":"IF(AF19=\"\",\"\",$S$18)","v":""},{"$f":"IF(OR(AH18=\"\",AH18>=$T$13),\"\",IF($T$12=\"mensal\",EOMONTH(AH18,1),IF($T$12=\"bimestral\",EOMONTH(AH18,2),IF($T$12=\"trimestral\",EOMONTH(AH18,3),IF($T$12=\"quadrimestral\",EOMONTH(AH18,4),IF($T$12=\"semestral\",EOMONTH(AH18,6),IF($T$12=\"anual\",EOMONTH(AH18,12),\"\")))))))","v":""},{"$f":"IF(AH19=\"\",\"\",$T$18)","v":""},{"$f":"IF(OR(AJ18=\"\",AJ18>=$U$13),\"\",IF($U$12=\"mensal\",EOMONTH(AJ18,1),IF($U$12=\"bimestral\",EOMONTH(AJ18,2),IF($U$12=\"trimestral\",EOMONTH(AJ18,3),IF($U$12=\"quadrimestral\",EOMONTH(AJ18,4),IF($U$12=\"semestral\",EOMONTH(AJ18,6),IF($U$12=\"anual\",EOMONTH(AJ18,12),\"\")))))))","v":""},{"$f":"IF(AJ19=\"\",\"\",$U$18)","v":""},{"$f":"IF(OR(AL18=\"\",AL18>=$V$13),\"\",IF($V$12=\"mensal\",EOMONTH(AL18,1),IF($V$12=\"bimestral\",EOMONTH(AL18,2),IF($V$12=\"trimestral\",EOMONTH(AL18,3),IF($V$12=\"quadrimestral\",EOMONTH(AL18,4),IF($V$12=\"semestral\",EOMONTH(AL18,6),IF($V$12=\"anual\",EOMONTH(AL18,12),\"\")))))))","v":""},{"$f":"IF(AL19=\"\",\"\",$V$18)","v":""}]
["34. Fluxo de Caixa e Capacidade de Pagamento",null,null,null,null,null,null,null,null,null,null,null,null,null,null,null,null,null,null,null,null,null,null,null,null,null,null,null,null,null,null,{"$f":"IF(OR(AF19=\"\",AF19>=$S$13),\"\",IF($S$12=\"mensal\",EOMONTH(AF19,1),IF($S$12=\"bimestral\",EOMONTH(AF19,2),IF($S$12=\"trimestral\",EOMONTH(AF19,3),IF($S$12=\"quadrimestral\",EOMONTH(AF19,4),IF($S$12=\"semestral\",EOMONTH(AF19,6),IF($S$12=\"anual\",EOMONTH(AF19,12),\"\")))))))","v":""},{"$f":"IF(AF20=\"\",\"\",$S$18)","v":""},{"$f":"IF(OR(AH19=\"\",AH19>=$T$13),\"\",IF($T$12=\"mensal\",EOMONTH(AH19,1),IF($T$12=\"bimestral\",EOMONTH(AH19,2),IF($T$12=\"trimestral\",EOMONTH(AH19,3),IF($T$12=\"quadrimestral\",EOMONTH(AH19,4),IF($T$12=\"semestral\",EOMONTH(AH19,6),IF($T$12=\"anual\",EOMONTH(AH19,12),\"\")))))))","v":""},"",{"$f":"IF(OR(AJ19=\"\",AJ19>=$U$13),\"\",IF($U$12=\"mensal\",EOMONTH(AJ19,1),IF($U$12=\"bimestral\",EOMONTH(AJ19,2),IF($U$12=\"trimestral\",EOMONTH(AJ19,3),IF($U$12=\"quadrimestral\",EOMONTH(AJ19,4),IF($U$12=\"semestral\",EOMONTH(AJ19,6),IF($U$12=\"anual\",EOMONTH(AJ19,12),\"\")))))))","v":""},"",{"$f":"IF(OR(AL19=\"\",AL19>=$V$13),\"\",IF($V$12=\"mensal\",EOMONTH(AL19,1),IF($V$12=\"bimestral\",EOMONTH(AL19,2),IF($V$12=\"trimestral\",EOMONTH(AL19,3),IF($V$12=\"quadrimestral\",EOMONTH(AL19,4),IF($V$12=\"semestral\",EOMONTH(AL19,6),IF($V$12=\"anual\",EOMONTH(AL19,12),\"\")))))))","v":""},""]
["Ano","Receita Pecuária","Receita Agricola","Custos","Fluxo Operacional","Desembolsos","Fluxo Liquido","Operações em ser","Amortização","Disponibilidade Líquida",null,"Receita Liquida",null,null,null,null,null,null,null,null,null,null,null,null,null,null,null,null,null,null,null,{"$f":"IF(OR(AF20=\"\",AF20>=$S$13),\"\",IF($S$12=\"mensal\",EOMONTH(AF20,1),IF($S$12=\"bimestral\",EOMONTH(AF20,2),IF($S$12=\"trimestral\",EOMONTH(AF20,3),IF($S$12=\"quadrimestral\",EOMONTH(AF20,4),IF($S$12=\"semestral\",EOMONTH(AF20,6),IF($S$12=\"anual\",EOMONTH(AF20,12),\"\")))))))","v":""},{"$f":"IF(AF21=\"\",\"\",$S$18)","v":""},"","","","","",{"$f":"IF(AL21=\"\",\"\",$V$18)","v":""}]
[null,null,null,null,null,null,null,null,null,"Simples","Acumulada",null,null,null,"ANO","FLUXO DE CAIXA","SALDO","FLUXO DESCONTADO","SALDO",null,"Payback Simples",{"$f":"IFERROR(V26-OFFSET(Q23,V26,0)/OFFSET(P23,V26+1,0),\"\")","v":""},"Payback Descontado",{"$f":"IFERROR(X26-OFFSET(S23,X26,0)/OFFSET(R23,X26+1,0),\"\")","v":""},null,null,null,null,null,null,null,"","","","","","","",""]
[0,0,0,0,{"$f":"B23+C23-D23","v":0},{"$f":"O6","v":0},{"$f":"E23-F23","v":0},0,0,{"$f":"IF(B23=\"\",\"\",G23-H23-I23)","v":0},{"$f":"J23","v":0},{"$f":"IFERROR(J23/B23+C23,0)","v":0},null,null,0,{"$f":"G23","v":0},{"$f":"P23","v":0},{"$f":"P23","v":0},{"$f":"R23","v":0},null,"Início do Projeto",{"$f":"'Dados Cadastrais'!E4","v":"00:00:00"},"Início do Projeto","00:00:00",null,null,null,null,null,null,null,"","","","","","","",""]
[{"$f":"IF(A23<ROUNDUP($O$14/12,0),A23+1,\"\")","v":""},{"$f":"IF(A24=\"\",\"\",'Mem piscicultura-apicultura'!C16+'Mem pecuaria'!C17)","v":""},{"$f":"IF(A24=\"\",\"\",'Mem agricultura'!C16)","v":""},{"$f":"IF(A24=\"\",\"\",'Mem agricultura'!B57+'Mem piscicultura-apicultura'!B57+'Mem pecuaria'!B97+'Mem pecuaria'!B111+'Mem despesas fixas'!B14)","v":""},{"$f":"IFERROR(IF(A24=\"\",\"\",B24+C24-D24),\"\")","v":""},null,{"$f":"IFERROR(IF(A24=\"\",\"\",E24-F24),\"\")","v":""},{"$f":"IF(A24=\"\",\"\",'Dados Cadastrais'!A56)","v":""},{"$f":"IF(A24=\"\",\"\",$AD$7)","v":""},{"$f":"IFERROR(IF(B24=\"\",\"\",G24-H24-I24),0)","v":""},{"$f":"IFERROR(IF(A24=\"\",\"\",J24),0)","v":""},{"$f":"IFERROR(IF(A24=\"\",\"\",(J24/(B24+C24))),\"\")","v":""},null,null,1,{"$f":"G24","v":""},{"$f":"P24+Q23","v":{"$error":"#VALUE!"}},{"$f":"PV($E$43,O24,,-P24)","v":{"$error":"#VALUE!"}},{"$f":"R24+S23","v":{"$error":"#VALUE!"}},null,"Recuperação do Projeto",{"$f":"IFERROR(V23+V25,\"\")","v":""},"Recuperação do Projeto",{"$f":"IFERROR(X23+X25,\"\")","v":""},null,null,null,null,null,null,null,"","","","","","","",""]
[{"$f":"IF(A24<ROUNDUP($O$14/12,0),A24+1,\"\")","v":""},{"$f":"IF(A25=\"\",\"\",'Mem piscicultura-apicultura'!E16+'Mem pecuaria'!E17)","v":""},{"$f":"IF(A25=\"\",\"\",'Mem agricultura'!E16)","v":""},{"$f":"IF(A25=\"\",\"\",'Mem agricultura'!C57+'Mem piscicultura-apicultura'!C57+'Mem pecuaria'!C97+'Mem pecuaria'!C111+'Mem despesas fixas'!C14)","v":""},{"$f":"IFERROR(IF(A25=\"\",\"\",B25+C25-D25),\"\")","v":""},null,{"$f":"IFERROR(IF(A25=\"\",\"\",E25-F25),\"\")","v":""},{"$f":"IF(A25=\"\",\"\",'Dados Cadastrais'!C56)","v":""},{"$f":"IF(A25=\"\",\"\",$AD$8)","v":""},{"$f":"IFERROR(IF(B25=\"\",\"\",G25-H25-I25),0)","v":""},{"$f":"IFERROR(IF(A25=\"\",\"\",J25),0)","v":""},{"$f":"IFERROR(IF(A25=\"\",\"\",(J25/(B25+C25))),\"\")","v":""},null,null,2,"",{"$f":"P25+Q24","v":{"$error":"#VALUE!"}},{"$f":"PV($E$43,O25,,-P25)","v":{"$error":"#VALUE!"}},{"$error":"#VALUE!"},null,"Dias",{"$f":"IFERROR(V22*365,\"\")","v":""},"Dias",{"$f":"IFERROR(X22*365,\"\")","v":""},null,null,null,null,null,null,null,"","","","","","","",""]
[{"$f":"IF(A25<ROUNDUP($O$14/12,0),A25+1,\"\")","v":""},{"$f":"IF(A26=\"\",\"\",'Mem piscicultura-apicultura'!G16+'Mem pecuaria'!G17)","v":""},{"$f":"IF(A26=\"\",\"\",'Mem agricultura'!G16)","v":""},{"$f":"IF(A26=\"\",\"\",'Mem agricultura'!D57+'Mem piscicultura-apicultura'!D57+'Mem pecuaria'!D97+'Mem pecuaria'!D111+'Mem despesas fixas'!D14)","v":""},"",null,"",{"$f":"IF(A26=\"\",\"\",'Dados Cadastrais'!G56)","v":""},{"$f":"IF(A26=\"\",\"\",$AD$9)","v":""},{"$f":"IFERROR(IF(B26=\"\",\"\",G26-H26-I26),0)","v":""},"",{"$f":"IFERROR(IF(A26=\"\",\"\",(J26/(B26+C26))),\"\")","v":""},null,null,3,{"$f":"G26","v":""},{"$f":"P26+Q25","v":{"$error":"#VALUE!"}},{"$error":"#VALUE!"},{"$error":"#VALUE!"},null,"Anos",{"$f":"IFERROR(MATCH(0,Q23:Q35,1)-1,\"\")","v":0},"Anos",{"$f":"IFERROR(MATCH(0,S23:S35,1)-1,\"\")","v":0},null,null,null,null,null,null,null,"","","","","","","",""]
[{"$f":"IF(A26<ROUNDUP($O$14/12,0),A26+1,\"\")","v":""},{"$f":"IF(A27=\"\",\"\",'Mem piscicultura-apicultura'!I16+'Mem pecuaria'!I17)","v":""},{"$f":"IF(A27=\"\",\"\",'Mem agricultura'!I16)","v":""},{"$f":"IF(A27=\"\",\"\",'Mem agricultura'!E57+'Mem piscicultura-apicultura'!E57+'Mem pecuaria'!E97+'Mem pecuaria'!E111+'Mem despesas fixas'!E14)","v":""},"",null,"",{"$f":"IF(A27=\"\",\"\",'Dados Cadastrais'!A62)","v":""},{"$f":"IF(A27=\"\",\"\",$AD$10)","v":""},{"$f":"IFERROR(IF(B27=\"\",\"\",G27-H27-I27),0)","v":""},"",{"$f":"IFERROR(IF(A27=\"\",\"\",(J27/(B27+C27))),\"\")","v":""},null,null,4,{"$f":"G27","v":""},{"$f":"P27+Q26","v":{"$error":"#VALUE!"}},{"$error":"#VALUE!"},{"$error":"#VALUE!"},null,null,null,null,null,null,null,null,null,null,null,null,"","","","","","","",""]
[{"$f":"IF(A27<ROUNDUP($O$14/12,0),A27+1,\"\")","v":""},{"$f":"IF(A28=\"\",\"\",'Mem piscicultura-apicultura'!C33+'Mem pecuaria'!K17)","v":""},{"$f":"IF(A28=\"\",\"\",'Mem agricultura'!C33)","v":""},{"$f":"IF(A28=\"\",\"\",'Mem agricultura'!F57+'Mem piscicultura-apicultura'!F57+'Mem pecuaria'!F111+'Mem pecuaria'!F97+'Mem despesas fixas'!F14)","v":""},"",null,"",{"$f":"IF(A28=\"\",\"\",'Dados Cadastrais'!C62)","v":""},{"$f":"IF(A28=\"\",\"\",$AD$11)","v":""},{"$f":"IFERROR(IF(B28=\"\",\"\",G28-H28-I28),0)","v":""},"",{"$f":"IFERROR(IF(A28=\"\",\"\",(J28/(B28+C28))),\"\")","v":""},null,null,5,"",{"$error":"#VALUE!"},{"$error":"#VALUE!"},{"$error":"#VALUE!"},null,"VPentradas",null,null,null,null,null,null,null,null,null,null,"","","","","","","",""]
["",{"$f":"IF(A29=\"\",\"\",'Mem piscicultura-apicultura'!E33+'Mem pecuaria'!M17)","v":""},{"$f":"IF(A29=\"\",\"\",'Mem agricultura'!E33)","v":""},{"$f":"IF(A29=\"\",\"\",'Mem agricultura'!G57+'Mem piscicultura-apicultura'!G57+'Mem pecuaria'!G97+'Mem pecuaria'!G111+'Mem despesas fixas'!G14)","v":""},"",null,"",{"$f":"IF(A29=\"\",\"\",'Dados Cadastrais'!G62)","v":""},{"$f":"IF(A29=\"\",\"\",$AD$12)","v":""},{"$f":"IFERROR(IF(B29=\"\",\"\",G29-H29-I29),0)","v":""},"","",null,null,6,"",{"$error":"#VALUE!"},{"$error":"#VALUE!"},{"$error":"#VALUE!"},null,{"$f":"NPV(E43,G24:G35)","v":0},null,null,null,null,null,null,null,null,null,null,"","","","","","","",""]
[{"$f":"IF(A29<ROUNDUP($O$14/12,0),A29+1,\"\")","v":""},{"$f":"IF(A30=\"\",\"\",'Mem piscicultura-apicultura'!G33+'Mem pecuaria'!C34)","v":""},{"$f":"IF(A30=\"\",\"\",'Mem agricultura'!G33)","v":""},{"$f":"IF(A30=\"\",\"\",'Mem agricultura'!H57+'Mem piscicultura-apicultura'!H57+'Mem pecuaria'!H97+'Mem pecuaria'!H111+'Mem despesas fixas'!B28)","v":""},"",null,"",{"$f":"IF(A30=\"\",\"\",'Dados Cadastrais'!A68)","v":""},{"$f":"IF(A30=\"\",\"\",$AD$13)","v":""},"","","",null,null,7,{"$f":"G30","v":""},{"$error":"#VALUE!"},{"$error":"#VALUE!"},{"$error":"#VALUE!"},null,null,null,null,null,null,null,null,null,null,null,null,"","","","","","","",""]
["",{"$f":"IF(A31=\"\",\"\",'Mem piscicultura-apicultura'!I33+'Mem pecuaria'!E34)","v":""},{"$f":"IF(A31=\"\",\"\",'Mem agricultura'!I33)","v":""},{"$f":"IF(A31=\"\",\"\",'Mem agricultura'!I57+'Mem piscicultura-apicultura'!I57+'Mem pecuaria'!I97+'Mem pecuaria'!I111+'Mem despesas fixas'!C28)","v":""},"",null,"",{"$f":"IF(A31=\"\",\"\",'Dados Cadastrais'!C68)","v":""},{"$f":"IF(A31=\"\",\"\",$AD$14)","v":""},"","",{"$f":"IFERROR(IF(A31=\"\",\"\",(J31/(B31+C31))),\"\")","v":""},null,null,8,"",{"$error":"#VALUE!"},{"$error":"#VALUE!"},{"$error":"#VALUE!"},null,null,null,null,null,null,null,null,null,null,null,null,"","","","","","","",""]
["",{"$f":"IF(A32=\"\",\"\",'Mem piscicultura-apicultura'!C50+'Mem pecuaria'!G34)","v":""},{"$f":"IF(A32=\"\",\"\",'Mem agricultura'!C50)","v":""},{"$f":"IF(A32=\"\",\"\",'Mem agricultura'!B64+'Mem piscicultura-apicultura'!B64+'Mem pecuaria'!J97+'Mem pecuaria'!J111+'Mem despesas fixas'!D28)","v":""},"",null,"",{"$f":"IF(A32=\"\",\"\",'Dados Cadastrais'!G68)","v":""},{"$f":"IF(A32=\"\",\"\",$AD$15)","v":""},"","",{"$f":"IFERROR(IF(A32=\"\",\"\",(J32/(B32+C32))),\"\")","v":""},null,null,9,"",{"$error":"#VALUE!"},{"$error":"#VALUE!"},{"$error":"#VALUE!"},null,null,null,null,null,null,null,null,null,null,null,null,"","","","","","","",""]
["",{"$f":"IF(A33=\"\",\"\",'Mem piscicultura-apicultura'!E50+'Mem pecuaria'!I34)","v":""},{"$f":"IF(A33=\"\",\"\",'Mem agricultura'!E50)","v":""},{"$f":"IF(A33=\"\",\"\",'Mem agricultura'!C64+'Mem piscicultura-apicultura'!C64+'Mem pecuaria'!K97+'Mem pecuaria'!K111+'Mem despesas fixas'!E28)","v":""},"",null,"",{"$f":"IF(A33=\"\",\"\",'Dados Cadastrais'!A74)","v":""},{"$f":"IF(A33=\"\",\"\",$AD$16)","v":""},"","","",null,null,10,"",{"$error":"#VALUE!"},{"$error":"#VALUE!"},{"$error":"#VALUE!"},null,null,null,null,null,null,null,null,null,null,null,null,"","","","","","","",""]
["",{"$f":"IF(A34=\"\",\"\",'Mem piscicultura-apicultura'!G50+'Mem pecuaria'!K34)","v":""},{"$f":"IF(A34=\"\",\"\",'Mem agricultura'!G50)","v":""},{"$f":"IF(A34=\"\",\"\",'Mem agricultura'!D64+'Mem piscicultura-apicultura'!D64+'Mem pecuaria'!L97+'Mem pecuaria'!L111+'Mem despesas fixas'!F28)","v":""},"",null,"",{"$f":"IF(A34=\"\",\"\",'Dados Cadastrais'!C74)","v":""},{"$f":"IF(A34=\"\",\"\",$AD$17)","v":""},"","","",null,null,11,"",{"$error":"#VALUE!"},{"$error":"#VALUE!"},{"$error":"#VALUE!"},null,null,null,null,null,null,null,null,null,null,null,null,"","","","","","","",""]
["",{"$f":"IF(A35=\"\",\"\",'Mem piscicultura-apicultura'!I50+'Mem pecuaria'!M34)","v":""},{"$f":"IF(A35=\"\",\"\",'Mem agricultura'!I50)","v":""},{"$f":"IF(A35=\"\",\"\",'Mem agricultura'!E64+'Mem piscicultura-apicultura'!E64+'Mem pecuaria'!M97+'Mem pecuaria'!M111+'Mem despesas fixas'!G28)","v":""},"",null,"",{"$f":"IF(A35=\"\",\"\",'Dados Cadastrais'!G74)","v":""},{"$f":"IF(A35=\"\",\"\",$AD$18)","v":""},"","","",null,null,12,"",{"$error":"#VALUE!"},{"$error":"#VALUE!"},{"$error":"#VALUE!"},null,null,null,null,null,null,null,null,null,null,null,null,"","","","","","","",""]
[null,{"$f":"SUM(B23:B35)","v":0},{"$f":"SUM(C23:C35)","v":0},{"$f":"SUM(D23:D35)","v":0},null,null,null,null,null,null,null,null,null,null,null,null,null,null,null,null,null,null,null,null,null,null,null,null,null,null,null,"","","","","","","",""]
["35. Indicadores Econômicos",null,null,null,null,null,null,null,null,null,null,null,null,null,null,null,null,null,null,null,null,null,null,null,null,null,null,null,null,null,null,"","","","","","","",""]
["Indicadores",null,null,null,"Resultado",null,null,null,null,null,"Legenda",null,null,null,null,null,null,null,null,null,null,null,null,null,null,null,null,null,null,null,null,"","","","","","","",""]
["Taxa Interna de Retorno (TIR)",null,null,null,{"$f":"IFERROR(IRR(G23:G35),0)","v":0},null,null,null,null,null,{"$f":"IF(E39>E43,\"Projeto Viável\",\"Projeto Inviável\")","v":"Projeto Inviável"},null,null,null,null,null,null,null,null,null,null,null,null,null,null,null,null,null,null,null,null,"","","","","","","",""]
["Valor Presente Líquido (VPL)",null,null,null,{"$f":"NPV(E43,G23:G35)","v":0},null,null,null,null,null,{"$f":"IF(E40>0,\"Projeto Viável\",\"Projeto Inviável\")","v":"Projeto Inviável"},null,null,null,null,null,null,null,null,null,null,null,null,null,null,null,null,null,null,null,null,"","","","","","","",""]
["Payback simples",null,null,null,{"$f":"IFERROR(DATEDIF(V23,V24,\"y\")&\" ano(s) \" &DATEDIF(V23,V24,\"ym\")&\" mês(s) \" &DATEDIF(V23,V24,\"md\")& \" dia(s)\",\"\")","v":""},null,null,null,null,null,"-",null,null,null,null,null,null,null,null,null,null,null,null,null,null,null,null,null,null,null,null,"","","","","","","",""]
["Payback descontado",null,null,null,{"$f":"IFERROR(DATEDIF(X23,X24,\"y\")&\" ano(s) \" &DATEDIF(X23,X24,\"ym\")&\" mês(s) \" &DATEDIF(X23,X24,\"md\")& \" dia(s)\",\"\")","v":""},null,null,null,null,null,"-",null,null,null,null,null,null,null,null,null,null,null,null,null,null,null,null,null,null,null,null,"","","","","","","",""]
["Taxa Mínima de Atratividade (TMA)",null,null,null,0.13750000000000001,null,null,null,null,null,"-",null,null,null,null,null,null,null,null,null,null,null,null,null,null,null,null,null,null,null,null,"","","","","","","",""]
["Relação Custo Benefício (B/C)",null,null,null,{"$f":"IFERROR((B36+C36)/D36,0)","v":0},null,null,null,null,null,{"$f":"IF(E44>1,\"Projeto Viável\",\"Projeto Inviável\")","v":"Projeto Inviável"},null,null,null,null,null,null,null,null,null,null,null,null,null,null,null,null,null,null,null,null,"","","","","","","",""]
["Índice de Lucratividade (IL)",null,null,null,{"$f":"IFERROR(-U29/G23,0)","v":0},null,null,null,null,null,{"$f":"IF(E45>1,\"Projeto Viável\",\"Projeto Inviável\")","v":"Projeto Inviável"},null,null,null,null,null,null,null,null,null,null,null,null,null,null,null,null,null,null,null,null,"","","","","","","",""]
[]
["36. Cenário 1"]
["Ano","Receita Pecuária","Receita Agricola","Custos","Fluxo Operacional","Desembolsos","Fluxo Liquido","Operações em ser","Amortização","Disponibilidade Líquida",null,"Receita Liquida"]
[null,null,null,null,null,null,null,null,null,"Simples","Acumulada",null,null,null,"ANO","FLUXO DE CAIXA","SALDO","FLUXO DESCONTADO","SALDO",null,"Payback Simples",{"$f":"IFERROR(V53-OFFSET(Q50,V53,0)/OFFSET(P50,V53+1,0),\"\")","v":""},"Payback Descontado",{"$f":"IFERROR(X53-OFFSET(S50,X53,0)/OFFSET(R50,X53+1,0),\"\")","v":""}]
[0,0,0,0,{"$f":"B50+C50-D50","v":0},{"$f":"O6","v":0},{"$f":"E50-F50","v":0},0,0,{"$f":"IF(B50=\"\",\"\",G50-H50-I50)","v":0},{"$f":"J50","v":0},{"$f":"IFERROR(J50/B50+C50,0)","v":0},null,null,0,{"$f":"G50","v":0},{"$f":"P50","v":0},{"$f":"P50","v":0},{"$f":"R50","v":0},null,"Início do Projeto",{"$f":"$V$23","v":"00:00:00"},"Início do Projeto",{"$f":"$X$23","v":"00:00:00"}]
[{"$f":"IF(A50<ROUNDUP($O$14/12,0),A50+1,\"\")","v":""},{"$f":"IF(A51=\"\",\"\",B24*((K16/100)+1))","v":""},{"$f":"IF(A51=\"\",\"\",C24*(($K$17/100)+1))","v":""},{"$f":"IF(A51=\"\",\"\",D24*(($K$18/100)+1))","v":""},{"$f":"IFERROR(IF(A51=\"\",\"\",B51+C51-D51),\"\")","v":""},null,{"$f":"IFERROR(IF(A51=\"\",\"\",E51-F51),\"\")","v":""},{"$f":"IF(H24=\"\",\"\",H24)","v":""},{"$f":"IF(A51=\"\",\"\",$AD$7)","v":""},{"$f":"IFERROR(IF(B51=\"\",\"\",G51-H51-I51),0)","v":""},{"$f":"IF(A51=\"\",\"\",J51)","v":""},{"$f":"IFERROR(IF(A51=\"\",\"\",(J51/(B51+C51))),\"\")","v":""},null,null,1,"",{"$f":"P51+Q50","v":{"$error":"#VALUE!"}},{"$f":"PV($E$70,O51,,-P51)","v":{"$error":"#VALUE!"}},{"$f":"R51+S50","v":{"$error":"#VALUE!"}},null,"Recuperação do Projeto",{"$f":"IFERROR(V50+V52,\"\")","v":""},"Recuperação do Projeto",{"$f":"IFERROR(X50+X52,\"\")","v":""}]
[{"$f":"IF(A51<ROUNDUP($O$14/12,0),A51+1,\"\")","v":""},{"$f":"IF(A52=\"\",\"\",B25*(($K$16/100)+1))","v":""},"","",{"$f":"IFERROR(IF(A52=\"\",\"\",B52+C52-D52),\"\")","v":""},null,{"$f":"IFERROR(IF(A52=\"\",\"\",E52-F52),\"\")","v":""},{"$f":"IF(H25=\"\",\"\",H25)","v":""},{"$f":"IF(A52=\"\",\"\",$AD$8)","v":""},{"$f":"IFERROR(IF(B52=\"\",\"\",G52-H52-I52),0)","v":""},{"$f":"IF(A52=\"\",\"\",J52+K51)","v":""},{"$f":"IFERROR(IF(A52=\"\",\"\",(J52/(B52+C52))),\"\")","v":""},null,null,2,"",{"$error":"#VALUE!"},{"$error":"#VALUE!"},{"$error":"#VALUE!"},null,"Dias",{"$f":"IFERROR(V49*365,\"\")","v":""},"Dias",{"$f":"IFERROR(X49*365,\"\")","v":""}]
["","","","",{"$f":"IFERROR(IF(A53=\"\",\"\",B53+C53-D53),\"\")","v":""},null,"","",{"$f":"IF(A53=\"\",\"\",$AD$9)","v":""},{"$f":"IFERROR(IF(B53=\"\",\"\",G53-H53-I53),0)","v":""},"","",null,null,3,"",{"$error":"#VALUE!"},{"$error":"#VALUE!"},{"$error":"#VALUE!"},null,"Anos",{"$f":"IFERROR(MATCH(0,Q50:Q62,1)-1,\"\")","v":0},"Anos",{"$f":"IFERROR(MATCH(0,S50:S62,1)-1,\"\")","v":0}]
["","","","","",null,"","",{"$f":"IF(A54=\"\",\"\",$AD$10)","v":""},{"$f":"IFERROR(IF(B54=\"\",\"\",G54-H54-I54),0)","v":""},"","",null,null,4,"",{"$error":"#VALUE!"},{"$error":"#VALUE!"},{"$error":"#VALUE!"}]
[{"$f":"IF(A54<ROUNDUP($O$14/12,0),A54+1,\"\")","v":""},"","","","",null,{"$f":"IFERROR(IF(A55=\"\",\"\",E55-F55),\"\")","v":""},"",{"$f":"IF(A55=\"\",\"\",$AD$11)","v":""},{"$f":"IFERROR(IF(B55=\"\",\"\",G55-H55-I55),0)","v":""},"","",null,null,5,"",{"$error":"#VALUE!"},{"$error":"#VALUE!"},{"$error":"#VALUE!"},null,"VPentradas"]
["","","","","",null,"","",{"$f":"IF(A56=\"\",\"\",$AD$12)","v":""},{"$f":"IFERROR(IF(B56=\"\",\"\",G56-H56-I56),0)","v":""},"","",null,null,6,"",{"$error":"#VALUE!"},{"$error":"#VALUE!"},{"$error":"#VALUE!"},null,{"$f":"NPV(E70,G51:G62)","v":0}]
["","","","","",null,"","",{"$f":"IF(A57=\"\",\"\",$AD$13)","v":""},"","","",null,null,7,"",{"$error":"#VALUE!"},{"$error":"#VALUE!"},{"$error":"#VALUE!"}]
["","","","","",null,"","",{"$f":"IF(A58=\"\",\"\",$AD$14)","v":""},"","",{"$f":"IFERROR(IF(A58=\"\",\"\",(J58/(B58+C58))),\"\")","v":""},null,null,8,"",{"$error":"#VALUE!"},{"$error":"#VALUE!"},{"$error":"#VALUE!"}]
["","","","","",null,"","",{"$f":"IF(A59=\"\",\"\",$AD$15)","v":""},"","","",null,null,9,"",{"$error":"#VALUE!"},{"$error":"#VALUE!"},{"$error":"#VALUE!"}]
["","","","","",null,"","",{"$f":"IF(A60=\"\",\"\",$AD$16)","v":""},"","","",null,null,10,"",{"$error":"#VALUE!"},{"$error":"#VALUE!"},{"$error":"#VALUE!"}]
["","","","","",null,"","",{"$f":"IF(A61=\"\",\"\",$AD$17)","v":""},"","","",null,null,11,"",{"$error":"#VALUE!"},{"$error":"#VALUE!"},{"$error":"#VALUE!"}]
["","","","","",null,"","",{"$f":"IF(A62=\"\",\"\",$AD$18)","v":""},"","","",null,null,12,"",{"$error":"#VALUE!"},{"$error":"#VALUE!"},{"$error":"#VALUE!"}]
[null,{"$f":"SUM(B50:B62)","v":0},{"$f":"SUM(C50:C62)","v":0},{"$f":"SUM(D50:D62)","v":0}]
["37. Indicadores Econômicos"]
["Indicadores",null,null,null,"Resultado",null,null,null,null,null,"Legenda"]
["Taxa Interna de Retorno (TIR)",null,null,null,{"$f":"IFERROR(IRR(G50:G62),0)","v":0},null,null,null,null,null,{"$f":"IF(E66>E70,\"Projeto Viável\",\"Projeto Inviável\")","v":"Projeto Inviável"}]
["Valor Presente Líquido (VPL)",null,null,null,{"$f":"NPV(E70,G50:G62)","v":0},null,null,null,null,null,{"$f":"IF(E67>0,\"Projeto Viável\",\"Projeto Inviável\")","v":"Projeto Inviável"}]
["Payback simples",null,null,null,{"$f":"IFERROR(DATEDIF(V50,V51,\"y\")&\" ano(s) \" &DATEDIF(V50,V51,\"ym\")&\" mês(s) \" &DATEDIF(V50,V51,\"md\")& \" dia(s)\",\"\")","v":""},null,null,null,null,null,"-"]
["Payback descontado",null,null,null,{"$f":"IFERROR(DATEDIF(X50,X51,\"y\")&\" ano(s) \" &DATEDIF(X50,X51,\"ym\")&\" mês(s) \" &DATEDIF(X50,X51,\"md\")& \" dia(s)\",\"\")","v":""},null,null,null,null,null,"-"]
["Taxa Mínima de Atratividade (TMA)",null,null,null,0.13750000000000001,null,null,null,null,null,"-"]
["Relação Custo Benefício (B/C)",null,null,null,{"$f":"IFERROR((B63+C63)/D63,0)","v":0},null,null,null,null,null,{"$f":"IF(E71>1,\"Projeto Viável\",\"Projeto Inviável\")","v":"Projeto Inviável"}]
["Índice de Lucratividade (IL)",null,null,null,{"$f":"IFERROR(-U56/G50,0)","v":0},null,null,null,null,null,{"$f":"IF(E72>1,\"Projeto Viável\",\"Projeto Inviável\")","v":"Projeto Inviável"}]
[]
["38. Cenário 2"]
["Ano","Receita Pecuária","Receita Agricola","Custos","Fluxo Operacional","Desembolsos","Fluxo Liquido","Operações em ser","Amortização","Disponibilidade Líquida",null,"Receita Liquida"]
[null,null,null,null,null,null,null,null,null,"Simples","Acumulada",null,null,null,"ANO","FLUXO DE CAIXA","SALDO","FLUXO DESCONTADO","SALDO",null,"Payback Simples",{"$f":"IFERROR(V80-OFFSET(Q77,V80,0)/OFFSET(P77,V80+1,0),\"\")","v":""},"Payback Descontado",{"$f":"IFERROR(X80-OFFSET(S77,X80,0)/OFFSET(R77,X80+1,0),\"\")","v":""}]
[0,0,0,0,{"$f":"B77+C77-D77","v":0},{"$f":"O6","v":0},{"$f":"E77-F77","v":0},0,0,{"$f":"IF(B77=\"\",\"\",G77-H77-I77)","v":0},{"$f":"J77","v":0},{"$f":"IFERROR(J77/B77+C77,0)","v":0},null,null,0,{"$f":"G77","v":0},{"$f":"P77","v":0},{"$f":"P77","v":0},{"$f":"R77","v":0},null,"Início do Projeto",{"$f":"$V$23","v":"00:00:00"},"Início do Projeto",{"$f":"$X$23","v":"00:00:00"}]
[{"$f":"IF(A77<ROUNDUP($O$14/12,0),A77+1,\"\")","v":""},{"$f":"IF(A78=\"\",\"\",B24*(($L$16/100)+1))","v":""},{"$f":"IF(A78=\"\",\"\",C24*(($L$17/100)+1))","v":""},{"$f":"IF(A78=\"\",\"\",D24*(($L$18/100)+1))","v":""},{"$f":"IFERROR(IF(A78=\"\",\"\",B78+C78-D78),\"\")","v":""},null,{"$f":"IFERROR(IF(A78=\"\",\"\",E78-F78),\"\")","v":""},{"$f":"IF(H24=\"\",\"\",H24)","v":""},{"$f":"IF(A78=\"\",\"\",$AD$7)","v":""},{"$f":"IFERROR(IF(B78=\"\",\"\",G78-H78-I78),0)","v":""},{"$f":"IF(A78=\"\",\"\",J78)","v":""},{"$f":"IFERROR(IF(A78=\"\",\"\",(J78/(B78+C78))),\"\")","v":""},null,null,1,"",{"$f":"P78+Q77","v":{"$error":"#VALUE!"}},{"$f":"PV($E$98,O78,,-P78)","v":{"$error":"#VALUE!"}},{"$f":"R78+S77","v":{"$error":"#VALUE!"}},null,"Recuperação do Projeto",{"$f":"IFERROR(V77+V79,\"\")","v":""},"Recuperação do Projeto",{"$f":"IFERROR(X77+X79,\"\")","v":""}]
[{"$f":"IF(A78<ROUNDUP($O$14/12,0),A78+1,\"\")","v":""},"","","",{"$f":"IFERROR(IF(A79=\"\",\"\",B79+C79-D79),\"\")","v":""},null,{"$f":"IFERROR(IF(A79=\"\",\"\",E79-F79),\"\")","v":""},{"$f":"IF(H25=\"\",\"\",H25)","v":""},{"$f":"IF(A79=\"\",\"\",$AD$8)","v":""},{"$f":"IFERROR(IF(B79=\"\",\"\",G79-H79-I79),0)","v":""},{"$f":"IF(A79=\"\",\"\",J79+K78)","v":""},{"$f":"IFERROR(IF(A79=\"\",\"\",(J79/(B79+C79))),\"\")","v":""},null,null,2,"",{"$error":"#VALUE!"},{"$error":"#VALUE!"},{"$error":"#VALUE!"},null,"Dias",{"$f":"IFERROR(V76*365,\"\")","v":""},"Dias",{"$f":"IFERROR(X76*365,\"\")","v":""}]
["","","","",{"$f":"IFERROR(IF(A80=\"\",\"\",B80+C80-D80),\"\")","v":""},null,"","",{"$f":"IF(A80=\"\",\"\",$AD$9)","v":""},{"$f":"IFERROR(IF(B80=\"\",\"\",G80-H80-I80),0)","v":""},"","",null,null,3,"",{"$error":"#VALUE!"},{"$error":"#VALUE!"},{"$error":"#VALUE!"},null,"Anos",{"$f":"IFERROR(MATCH(0,Q77:Q89,1)-1,\"\")","v":0},"Anos",{"$f":"IFERROR(MATCH(0,S77:S89,1)-1,\"\")","v":0}]
["","","","","",null,"","",{"$f":"IF(A81=\"\",\"\",$AD$10)","v":""},{"$f":"IFERROR(IF(B81=\"\",\"\",G81-H81-I81),0)","v":""},"","",null,null,4,"",{"$error":"#VALUE!"},{"$error":"#VALUE!"},{"$error":"#VALUE!"}]
[{"$f":"IF(A81<ROUNDUP($O$14/12,0),A81+1,\"\")","v":""},"","","","",null,{"$f":"IFERROR(IF(A82=\"\",\"\",E82-F82),\"\")","v":""},"",{"$f":"IF(A82=\"\",\"\",$AD$11)","v":""},{"$f":"IFERROR(IF(B82=\"\",\"\",G82-H82-I82),0)","v":""},"","",null,null,5,"",{"$error":"#VALUE!"},{"$error":"#VALUE!"},{"$error":"#VALUE!"},null,"VPentradas"]
["","","","","",null,"","",{"$f":"IF(A83=\"\",\"\",$AD$12)","v":""},{"$f":"IFERROR(IF(B83=\"\",\"\",G83-H83-I83),0)","v":""},"","",null,null,6,"",{"$error":"#VALUE!"},{"$error":"#VALUE!"},{"$error":"#VALUE!"},null,{"$f":"NPV(E98,G78:G89)","v":0}]
["","","","","",null,"","",{"$f":"IF(A84=\"\",\"\",$AD$13)","v":""},"","","",null,null,7,"",{"$error":"#VALUE!"},{"$error":"#VALUE!"},{"$error":"#VALUE!"}]
["","","","","",null,"","",{"$f":"IF(A85=\"\",\"\",$AD$14)","v":""},"","","",null,null,8,"",{"$error":"#VALUE!"},{"$error":"#VALUE!"},{"$error":"#VALUE!"}]
["","","","","",null,"","",{"$f":"IF(A86=\"\",\"\",$AD$15)","v":""},"","","",null,null,9,"",{"$error":"#VALUE!"},{"$error":"#VALUE!"},{"$error":"#VALUE!"}]
["","","","","",null,"","",{"$f":"IF(A87=\"\",\"\",$AD$16)","v":""},"","","",null,null,10,"",{"$error":"#VALUE!"},{"$error":"#VALUE!"},{"$error":"#VALUE!"}]
["","","","","",null,"","",{"$f":"IF(A88=\"\",\"\",$AD$17)","v":""},"","","",null,null,11,"",{"$error":"#VALUE!"},{"$error":"#VALUE!"},{"$error":"#VALUE!"}]
["","","","",{"$f":"IFERROR(IF(A89=\"\",\"\",B89+C89-D89),\"\")","v":""},null,"",{"$f":"IF(H35=\"\",\"\",H35)","v":""},{"$f":"IF(A89=\"\",\"\",$AD$18)","v":""},"","","",null,null,12,"",{"$error":"#VALUE!"},{"$error":"#VALUE!"},{"$error":"#VALUE!"}]
[null,{"$f":"SUM(B77:B89)","v":0},{"$f":"SUM(C77:C89)","v":0},{"$f":"SUM(D77:D89)","v":0}]
[]
["39. Indicadores Econômicos"]
["Indicadores",null,null,null,"Resultado",null,null,null,null,null,"Legenda"]
["Taxa Interna de Retorno (TIR)",null,null,null,{"$f":"IFERROR(IRR(G77:G89),0)","v":0},null,null,null,null,null,{"$f":"IF(E94>E98,\"Projeto Viável\",\"Projeto Inviável\")","v":"Projeto Inviável"}]
["Valor Presente Líquido (VPL)",null,null,null,{"$f":"NPV(E98,G77:G89)","v":0},null,null,null,null,null,{"$f":"IF(E95>0,\"Projeto Viável\",\"Projeto Inviável\")","v":"Projeto Inviável"}]
["Payback simples",null,null,null,{"$f":"IFERROR(DATEDIF(V9,V78,\"y\")&\" ano(s) \" &DATEDIF(V77,V78,\"ym\")&\" mês(s) \" &DATEDIF(V77,V78,\"md\")& \" dia(s)\",\"\")","v":""},null,null,null,null,null,"-"]
["Payback descontado",null,null,null,{"$f":"IFERROR(DATEDIF(X77,X78,\"y\")&\" ano(s) \" &DATEDIF(X77,X78,\"ym\")&\" mês(s) \" &DATEDIF(X77,X78,\"md\")& \" dia(s)\",\"\")","v":""},null,null,null,null,null,"-"]
["Taxa Mínima de Atratividade (TMA)",null,null,null,0.13750000000000001,null,null,null,null,null,"-"]
["Relação Custo Benefício (B/C)",null,null,null,{"$f":"IFERROR((B90+C90)/D90,0)","v":0},null,null,null,null,null,{"$f":"IF(E99>1,\"Projeto Viável\",\"Projeto Inviável\")","v":"Projeto Inviável"}]
["Índice de Lucratividade (IL)",null,null,null,{"$f":"IFERROR(-U83/G77,0)","v":0},null,null,null,null,null,{"$f":"IF(E100>1,\"Projeto Viável\",\"Projeto Inviável\")","v":"Projeto Inviável"}]
[]
[]
["40. Nota técnica do Elaborador do Projeto"]
[]
[]
[]
[]
[]
[]
[]
[]
[]
[]
[]
[]
[null,{"$f":"IF('Dados Cadastrais'!E9=\"\",\"\",'Dados Cadastrais'!E9)","v":""},null,null,null,null,null,null,{"$f":"IF('Dados Cadastrais'!E29=\"\",\"\",'Dados Cadastrais'!E29)","v":""}]
[null,{"$f":"IF('Dados Cadastrais'!E10=\"\",\"\",'Dados Cadastrais'!E10)","v":""},null,null,null,null,null,null,{"$f":"IF('Dados Cadastrais'!E30=\"\",\"\",'Dados Cadastrais'!E30)","v":""}]

{"sheet":"Enquadramento","index":16,"n_rows":24,"n_cols":7,"rows_kept":24,"cut":false,"hidden":true,"merged":[[13,0,13,6],[19,1,19,6],[0,0,0,6],[1,0,2,0],[1,2,1,6],[6,0,6,6],[7,0,8,0],[7,2,7,6]]}
["Receitas Agropecuárias "]
["Receita Projetada","IRPF","Projetadas"]
[null,"Ano 2023","Ano1 ","Ano 2","Ano 3","Ano 4","Ano 5"]
["Empreendimento não financiado",null,{"$f":"'Mem Atividades não financiadas'!C15","v":0},{"$f":"'Mem Atividades não financiadas'!E15","v":0},{"$f":"'Mem Atividades não financiadas'!G15","v":0},{"$f":"'Mem Atividades não financiadas'!I15","v":0},{"$f":"'Mem Atividades não financiadas'!C31","v":0}]
["Empreendimento Financiado",{"$f":"'Dados Cadastrais'!E19+'Dados Cadastrais'!E27","v":0},{"$f":"'Mem agricultura'!C16+'Mem piscicultura-apicultura'!C16+'Mem pecuaria'!C17+'Mem pecuaria'!C52","v":0},{"$f":"'Mem agricultura'!E16+'Mem piscicultura-apicultura'!E16+'Mem pecuaria'!E17+'Mem pecuaria'!E52","v":0},{"$f":"'Mem agricultura'!G16+'Mem piscicultura-apicultura'!G16+'Mem pecuaria'!G17+'Mem pecuaria'!G52","v":0},{"$f":"'Mem agricultura'!I16+'Mem piscicultura-apicultura'!I16+'Mem pecuaria'!I17+'Mem pecuaria'!I52","v":0},{"$f":"'Mem Atividades não financiadas'!C32+'Mem piscicultura-apicultura'!C34+'Mem pecuaria'!K18+'Mem pecuaria'!K53","v":0}]
["Sub-total",{"$f":"SUM(B4:B5)","v":0},0,0,0,0,0]
["Receitas não Agropecuárias"]
["Receita Projetada","IRPF","Projetadas"]
[null,"Ano 2023","Ano1 ","Ano 2","Ano 3","Ano 4","Ano 5"]
["Salário de Serviços"]
["Aposentadorias e pensões"]
["Outras Atividades "]
["Sub-total",{"$f":"SUM(B10:B12)","v":0},0,0,0,0,0]
["Dados para Enquadramento "]
[null,"Ano 2023","Ano 1","Ano 2","Ano 3","Ano 4","Ano 5"]
["Receitas Agropecuárias ",{"$f":"B6","v":0},{"$f":"C6","v":0},{"$f":"D6","v":0},0,0,0]
["Receitas não Agropecuárias",{"$f":"B13","v":0},0,{"$f":"D13","v":0},0,0,0]
["Renda Bruta Anual (RBA)",{"$f":"SUM(B16:B17)","v":0},{"$f":"SUM(C16:C17)","v":0},0,0,0,0]
["% da Agropecuária",{"$f":"IFERROR(B16/B18,0)","v":0},0,0,0,0,0]
["Porte do Cliente",{"$f":"IFERROR(IF(E22<=C22,A22,IF(E22<=C23,A23,IF(E22>C24,A24))),\"\")","v":""}]
[]
["Pequeno Produtor","ATÉ",500000,null,{"$f":"AVERAGEIF(C18:G18,\">0\",C18:G18)","v":{"$error":"#DIV/0!"}}]
["Médio Produtor","ATÉ",2400000]
["Grande Produtor","MAIOR",2400000]

{"sheet":"Mem Atividades não financiadas","index":17,"n_rows":47,"n_cols":9,"rows_kept":47,"cut":false,"hidden":true,"merged":[[0,0,2,0],[0,1,0,8],[1,1,1,2],[1,3,1,4],[1,5,1,6],[1,7,1,8],[16,0,18,0],[16,1,16,8],[17,1,17,2],[17,3,17,4],[17,5,17,6],[17,7,17,8],[32,0,34,0],[32,1,32,8],[33,1,33,2],[33,3,33,4],[33,5,33,6],[33,7,33,8]]}
["Produtos Comercializados","Produção"]
[null,"Ano 1",null,"Ano 2",null,"Ano 3",null,"Ano 4"]
[null,"Qtd","Valor","Qtd","Valor","Qtd","Valor","Qtd","Valor"]
[{"$f":"'Atividades não financiadas'!A45","v":""},{"$f":"'Atividades não financiadas'!B5*'Atividades não financiadas'!D5","v":0},{"$f":"B4*'Atividades não financiadas'!B45","v":0},{"$f":"'Atividades não financiadas'!B5*'Atividades não financiadas'!E5","v":0},{"$f":"D4*'Atividades não financiadas'!B45","v":0},{"$f":"'Atividades não financiadas'!B5*'Atividades não financiadas'!F5","v":0},{"$f":"F4*'Atividades não financiadas'!B45","v":0},{"$f":"'Atividades não financiadas'!B5*'Atividades não financiadas'!G5","v":0},{"$f":"H4*'Atividades não financiadas'!B45","v":0}]
[{"$f":"'Atividades não financiadas'!A46","v":""},{"$f":"'Atividades não financiadas'!B6*'Atividades não financiadas'!D6","v":0},{"$f":"B5*'Atividades não financiadas'!B46","v":0},{"$f":"'Atividades não financiadas'!B6*'Atividades não financiadas'!E6","v":0},{"$f":"D5*'Atividades não financiadas'!B46","v":0},{"$f":"'Atividades não financiadas'!B6*'Atividades não financiadas'!F6","v":0},{"$f":"F5*'Atividades não financiadas'!B46","v":0},{"$f":"'Atividades não financiadas'!B6*'Atividades não financiadas'!G6","v":0},{"$f":"H5*'Atividades não financiadas'!B46","v":0}]
[{"$f":"'Atividades não financiadas'!A47","v":""},{"$f":"'Atividades não financiadas'!B7*'Atividades não financiadas'!D7","v":0},{"$f":"B6*'Atividades não financiadas'!B47","v":0},{"$f":"'Atividades não financiadas'!B7*'Atividades não financiadas'!E7","v":0},{"$f":"D6*'Atividades não financiadas'!B47","v":0},{"$f":"'Atividades não financiadas'!B7*'Atividades não financiadas'!F7","v":0},{"$f":"F6*'Atividades não financiadas'!B47","v":0},{"$f":"'Atividades não financiadas'!B7*'Atividades não financiadas'!G7","v":0},{"$f":"H6*'Atividades não financiadas'!B47","v":0}]
[{"$f":"'Atividades não financiadas'!A48","v":""},{"$f":"'Atividades não financiadas'!B8*'Atividades não financiadas'!D8","v":0},{"$f":"B7*'Atividades não financiadas'!B48","v":0},{"$f":"'Atividades não financiadas'!B8*'Atividades não financiadas'!E8","v":0},{"$f":"D7*'Atividades não financiadas'!B48","v":0},{"$f":"'Atividades não financiadas'!B8*'Atividades não financiadas'!F8","v":0},{"$f":"F7*'Atividades não financiadas'!B48","v":0},{"$f":"'Atividades não financiadas'!B8*'Atividades não financiadas'!G8","v":0},{"$f":"H7*'Atividades não financiadas'!B48","v":0}]
[{"$f":"'Atividades não financiadas'!A49","v":""},{"$f":"'Atividades não financiadas'!B9*'Atividades não financiadas'!D9","v":0},{"$f":"B8*'Atividades não financiadas'!B49","v":0},{"$f":"'Atividades não financiadas'!B9*'Atividades não financiadas'!E9","v":0},{"$f":"D8*'Atividades não financiadas'!B49","v":0},{"$f":"'Atividades não financiadas'!B9*'Atividades não financiadas'!F9","v":0},{"$f":"F8*'Atividades não financiadas'!B49","v":0},{"$f":"'Atividades não financiadas'!B9*'Atividades não financiadas'!G9","v":0},{"$f":"H8*'Atividades não financiadas'!B49","v":0}]
[{"$f":"'Atividades não financiadas'!A50","v":""},{"$f":"'Atividades não financiadas'!B10*'Atividades não financiadas'!D10","v":0},{"$f":"B9*'Atividades não financiadas'!B50","v":0},{"$f":"'Atividades não financiadas'!B10*'Atividades não financiadas'!E10","v":0},{"$f":"D9*'Atividades não financiadas'!B50","v":0},{"$f":"'Atividades não financiadas'!B10*'Atividades não financiadas'!F10","v":0},{"$f":"F9*'Atividades não financiadas'!B50","v":0},{"$f":"'Atividades não financiadas'!B10*'Atividades não financiadas'!G10","v":0},{"$f":"H9*'Atividades não financiadas'!B50","v":0}]
[{"$f":"'Atividades não financiadas'!A51","v":""},{"$f":"'Atividades não financiadas'!B11*'Atividades não financiadas'!D11","v":0},{"$f":"B10*'Atividades não financiadas'!B51","v":0},{"$f":"'Atividades não financiadas'!B11*'Atividades não financiadas'!E11","v":0},{"$f":"D10*'Atividades não financiadas'!B51","v":0},{"$f":"'Atividades não financiadas'!B11*'Atividades não financiadas'!F11","v":0},{"$f":"F10*'Atividades não financiadas'!B51","v":0},{"$f":"'Atividades não financiadas'!B11*'Atividades não financiadas'!G11","v":0},{"$f":"H10*'Atividades não financiadas'!B51","v":0}]
[{"$f":"'Atividades não financiadas'!A52","v":""},{"$f":"'Atividades não financiadas'!B12*'Atividades não financiadas'!D12","v":0},{"$f":"B11*'Atividades não financiadas'!B52","v":0},{"$f":"'Atividades não financiadas'!B12*'Atividades não financiadas'!E12","v":0},{"$f":"D11*'Atividades não financiadas'!B52","v":0},{"$f":"'Atividades não financiadas'!B12*'Atividades não financiadas'!F12","v":0},{"$f":"F11*'Atividades não financiadas'!B52","v":0},{"$f":"'Atividades não financiadas'!B12*'Atividades não financiadas'!G12","v":0},{"$f":"H11*'Atividades não financiadas'!B52","v":0}]
[{"$f":"'Atividades não financiadas'!A53","v":""},{"$f":"'Atividades não financiadas'!B13*'Atividades não financiadas'!D13","v":0},{"$f":"B12*'Atividades não financiadas'!B53","v":0},{"$f":"'Atividades não financiadas'!B13*'Atividades não financiadas'!E13","v":0},{"$f":"D12*'Atividades não financiadas'!B53","v":0},{"$f":"'Atividades não financiadas'!B13*'Atividades não financiadas'!F13","v":0},{"$f":"F12*'Atividades não financiadas'!B53","v":0},{"$f":"'Atividades não financiadas'!B13*'Atividades não financiadas'!G13","v":0},{"$f":"H12*'Atividades não financiadas'!B53","v":0}]
[{"$f":"'Atividades não financiadas'!A54","v":""},{"$f":"'Atividades não financiadas'!B14*'Atividades não financiadas'!D14","v":0},{"$f":"B13*'Atividades não financiadas'!B54","v":0},{"$f":"'Atividades não financiadas'!B14*'Atividades não financiadas'!E14","v":0},{"$f":"D13*'Atividades não financiadas'!B54","v":0},{"$f":"'Atividades não financiadas'!B14*'Atividades não financiadas'!F14","v":0},{"$f":"F13*'Atividades não financiadas'!B54","v":0},{"$f":"'Atividades não financiadas'!B14*'Atividades não financiadas'!G14","v":0},{"$f":"H13*'Atividades não financiadas'!B54","v":0}]
[{"$f":"'Atividades não financiadas'!A55","v":""},{"$f":"'Atividades não financiadas'!B15*'Atividades não financiadas'!D15","v":0},{"$f":"B14*'Atividades não financiadas'!B55","v":0},{"$f":"'Atividades não financiadas'!B15*'Atividades não financiadas'!E15","v":0},{"$f":"D14*'Atividades não financiadas'!B55","v":0},{"$f":"'Atividades não financiadas'!B15*'Atividades não financiadas'!F15","v":0},{"$f":"F14*'Atividades não financiadas'!B55","v":0},{"$f":"'Atividades não financiadas'!B15*'Atividades não financiadas'!G15","v":0},{"$f":"H14*'Atividades não financiadas'!B55","v":0}]
["Total",null,{"$f":"SUM(C4:C14)","v":0},null,{"$f":"SUM(E4:E14)","v":0},null,{"$f":"SUM(G4:G14)","v":0},null,{"$f":"SUM(I4:I14)","v":0}]
[]
["Produtos Comercializados","Produção"]
[null,"Ano 5",null,"Ano 6",null,"Ano 7",null,"Ano 8"]
[null,"Qtd","Valor","Qtd","Valor","Qtd","Valor","Qtd","Valor"]
[{"$f":"'Atividades não financiadas'!A45","v":""},{"$f":"'Atividades não financiadas'!B18*'Atividades não financiadas'!D18","v":0},{"$f":"B20*'Atividades não financiadas'!B45","v":0},{"$f":"'Atividades não financiadas'!B18*'Atividades não financiadas'!E18","v":0},{"$f":"D20*'Atividades não financiadas'!B45","v":0},{"$f":"'Atividades não financiadas'!B18*'Atividades não financiadas'!F18","v":0},{"$f":"F20*'Atividades não financiadas'!B45","v":0},{"$f":"'Atividades não financiadas'!B18*'Atividades não financiadas'!G18","v":0},{"$f":"H20*'Atividades não financiadas'!B45","v":0}]
[{"$f":"'Atividades não financiadas'!A46","v":""},{"$f":"'Atividades não financiadas'!B19*'Atividades não financiadas'!D19","v":0},{"$f":"B21*'Atividades não financiadas'!B46","v":0},{"$f":"'Atividades não financiadas'!B19*'Atividades não financiadas'!E19","v":0},{"$f":"D21*'Atividades não financiadas'!B46","v":0},{"$f":"'Atividades não financiadas'!B19*'Atividades não financiadas'!F19","v":0},{"$f":"F21*'Atividades não financiadas'!B46","v":0},{"$f":"'Atividades não financiadas'!B19*'Atividades não financiadas'!G19","v":0},{"$f":"H21*'Atividades não financiadas'!B46","v":0}]
[{"$f":"'Atividades não financiadas'!A47","v":""},{"$f":"'Atividades não financiadas'!B20*'Atividades não financiadas'!D20","v":0},{"$f":"B22*'Atividades não financiadas'!B47","v":0},{"$f":"'Atividades não financiadas'!B20*'Atividades não financiadas'!E20","v":0},{"$f":"D22*'Atividades não financiadas'!B47","v":0},{"$f":"'Atividades não financiadas'!B20*'Atividades não financiadas'!F20","v":0},{"$f":"F22*'Atividades não financiadas'!B47","v":0},{"$f":"'Atividades não financiadas'!B20*'Atividades não financiadas'!G20","v":0},{"$f":"H22*'Atividades não financiadas'!B47","v":0}]
[{"$f":"'Atividades não financiadas'!A48","v":""},{"$f":"'Atividades não financiadas'!B21*'Atividades não financiadas'!D21","v":0},{"$f":"B23*'Atividades não financiadas'!B48","v":0},{"$f":"'Atividades não financiadas'!B21*'Atividades não financiadas'!E21","v":0},{"$f":"D23*'Atividades não financiadas'!B48","v":0},{"$f":"'Atividades não financiadas'!B21*'Atividades não financiadas'!F21","v":0},{"$f":"F23*'Atividades não financiadas'!B48","v":0},{"$f":"'Atividades não financiadas'!B21*'Atividades não financiadas'!G21","v":0},{"$f":"H23*'Atividades não financiadas'!B48","v":0}]
[{"$f":"'Atividades não financiadas'!A49","v":""},{"$f":"'Atividades não financiadas'!B22*'Atividades não financiadas'!D22","v":0},{"$f":"B24*'Atividades não financiadas'!B49","v":0},{"$f":"'Atividades não financiadas'!B22*'Atividades não financiadas'!E22","v":0},{"$f":"D24*'Atividades não financiadas'!B49","v":0},{"$f":"'Atividades não financiadas'!B22*'Atividades não financiadas'!F22","v":0},{"$f":"F24*'Atividades não financiadas'!B49","v":0},{"$f":"'Atividades não financiadas'!B22*'Atividades não financiadas'!G22","v":0},{"$f":"H24*'Atividades não financiadas'!B49","v":0}]
[{"$f":"'Atividades não financiadas'!A50","v":""},{"$f":"'Atividades não financiadas'!B23*'Atividades não financiadas'!D23","v":0},{"$f":"B25*'Atividades não financiadas'!B50","v":0},{"$f":"'Atividades não financiadas'!B23*'Atividades não financiadas'!E23","v":0},{"$f":"D25*'Atividades não financiadas'!B50","v":0},{"$f":"'Atividades não financiadas'!B23*'Atividades não financiadas'!F23","v":0},{"$f":"F25*'Atividades não financiadas'!B50","v":0},{"$f":"'Atividades não financiadas'!B23*'Atividades não financiadas'!G23","v":0},{"$f":"H25*'Atividades não financiadas'!B50","v":0}]
[{"$f":"'Atividades não financiadas'!A51","v":""},{"$f":"'Atividades não financiadas'!B24*'Atividades não financiadas'!D24","v":0},{"$f":"B26*'Atividades não financiadas'!B51","v":0},{"$f":"'Atividades não financiadas'!B24*'Atividades não financiadas'!E24","v":0},{"$f":"D26*'Atividades não financiadas'!B51","v":0},{"$f":"'Atividades não financiadas'!B24*'Atividades não financiadas'!F24","v":0},{"$f":"F26*'Atividades não financiadas'!B51","v":0},{"$f":"'Atividades não financiadas'!B24*'Atividades não financiadas'!G24","v":0},{"$f":"H26*'Atividades não financiadas'!B51","v":0}]
[{"$f":"'Atividades não financiadas'!A52","v":""},{"$f":"'Atividades não financiadas'!B25*'Atividades não financiadas'!D25","v":0},{"$f":"B27*'Atividades não financiadas'!B52","v":0},{"$f":"'Atividades não financiadas'!B25*'Atividades não financiadas'!E25","v":0},{"$f":"D27*'Atividades não financiadas'!B52","v":0},{"$f":"'Atividades não financiadas'!B25*'Atividades não financiadas'!F25","v":0},{"$f":"F27*'Atividades não financiadas'!B52","v":0},{"$f":"'Atividades não financiadas'!B25*'Atividades não financiadas'!G25","v":0},{"$f":"H27*'Atividades não financiadas'!B52","v":0}]
[{"$f":"'Atividades não financiadas'!A53","v":""},{"$f":"'Atividades não financiadas'!B26*'Atividades não financiadas'!D26","v":0},{"$f":"B28*'Atividades não financiadas'!B53","v":0},{"$f":"'Atividades não financiadas'!B26*'Atividades não financiadas'!E26","v":0},{"$f":"D28*'Atividades não financiadas'!B53","v":0},{"$f":"'Atividades não financiadas'!B26*'Atividades não financiadas'!F26","v":0},{"$f":"F28*'Atividades não financiadas'!B53","v":0},{"$f":"'Atividades não financiadas'!B26*'Atividades não financiadas'!G26","v":0},{"$f":"H28*'Atividades não financiadas'!B53","v":0}]
[{"$f":"'Atividades não financiadas'!A54","v":""},{"$f":"'Atividades não financiadas'!B27*'Atividades não financiadas'!D27","v":0},{"$f":"B29*'Atividades não financiadas'!B54","v":0},{"$f":"'Atividades não financiadas'!B27*'Atividades não financiadas'!E27","v":0},{"$f":"D29*'Atividades não financiadas'!B54","v":0},{"$f":"'Atividades não financiadas'!B27*'Atividades não financiadas'!F27","v":0},{"$f":"F29*'Atividades não financiadas'!B54","v":0},{"$f":"'Atividades não financiadas'!B27*'Atividades não financiadas'!G27","v":0},{"$f":"H29*'Atividades não financiadas'!B54","v":0}]
[{"$f":"'Atividades não financiadas'!A55","v":""},{"$f":"'Atividades não financiadas'!B28*'Atividades não financiadas'!D28","v":0},{"$f":"B30*'Atividades não financiadas'!B55","v":0},{"$f":"'Atividades não financiadas'!B28*'Atividades não financiadas'!E28","v":0},{"$f":"D30*'Atividades não financiadas'!B55","v":0},{"$f":"'Atividades não financiadas'!B28*'Atividades não financiadas'!F28","v":0},{"$f":"F30*'Atividades não financiadas'!B55","v":0},{"$f":"'Atividades não financiadas'!B28*'Atividades não financiadas'!G28","v":0},{"$f":"H30*'Atividades não financiadas'!B55","v":0}]
["Total",null,{"$f":"SUM(C20:C30)","v":0},null,{"$f":"SUM(E20:E30)","v":0},null,{"$f":"SUM(G20:G30)","v":0},null,{"$f":"SUM(I20:I30)","v":0}]
[]
["Produtos Comercializados","Produção"]
[null,"Ano 9",null,"Ano 10",null,"Ano 11",null,"Ano 12"]
[null,"Qtd","Valor","Qtd","Valor","Qtd","Valor","Qtd","Valor"]
[{"$f":"'Atividades não financiadas'!A45","v":""},{"$f":"'Atividades não financiadas'!B31*'Atividades não financiadas'!D31","v":0},{"$f":"B36*'Atividades não financiadas'!B45","v":0},{"$f":"'Atividades não financiadas'!B31*'Atividades não financiadas'!E31","v":0},{"$f":"D36*'Atividades não financiadas'!B45","v":0},{"$f":"'Atividades não financiadas'!B31*'Atividades não financiadas'!F31","v":0},{"$f":"F36*'Atividades não financiadas'!B45","v":0},{"$f":"'Atividades não financiadas'!B31*'Atividades não financiadas'!G31","v":0},{"$f":"H36*'Atividades não financiadas'!B45","v":0}]
[{"$f":"'Atividades não financiadas'!A46","v":""},{"$f":"'Atividades não financiadas'!B32*'Atividades não financiadas'!D32","v":0},{"$f":"B37*'Atividades não financiadas'!B46","v":0},{"$f":"'Atividades não financiadas'!B32*'Atividades não financiadas'!E32","v":0},{"$f":"D37*'Atividades não financiadas'!B46","v":0},{"$f":"'Atividades não financiadas'!B32*'Atividades não financiadas'!F32","v":0},{"$f":"F37*'Atividades não financiadas'!B46","v":0},{"$f":"'Atividades não financiadas'!B32*'Atividades não financiadas'!G32","v":0},{"$f":"H37*'Atividades não financiadas'!B46","v":0}]
[{"$f":"'Atividades não financiadas'!A47","v":""},{"$f":"'Atividades não financiadas'!B33*'Atividades não financiadas'!D33","v":0},{"$f":"B38*'Atividades não financiadas'!B47","v":0},{"$f":"'Atividades não financiadas'!B33*'Atividades não financiadas'!E33","v":0},{"$f":"D38*'Atividades não financiadas'!B47","v":0},{"$f":"'Atividades não financiadas'!B33*'Atividades não financiadas'!F33","v":0},{"$f":"F38*'Atividades não financiadas'!B47","v":0},{"$f":"'Atividades não financiadas'!B33*'Atividades não financiadas'!G33","v":0},{"$f":"H38*'Atividades não financiadas'!B47","v":0}]
[{"$f":"'Atividades não financiadas'!A48","v":""},{"$f":"'Atividades não financiadas'!B34*'Atividades não financiadas'!D34","v":0},{"$f":"B39*'Atividades não financiadas'!B48","v":0},{"$f":"'Atividades não financiadas'!B34*'Atividades não financiadas'!E34","v":0},{"$f":"D39*'Atividades não financiadas'!B48","v":0},{"$f":"'Atividades não financiadas'!B34*'Atividades não financiadas'!F34","v":0},{"$f":"F39*'Atividades não financiadas'!B48","v":0},{"$f":"'Atividades não financiadas'!B34*'Atividades não financiadas'!G34","v":0},{"$f":"H39*'Atividades não financiadas'!B48","v":0}]
[{"$f":"'Atividades não financiadas'!A49","v":""},{"$f":"'Atividades não financiadas'!B35*'Atividades não financiadas'!D35","v":0},{"$f":"B40*'Atividades não financiadas'!B49","v":0},{"$f":"'Atividades não financiadas'!B35*'Atividades não financiadas'!E35","v":0},{"$f":"D40*'Atividades não financiadas'!B49","v":0},{"$f":"'Atividades não financiadas'!B35*'Atividades não financiadas'!F35","v":0},{"$f":"F40*'Atividades não financiadas'!B49","v":0},{"$f":"'Atividades não financiadas'!B35*'Atividades não financiadas'!G35","v":0},{"$f":"H40*'Atividades não financiadas'!B49","v":0}]
[{"$f":"'Atividades não financiadas'!A50","v":""},{"$f":"'Atividades não financiadas'!B36*'Atividades não financiadas'!D36","v":0},{"$f":"B41*'Atividades não financiadas'!B50","v":0},{"$f":"'Atividades não financiadas'!B36*'Atividades não financiadas'!E36","v":0},{"$f":"D41*'Atividades não financiadas'!B50","v":0},{"$f":"'Atividades não financiadas'!B36*'Atividades não financiadas'!F36","v":0},{"$f":"F41*'Atividades não financiadas'!B50","v":0},{"$f":"'Atividades não financiadas'!B36*'Atividades não financiadas'!G36","v":0},{"$f":"H41*'Atividades não financiadas'!B50","v":0}]
[{"$f":"'Atividades não financiadas'!A51","v":""},{"$f":"'Atividades não financiadas'!B37*'Atividades não financiadas'!D37","v":0},{"$f":"B42*'Atividades não financiadas'!B51","v":0},{"$f":"'Atividades não financiadas'!B37*'Atividades não financiadas'!E37","v":0},{"$f":"D42*'Atividades não financiadas'!B51","v":0},{"$f":"'Atividades não financiadas'!B37*'Atividades não financiadas'!F37","v":0},{"$f":"F42*'Atividades não financiadas'!B51","v":0},{"$f":"'Atividades não financiadas'!B37*'Atividades não financiadas'!G37","v":0},{"$f":"H42*'Atividades não financiadas'!B51","v":0}]
[{"$f":"'Atividades não financiadas'!A52","v":""},{"$f":"'Atividades não financiadas'!B38*'Atividades não financiadas'!D38","v":0},{"$f":"B43*'Atividades não financiadas'!B52","v":0},{"$f":"'Atividades não financiadas'!B38*'Atividades não financiadas'!E38","v":0},{"$f":"D43*'Atividades não financiadas'!B52","v":0},{"$f":"'Atividades não financiadas'!B38*'Atividades não financiadas'!F38","v":0},{"$f":"F43*'Atividades não financiadas'!B52","v":0},{"$f":"'Atividades não financiadas'!B38*'Atividades não financiadas'!G38","v":0},{"$f":"H43*'Atividades não financiadas'!B52","v":0}]
[{"$f":"'Atividades não financiadas'!A53","v":""},{"$f":"'Atividades não financiadas'!B39*'Atividades não financiadas'!D39","v":0},{"$f":"B44*'Atividades não financiadas'!B53","v":0},{"$f":"'Atividades não financiadas'!B39*'Atividades não financiadas'!E39","v":0},{"$f":"D44*'Atividades não financiadas'!B53","v":0},{"$f":"'Atividades não financiadas'!B39*'Atividades não financiadas'!F39","v":0},{"$f":"F44*'Atividades não financiadas'!B53","v":0},{"$f":"'Atividades não financiadas'!B39*'Atividades não financiadas'!G39","v":0},{"$f":"H44*'Atividades não financiadas'!B53","v":0}]
[{"$f":"'Atividades não financiadas'!A54","v":""},{"$f":"'Atividades não financiadas'!B40*'Atividades não financiadas'!D40","v":0},{"$f":"B45*'Atividades não financiadas'!B54","v":0},{"$f":"'Atividades não financiadas'!B40*'Atividades não financiadas'!E40","v":0},{"$f":"D45*'Atividades não financiadas'!B54","v":0},{"$f":"'Atividades não financiadas'!B40*'Atividades não financiadas'!F40","v":0},{"$f":"F45*'Atividades não financiadas'!B54","v":0},{"$f":"'Atividades não financiadas'!B40*'Atividades não financiadas'!G40","v":0},{"$f":"H45*'Atividades não financiadas'!B54","v":0}]
[{"$f":"'Atividades não financiadas'!A55","v":""},{"$f":"'Atividades não financiadas'!B41*'Atividades não financiadas'!D41","v":0},{"$f":"B46*'Atividades não financiadas'!B55","v":0},{"$f":"'Atividades não financiadas'!B41*'Atividades não financiadas'!E41","v":0},{"$f":"D46*'Atividades não financiadas'!B55","v":0},{"$f":"'Atividades não financiadas'!B41*'Atividades não financiadas'!F41","v":0},{"$f":"F46*'Atividades não financiadas'!B55","v":0},{"$f":"'Atividades não financiadas'!B41*'Atividades não financiadas'!G41","v":0},{"$f":"H46*'Atividades não financiadas'!B55","v":0}]
["Total",null,{"$f":"SUM(C36:C46)","v":0},null,{"$f":"SUM(E36:E46)","v":0},null,{"$f":"SUM(G36:G46)","v":0},null,{"$f":"SUM(I36:I46)","v":0}]

{"sheet":"Mem agricultura","index":18,"n_rows":64,"n_cols":9,"rows_kept":64,"cut":false,"hidden":true,"merged":[[0,0,2,0],[0,1,0,8],[1,1,1,2],[1,3,1,4],[1,5,1,6],[1,7,1,8],[17,0,19,0],[17,1,17,8],[18,1,18,2],[18,3,18,4],[18,5,18,6],[18,7,18,8],[51,0,52,0],[51,1,51,8],[58,0,59,0],[58,1,58,8],[34,0,36,0],[34,1,34,8],[35,1,35,2],[35,3,35,4],[35,5,35,6],[35,7,35,8]]}
["Produtos Comercializados","Produção"]
[null,"Ano 1",null,"Ano 2",null,"Ano 3",null,"Ano 4"]
[null,"Qtd","Valor","Qtd","Valor","Qtd","Valor","Qtd","Valor"]
[{"$f":"Agricultura!A48","v":""},{"$f":"Agricultura!B5*Agricultura!D5","v":0},{"$f":"B4*Agricultura!B48","v":0},{"$f":"Agricultura!B5*Agricultura!E5","v":0},{"$f":"D4*Agricultura!$B$48","v":0},{"$f":"Agricultura!B5*Agricultura!F5","v":0},{"$f":"F4*Agricultura!$B$48","v":0},{"$f":"Agricultura!B5*Agricultura!G5","v":0},{"$f":"H4*Agricultura!$B$48","v":0}]
[{"$f":"Agricultura!A49","v":""},{"$f":"Agricultura!B6*Agricultura!D6","v":0},{"$f":"B5*Agricultura!B49","v":0},{"$f":"Agricultura!B6*Agricultura!E6","v":0},{"$f":"D5*Agricultura!$B$49","v":0},{"$f":"Agricultura!B6*Agricultura!F6","v":0},{"$f":"F5*Agricultura!$B$49","v":0},{"$f":"Agricultura!B6*Agricultura!G6","v":0},{"$f":"H5*Agricultura!$B$49","v":0}]
[{"$f":"Agricultura!A50","v":""},{"$f":"Agricultura!B7*Agricultura!D7","v":0},{"$f":"B6*Agricultura!B50","v":0},{"$f":"Agricultura!B7*Agricultura!E7","v":0},{"$f":"D6*Agricultura!$B$50","v":0},{"$f":"Agricultura!B7*Agricultura!F7","v":0},{"$f":"F6*Agricultura!$B$50","v":0},{"$f":"Agricultura!B7*Agricultura!G7","v":0},{"$f":"H6*Agricultura!$B$50","v":0}]
[{"$f":"Agricultura!A51","v":""},{"$f":"Agricultura!B8*Agricultura!D8","v":0},{"$f":"B7*Agricultura!B51","v":0},{"$f":"Agricultura!B8*Agricultura!E8","v":0},{"$f":"D7*Agricultura!$B$51","v":0},{"$f":"Agricultura!B8*Agricultura!F8","v":0},{"$f":"F7*Agricultura!$B$51","v":0},{"$f":"Agricultura!B8*Agricultura!G8","v":0},{"$f":"H7*Agricultura!$B$51","v":0}]
[{"$f":"Agricultura!A52","v":""},{"$f":"Agricultura!B9*Agricultura!D9","v":0},{"$f":"B8*Agricultura!B52","v":0},{"$f":"Agricultura!B9*Agricultura!E9","v":0},{"$f":"D8*Agricultura!$B$52","v":0},{"$f":"Agricultura!B9*Agricultura!F9","v":0},{"$f":"F8*Agricultura!$B$52","v":0},{"$f":"Agricultura!B9*Agricultura!G9","v":0},{"$f":"H8*Agricultura!$B$52","v":0}]
[{"$f":"Agricultura!A53","v":""},{"$f":"Agricultura!B10*Agricultura!D10","v":0},{"$f":"B9*Agricultura!B53","v":0},{"$f":"Agricultura!B10*Agricultura!E10","v":0},{"$f":"D9*Agricultura!$B$53","v":0},{"$f":"Agricultura!B10*Agricultura!F10","v":0},{"$f":"F9*Agricultura!$B$53","v":0},{"$f":"Agricultura!B10*Agricultura!G10","v":0},{"$f":"H9*Agricultura!$B$53","v":0}]
[{"$f":"Agricultura!A54","v":""},{"$f":"Agricultura!B11*Agricultura!D11","v":0},{"$f":"B10*Agricultura!B54","v":0},{"$f":"Agricultura!B11*Agricultura!E11","v":0},{"$f":"D10*Agricultura!$B$54","v":0},{"$f":"Agricultura!B11*Agricultura!F11","v":0},{"$f":"F10*Agricultura!$B$54","v":0},{"$f":"Agricultura!B11*Agricultura!G11","v":0},{"$f":"H10*Agricultura!$B$54","v":0}]
[{"$f":"Agricultura!A55","v":""},{"$f":"Agricultura!B12*Agricultura!D12","v":0},{"$f":"B11*Agricultura!B55","v":0},{"$f":"Agricultura!B12*Agricultura!E12","v":0},{"$f":"D11*Agricultura!$B$55","v":0},{"$f":"Agricultura!B12*Agricultura!F12","v":0},{"$f":"F11*Agricultura!$B$55","v":0},{"$f":"Agricultura!B12*Agricultura!G12","v":0},{"$f":"H11*Agricultura!$B$55","v":0}]
[{"$f":"Agricultura!A56","v":""},{"$f":"Agricultura!B13*Agricultura!D13","v":0},{"$f":"B12*Agricultura!B56","v":0},{"$f":"Agricultura!B13*Agricultura!E13","v":0},{"$f":"D12*Agricultura!$B$56","v":0},{"$f":"Agricultura!B13*Agricultura!F13","v":0},{"$f":"F12*Agricultura!$B$56","v":0},{"$f":"Agricultura!B13*Agricultura!G13","v":0},{"$f":"H12*Agricultura!$B$56","v":0}]
[{"$f":"Agricultura!A57","v":""},{"$f":"Agricultura!B14*Agricultura!D14","v":0},{"$f":"B13*Agricultura!B57","v":0},{"$f":"Agricultura!B14*Agricultura!E14","v":0},{"$f":"D13*Agricultura!$B$57","v":0},{"$f":"Agricultura!B14*Agricultura!F14","v":0},{"$f":"F13*Agricultura!$B$57","v":0},{"$f":"Agricultura!B14*Agricultura!G14","v":0},{"$f":"H13*Agricultura!$B$57","v":0}]
[{"$f":"Agricultura!A58","v":""},{"$f":"Agricultura!B15*Agricultura!D15","v":0},{"$f":"B14*Agricultura!B58","v":0},{"$f":"Agricultura!B15*Agricultura!E15","v":0},{"$f":"D14*Agricultura!$B$58","v":0},{"$f":"Agricultura!B15*Agricultura!F15","v":0},{"$f":"F14*Agricultura!$B$58","v":0},{"$f":"Agricultura!B15*Agricultura!G15","v":0},{"$f":"H14*Agricultura!$B$58","v":0}]
[{"$f":"Agricultura!A59","v":""},{"$f":"Agricultura!B16*Agricultura!D16","v":0},{"$f":"B15*Agricultura!B59","v":0},{"$f":"Agricultura!B16*Agricultura!E16","v":0},{"$f":"D15*Agricultura!$B$59","v":0},{"$f":"Agricultura!B16*Agricultura!F16","v":0},{"$f":"F15*Agricultura!$B$59","v":0},{"$f":"Agricultura!B16*Agricultura!G16","v":0},{"$f":"H15*Agricultura!$B$59","v":0}]
["Total",null,{"$f":"SUM(C4:C15)","v":0},null,{"$f":"SUM(E4:E15)","v":0},null,{"$f":"SUM(G4:G15)","v":0},null,{"$f":"SUM(I4:I15)","v":0}]
[]
["Produtos Comercializados","Produção"]
[null,"Ano 5",null,"Ano 6",null,"Ano 7",null,"Ano 8"]
[null,"Qtd","Valor","Qtd","Valor","Qtd","Valor","Qtd","Valor"]
[{"$f":"Agricultura!A48","v":""},{"$f":"Agricultura!$B$19*Agricultura!D19","v":0},{"$f":"B21*Agricultura!$B$48","v":0},{"$f":"Agricultura!$B19*Agricultura!E19","v":0},{"$f":"D21*Agricultura!$B$48","v":0},{"$f":"Agricultura!$B19*Agricultura!F19","v":0},{"$f":"F21*Agricultura!$B$48","v":0},{"$f":"Agricultura!$B19*Agricultura!G19","v":0},{"$f":"H21*Agricultura!$B$48","v":0}]
[{"$f":"Agricultura!A49","v":""},{"$f":"Agricultura!$B$20*Agricultura!D20","v":0},{"$f":"B22*Agricultura!$B$49","v":0},{"$f":"Agricultura!$B20*Agricultura!E20","v":0},{"$f":"D22*Agricultura!$B$49","v":0},{"$f":"Agricultura!$B20*Agricultura!F20","v":0},{"$f":"F22*Agricultura!$B$49","v":0},{"$f":"Agricultura!$B20*Agricultura!G20","v":0},{"$f":"H22*Agricultura!$B$49","v":0}]
[{"$f":"Agricultura!A50","v":""},{"$f":"Agricultura!$B$21*Agricultura!D21","v":0},{"$f":"B23*Agricultura!$B$50","v":0},{"$f":"Agricultura!$B21*Agricultura!E21","v":0},{"$f":"D23*Agricultura!$B$50","v":0},{"$f":"Agricultura!$B21*Agricultura!F21","v":0},{"$f":"F23*Agricultura!$B$50","v":0},{"$f":"Agricultura!$B21*Agricultura!G21","v":0},{"$f":"H23*Agricultura!$B$50","v":0}]
[{"$f":"Agricultura!A51","v":""},{"$f":"Agricultura!$B$22*Agricultura!D22","v":0},{"$f":"B24*Agricultura!$B$51","v":0},{"$f":"Agricultura!$B22*Agricultura!E22","v":0},{"$f":"D24*Agricultura!$B$51","v":0},{"$f":"Agricultura!$B22*Agricultura!F22","v":0},{"$f":"F24*Agricultura!$B$51","v":0},{"$f":"Agricultura!$B22*Agricultura!G22","v":0},{"$f":"H24*Agricultura!$B$51","v":0}]
[{"$f":"Agricultura!A52","v":""},{"$f":"Agricultura!$B$23*Agricultura!D23","v":0},{"$f":"B25*Agricultura!$B$52","v":0},{"$f":"Agricultura!$B23*Agricultura!E23","v":0},{"$f":"D25*Agricultura!$B$52","v":0},{"$f":"Agricultura!$B23*Agricultura!F23","v":0},{"$f":"F25*Agricultura!$B$52","v":0},{"$f":"Agricultura!$B23*Agricultura!G23","v":0},{"$f":"H25*Agricultura!$B$52","v":0}]
[{"$f":"Agricultura!A53","v":""},{"$f":"Agricultura!$B$24*Agricultura!D24","v":0},{"$f":"B26*Agricultura!$B$53","v":0},{"$f":"Agricultura!$B24*Agricultura!E24","v":0},{"$f":"D26*Agricultura!$B$53","v":0},{"$f":"Agricultura!$B24*Agricultura!F24","v":0},{"$f":"F26*Agricultura!$B$53","v":0},{"$f":"Agricultura!$B24*Agricultura!G24","v":0},{"$f":"H26*Agricultura!$B$53","v":0}]
[{"$f":"Agricultura!A54","v":""},{"$f":"Agricultura!$B$25*Agricultura!D25","v":0},{"$f":"B27*Agricultura!$B$54","v":0},{"$f":"Agricultura!$B25*Agricultura!E25","v":0},{"$f":"D27*Agricultura!$B$54","v":0},{"$f":"Agricultura!$B25*Agricultura!F25","v":0},{"$f":"F27*Agricultura!$B$54","v":0},{"$f":"Agricultura!$B25*Agricultura!G25","v":0},{"$f":"H27*Agricultura!$B$54","v":0}]
[{"$f":"Agricultura!A55","v":""},{"$f":"Agricultura!$B$26*Agricultura!D26","v":0},{"$f":"B28*Agricultura!$B$55","v":0},{"$f":"Agricultura!$B26*Agricultura!E26","v":0},{"$f":"D28*Agricultura!$B$55","v":0},{"$f":"Agricultura!$B26*Agricultura!F26","v":0},{"$f":"F28*Agricultura!$B$55","v":0},{"$f":"Agricultura!$B26*Agricultura!G26","v":0},{"$f":"H28*Agricultura!$B$55","v":0}]
[{"$f":"Agricultura!A56","v":""},{"$f":"Agricultura!$B$27*Agricultura!D27","v":0},{"$f":"B29*Agricultura!$B$56","v":0},{"$f":"Agricultura!$B27*Agricultura!E27","v":0},{"$f":"D29*Agricultura!$B$56","v":0},{"$f":"Agricultura!$B27*Agricultura!F27","v":0},{"$f":"F29*Agricultura!$B$56","v":0},{"$f":"Agricultura!$B27*Agricultura!G27","v":0},{"$f":"H29*Agricultura!$B$56","v":0}]
[{"$f":"Agricultura!A57","v":""},{"$f":"Agricultura!$B$28*Agricultura!D28","v":0},{"$f":"B30*Agricultura!$B$57","v":0},{"$f":"Agricultura!$B28*Agricultura!E28","v":0},{"$f":"D30*Agricultura!$B$57","v":0},{"$f":"Agricultura!$B28*Agricultura!F28","v":0},{"$f":"F30*Agricultura!$B$57","v":0},{"$f":"Agricultura!$B28*Agricultura!G28","v":0},{"$f":"H30*Agricultura!$B$57","v":0}]
[{"$f":"Agricultura!A58","v":""},{"$f":"Agricultura!$B$29*Agricultura!D29","v":0},{"$f":"B31*Agricultura!$B$58","v":0},{"$f":"Agricultura!$B29*Agricultura!E29","v":0},{"$f":"D31*Agricultura!$B$58","v":0},{"$f":"Agricultura!$B29*Agricultura!F29","v":0},{"$f":"F31*Agricultura!$B$58","v":0},{"$f":"Agricultura!$B29*Agricultura!G29","v":0},{"$f":"H31*Agricultura!$B$58","v":0}]
[{"$f":"Agricultura!A59","v":""},{"$f":"Agricultura!$B$30*Agricultura!D30","v":0},{"$f":"B32*Agricultura!$B$59","v":0},{"$f":"Agricultura!$B30*Agricultura!E30","v":0},{"$f":"D32*Agricultura!$B$59","v":0},{"$f":"Agricultura!$B30*Agricultura!F30","v":0},{"$f":"F32*Agricultura!$B$59","v":0},{"$f":"Agricultura!$B30*Agricultura!G30","v":0},{"$f":"H32*Agricultura!$B$59","v":0}]
["Total",null,{"$f":"SUM(C21:C32)","v":0},null,{"$f":"SUM(E21:E32)","v":0},null,{"$f":"SUM(G21:G32)","v":0},null,{"$f":"SUM(I21:I32)","v":0}]
[]
["Produtos Comercializados","Produção"]
[null,"Ano 9",null,"Ano 10",null,"Ano 11",null,"Ano 12"]
[null,"Qtd","Valor","Qtd","Valor","Qtd","Valor","Qtd","Valor"]
[{"$f":"Agricultura!A48","v":""},{"$f":"Agricultura!$B$33*Agricultura!D33","v":0},{"$f":"B38*Agricultura!$B$48","v":0},{"$f":"Agricultura!$B33*Agricultura!E33","v":0},{"$f":"D38*Agricultura!$B$48","v":0},{"$f":"Agricultura!$B33*Agricultura!F33","v":0},{"$f":"F38*Agricultura!$B$48","v":0},{"$f":"Agricultura!$B33*Agricultura!G33","v":0},{"$f":"H38*Agricultura!$B$48","v":0}]
[{"$f":"Agricultura!A49","v":""},{"$f":"Agricultura!$B$34*Agricultura!D34","v":0},{"$f":"B39*Agricultura!$B$49","v":0},{"$f":"Agricultura!$B34*Agricultura!E34","v":0},{"$f":"D39*Agricultura!$B$49","v":0},{"$f":"Agricultura!$B34*Agricultura!F34","v":0},{"$f":"F39*Agricultura!$B$49","v":0},{"$f":"Agricultura!$B34*Agricultura!G34","v":0},{"$f":"H39*Agricultura!$B$49","v":0}]
[{"$f":"Agricultura!A50","v":""},{"$f":"Agricultura!$B$35*Agricultura!D35","v":0},{"$f":"B40*Agricultura!$B$50","v":0},{"$f":"Agricultura!$B35*Agricultura!E35","v":0},{"$f":"D40*Agricultura!$B$50","v":0},{"$f":"Agricultura!$B35*Agricultura!F35","v":0},{"$f":"F40*Agricultura!$B$50","v":0},{"$f":"Agricultura!$B35*Agricultura!G35","v":0},{"$f":"H40*Agricultura!$B$50","v":0}]
[{"$f":"Agricultura!A51","v":""},{"$f":"Agricultura!$B$36*Agricultura!D36","v":0},{"$f":"B41*Agricultura!$B$51","v":0},{"$f":"Agricultura!$B36*Agricultura!E36","v":0},{"$f":"D41*Agricultura!$B$51","v":0},{"$f":"Agricultura!$B36*Agricultura!F36","v":0},{"$f":"F41*Agricultura!$B$51","v":0},{"$f":"Agricultura!$B36*Agricultura!G36","v":0},{"$f":"H41*Agricultura!$B$51","v":0}]
[{"$f":"Agricultura!A52","v":""},{"$f":"Agricultura!$B$37*Agricultura!D37","v":0},{"$f":"B42*Agricultura!$B$52","v":0},{"$f":"Agricultura!$B37*Agricultura!E37","v":0},{"$f":"D42*Agricultura!$B$52","v":0},{"$f":"Agricultura!$B37*Agricultura!F37","v":0},{"$f":"F42*Agricultura!$B$52","v":0},{"$f":"Agricultura!$B37*Agricultura!G37","v":0},{"$f":"H42*Agricultura!$B$52","v":0}]
[{"$f":"Agricultura!A53","v":""},{"$f":"Agricultura!$B$38*Agricultura!D38","v":0},{"$f":"B43*Agricultura!$B$53","v":0},{"$f":"Agricultura!$B38*Agricultura!E38","v":0},{"$f":"D43*Agricultura!$B$53","v":0},{"$f":"Agricultura!$B38*Agricultura!F38","v":0},{"$f":"F43*Agricultura!$B$53","v":0},{"$f":"Agricultura!$B38*Agricultura!G38","v":0},{"$f":"H43*Agricultura!$B$53","v":0}]
[{"$f":"Agricultura!A54","v":""},{"$f":"Agricultura!$B$39*Agricultura!D39","v":0},{"$f":"B44*Agricultura!$B$54","v":0},{"$f":"Agricultura!$B39*Agricultura!E39","v":0},{"$f":"D44*Agricultura!$B$54","v":0},{"$f":"Agricultura!$B39*Agricultura!F39","v":0},{"$f":"F44*Agricultura!$B$54","v":0},{"$f":"Agricultura!$B39*Agricultura!G39","v":0},{"$f":"H44*Agricultura!$B$54","v":0}]
[{"$f":"Agricultura!A55","v":""},{"$f":"Agricultura!$B$40*Agricultura!D40","v":0},{"$f":"B45*Agricultura!$B$55","v":0},{"$f":"Agricultura!$B40*Agricultura!E40","v":0},{"$f":"D45*Agricultura!$B$55","v":0},{"$f":"Agricultura!$B40*Agricultura!F40","v":0},{"$f":"F45*Agricultura!$B$55","v":0},{"$f":"Agricultura!$B40*Agricultura!G40","v":0},{"$f":"H45*Agricultura!$B$55","v":0}]
[{"$f":"Agricultura!A56","v":""},{"$f":"Agricultura!$B$41*Agricultura!D41","v":0},{"$f":"B46*Agricultura!$B$56","v":0},{"$f":"Agricultura!$B41*Agricultura!E41","v":0},{"$f":"D46*Agricultura!$B$56","v":0},{"$f":"Agricultura!$B41*Agricultura!F41","v":0},{"$f":"F46*Agricultura!$B$56","v":0},{"$f":"Agricultura!$B41*Agricultura!G41","v":0},{"$f":"H46*Agricultura!$B$56","v":0}]
[{"$f":"Agricultura!A57","v":""},{"$f":"Agricultura!$B$42*Agricultura!D42","v":0},{"$f":"B47*Agricultura!$B$57","v":0},{"$f":"Agricultura!$B42*Agricultura!E42","v":0},{"$f":"D47*Agricultura!$B$57","v":0},{"$f":"Agricultura!$B42*Agricultura!F42","v":0},{"$f":"F47*Agricultura!$B$57","v":0},{"$f":"Agricultura!$B42*Agricultura!G42","v":0},{"$f":"H47*Agricultura!$B$57","v":0}]
[{"$f":"Agricultura!A58","v":""},{"$f":"Agricultura!$B$43*Agricultura!D43","v":0},{"$f":"B48*Agricultura!$B$58","v":0},{"$f":"Agricultura!$B43*Agricultura!E43","v":0},{"$f":"D48*Agricultura!$B$58","v":0},{"$f":"Agricultura!$B43*Agricultura!F43","v":0},{"$f":"F48*Agricultura!$B$58","v":0},{"$f":"Agricultura!$B43*Agricultura!G43","v":0},{"$f":"H48*Agricultura!$B$58","v":0}]
[{"$f":"Agricultura!A59","v":""},{"$f":"Agricultura!$B$44*Agricultura!D44","v":0},{"$f":"B49*Agricultura!$B$59","v":0},{"$f":"Agricultura!$B44*Agricultura!E44","v":0},{"$f":"D49*Agricultura!$B$59","v":0},{"$f":"Agricultura!$B44*Agricultura!F44","v":0},{"$f":"F49*Agricultura!$B$59","v":0},{"$f":"Agricultura!$B44*Agricultura!G44","v":0},{"$f":"H49*Agricultura!$B$59","v":0}]
["Total",null,{"$f":"SUM(C38:C49)","v":0},null,{"$f":"SUM(E38:E49)","v":0},null,{"$f":"SUM(G38:G49)","v":0},null,{"$f":"SUM(I38:I49)","v":0}]
[]
["Especificação","Custo Operacional - Despesas não Financiadas"]
[null,"Ano 1","Ano 2","Ano 3","Ano 4","Ano 5","Ano 6","Ano 7","Ano 8"]
["Insumos ",{"$f":"SUM(IF(Agricultura!G66=1,Agricultura!F70,0)+IF(Agricultura!G72=1,Agricultura!F76,0)+IF(Agricultura!G78=1,SUM(Agricultura!F82),0))","v":0},{"$f":"SUM(IF(Agricultura!$G$66<=2,Agricultura!$F$70,0)+IF(Agricultura!$G$72<=2,Agricultura!$F$76,0)+IF(Agricultura!$G$78<=2,Agricultura!$F$82,0))","v":0},{"$f":"SUM(IF(Agricultura!$G$66<=3,Agricultura!$F$70,0)+IF(Agricultura!$G$72<=3,Agricultura!$F$76,0)+IF(Agricultura!$G$78<=3,Agricultura!$F$82,0))","v":0},{"$f":"SUM(IF(Agricultura!$G$66<=4,Agricultura!$F$70,0)+IF(Agricultura!$G$72<=4,Agricultura!$F$76,0)+IF(Agricultura!$G$78<=4,Agricultura!$F$82,0))","v":0},{"$f":"SUM(IF(Agricultura!$G$66<=5,Agricultura!$F$70,0)+IF(Agricultura!$G$72<=5,Agricultura!$F$76,0)+IF(Agricultura!$G$78<=5,Agricultura!$F$82,0))","v":0},{"$f":"SUM(IF(Agricultura!$G$66<=6,Agricultura!$F$70,0)+IF(Agricultura!$G$72<=6,Agricultura!$F$76,0)+IF(Agricultura!$G$78<=6,Agricultura!$F$82,0))","v":0},{"$f":"SUM(IF(Agricultura!$G$66<=7,Agricultura!$F$70,0)+IF(Agricultura!$G$72<=7,Agricultura!$F$76,0)+IF(Agricultura!$G$78<=7,Agricultura!$F$82,0))","v":0},{"$f":"SUM(IF(Agricultura!$G$66<=8,Agricultura!$F$70,0)+IF(Agricultura!$G$72<=8,Agricultura!$F$76,0)+IF(Agricultura!$G$78<=8,Agricultura!$F$82,0))","v":0}]
["Serviços",{"$f":"SUM(IF(Agricultura!G85=1,Agricultura!F89,0)+IF(Agricultura!G91=1,Agricultura!F95,0)+IF(Agricultura!G97=1,Agricultura!F101,0))","v":0},{"$f":"SUM(IF(Agricultura!G85<=2,Agricultura!F89,0)+IF(Agricultura!G91<=2,Agricultura!F95,0)+IF(Agricultura!G97<=2,Agricultura!F101,0))","v":0},{"$f":"SUM(IF(Agricultura!G85<=3,Agricultura!F89,0)+IF(Agricultura!G91<=3,Agricultura!F95,0)+IF(Agricultura!G97<=3,Agricultura!F101,0))","v":0},{"$f":"SUM(IF(Agricultura!$G$85<=4,Agricultura!$F$89,0)+IF(Agricultura!$G$91<=4,Agricultura!$F$95,0)+IF(Agricultura!$G$97<=4,Agricultura!$F$101,0))","v":0},{"$f":"SUM(IF(Agricultura!$G$85<=5,Agricultura!$F$89,0)+IF(Agricultura!$G$91<=5,Agricultura!$F$95,0)+IF(Agricultura!$G$97<=5,Agricultura!$F$101,0))","v":0},{"$f":"SUM(IF(Agricultura!$G$85<=6,Agricultura!$F$89,0)+IF(Agricultura!$G$91<=6,Agricultura!$F$95,0)+IF(Agricultura!$G$97<=6,Agricultura!$F$101,0))","v":0},{"$f":"SUM(IF(Agricultura!$G$85<=7,Agricultura!$F$89,0)+IF(Agricultura!$G$91<=7,Agricultura!$F$95,0)+IF(Agricultura!$G$97<=7,Agricultura!$F$101,0))","v":0},{"$f":"SUM(IF(Agricultura!$G$85<=8,Agricultura!$F$89,0)+IF(Agricultura!$G$91<=8,Agricultura!$F$95,0)+IF(Agricultura!$G$97<=8,Agricultura!$F$101,0))","v":0}]
["Outros Desembolsos",{"$f":"IF(Agricultura!G103=1,Agricultura!F107,0)","v":0},{"$f":"IF(Agricultura!$G$103<=2,Agricultura!$F$107,0)","v":0},{"$f":"IF(Agricultura!$G$103<=3,Agricultura!$F$107,0)","v":0},{"$f":"IF(Agricultura!$G$103<=4,Agricultura!$F$107,0)","v":0},{"$f":"IF(Agricultura!$G$103<=5,Agricultura!$F$107,0)","v":0},{"$f":"IF(Agricultura!$G$103<=6,Agricultura!$F$107,0)","v":0},{"$f":"IF(Agricultura!$G$103<=7,Agricultura!$F$107,0)","v":0},{"$f":"IF(Agricultura!$G$103<=8,Agricultura!$F$107,0)","v":0}]
["Total",{"$f":"SUM(B54:B56)","v":0},{"$f":"SUM(C54:C56)","v":0},0,0,0,0,0,0]
[]
["Especificação","Custo Operacional - Despesas não Financiadas"]
[null,"Ano 9","Ano 10","Ano 11","Ano 12","Ano 13","Ano 14","Ano 15","Ano 16"]
["Insumos ",{"$f":"SUM(IF(Agricultura!$G$66<=9,Agricultura!$F$70,0)+IF(Agricultura!$G$72<=9,Agricultura!$F$76,0)+IF(Agricultura!$G$78<=9,Agricultura!$F$82,0))","v":0},{"$f":"SUM(IF(Agricultura!$G$66<=10,Agricultura!$F$70,0)+IF(Agricultura!$G$72<=10,Agricultura!$F$76,0)+IF(Agricultura!$G$78<=10,Agricultura!$F$82,0))","v":0},{"$f":"SUM(IF(Agricultura!$G$66<=11,Agricultura!$F$70,0)+IF(Agricultura!$G$72<=11,Agricultura!$F$76,0)+IF(Agricultura!$G$78<=11,Agricultura!$F$82,0))","v":0},{"$f":"SUM(IF(Agricultura!$G$66<=12,Agricultura!$F$70,0)+IF(Agricultura!$G$72<=12,Agricultura!$F$76,0)+IF(Agricultura!$G$78<=12,Agricultura!$F$82,0))","v":0}]
["Serviços",{"$f":"SUM(IF(Agricultura!$G$85<=9,Agricultura!$F$89,0)+IF(Agricultura!$G$91<=9,Agricultura!$F$95,0)+IF(Agricultura!$G$97<=9,Agricultura!$F$101,0))","v":0},{"$f":"SUM(IF(Agricultura!$G$85<=10,Agricultura!$F$89,0)+IF(Agricultura!$G$91<=10,Agricultura!$F$95,0)+IF(Agricultura!$G$97<=10,Agricultura!$F$101,0))","v":0},{"$f":"SUM(IF(Agricultura!$G$85<=11,Agricultura!$F$89,0)+IF(Agricultura!$G$91<=11,Agricultura!$F$95,0)+IF(Agricultura!$G$97<=11,Agricultura!$F$101,0))","v":0},{"$f":"SUM(IF(Agricultura!$G$85<=12,Agricultura!$F$89,0)+IF(Agricultura!$G$91<=12,Agricultura!$F$95,0)+IF(Agricultura!$G$97<=12,Agricultura!$F$101,0))","v":0}]
["Outros Desembolsos",{"$f":"IF(Agricultura!$G$103<=9,Agricultura!$F$107,0)","v":0},{"$f":"IF(Agricultura!$G$103<=10,Agricultura!$F$107,0)","v":0},{"$f":"IF(Agricultura!$G$103<=11,Agricultura!$F$107,0)","v":0},{"$f":"IF(Agricultura!$G$103<=12,Agricultura!$F$107,0)","v":0}]
["Total",{"$f":"SUM(B61:B63)","v":0},{"$f":"SUM(C61:C63)","v":0},{"$f":"SUM(D61:D63)","v":0},{"$f":"SUM(E61:E63)","v":0}]

{"sheet":"Mem piscicultura-apicultura","index":19,"n_rows":64,"n_cols":9,"rows_kept":64,"cut":false,"hidden":true,"merged":[[0,0,2,0],[0,1,0,8],[1,1,1,2],[1,3,1,4],[1,5,1,6],[1,7,1,8],[17,0,19,0],[17,1,17,8],[18,1,18,2],[18,3,18,4],[18,5,18,6],[18,7,18,8],[51,0,52,0],[51,1,51,8],[58,0,59,0],[58,1,58,8],[34,0,36,0],[34,1,34,8],[35,1,35,2],[35,3,35,4],[35,5,35,6],[35,7,35,8]]}
["Produtos Comercializados","Produção"]
[null,"Ano 1",null,"Ano 2",null,"Ano 3",null,"Ano 4"]
[null,"Qtd","Valor","Qtd","Valor","Qtd","Valor","Qtd","Valor"]
[{"$f":"'Piscicultura-Apicultura'!A48","v":""},{"$f":"'Piscicultura-Apicultura'!B5*'Piscicultura-Apicultura'!D5","v":0},{"$f":"B4*'Piscicultura-Apicultura'!B48","v":0},{"$f":"'Piscicultura-Apicultura'!B5*'Piscicultura-Apicultura'!E5","v":0},{"$f":"D4*'Piscicultura-Apicultura'!B48","v":0},{"$f":"'Piscicultura-Apicultura'!B5*'Piscicultura-Apicultura'!F5","v":0},{"$f":"F4*'Piscicultura-Apicultura'!B48","v":0},{"$f":"'Piscicultura-Apicultura'!B5*'Piscicultura-Apicultura'!G5","v":0},{"$f":"H4*'Piscicultura-Apicultura'!B48","v":0}]
[{"$f":"'Piscicultura-Apicultura'!A49","v":""},{"$f":"'Piscicultura-Apicultura'!B6*'Piscicultura-Apicultura'!D6","v":0},{"$f":"B5*'Piscicultura-Apicultura'!B49","v":0},{"$f":"'Piscicultura-Apicultura'!B6*'Piscicultura-Apicultura'!E6","v":0},{"$f":"D5*'Piscicultura-Apicultura'!B49","v":0},{"$f":"'Piscicultura-Apicultura'!B6*'Piscicultura-Apicultura'!F6","v":0},{"$f":"F5*'Piscicultura-Apicultura'!B49","v":0},{"$f":"'Piscicultura-Apicultura'!B6*'Piscicultura-Apicultura'!G6","v":0},{"$f":"H5*'Piscicultura-Apicultura'!B49","v":0}]
[{"$f":"'Piscicultura-Apicultura'!A50","v":""},{"$f":"'Piscicultura-Apicultura'!B7*'Piscicultura-Apicultura'!D7","v":0},{"$f":"B6*'Piscicultura-Apicultura'!B50","v":0},{"$f":"'Piscicultura-Apicultura'!B7*'Piscicultura-Apicultura'!E7","v":0},{"$f":"D6*'Piscicultura-Apicultura'!B50","v":0},{"$f":"'Piscicultura-Apicultura'!B7*'Piscicultura-Apicultura'!F7","v":0},{"$f":"F6*'Piscicultura-Apicultura'!B50","v":0},{"$f":"'Piscicultura-Apicultura'!B7*'Piscicultura-Apicultura'!G7","v":0},{"$f":"H6*'Piscicultura-Apicultura'!B50","v":0}]
[{"$f":"'Piscicultura-Apicultura'!A51","v":""},{"$f":"'Piscicultura-Apicultura'!B8*'Piscicultura-Apicultura'!D8","v":0},{"$f":"B7*'Piscicultura-Apicultura'!B51","v":0},{"$f":"'Piscicultura-Apicultura'!B8*'Piscicultura-Apicultura'!E8","v":0},{"$f":"D7*'Piscicultura-Apicultura'!B51","v":0},{"$f":"'Piscicultura-Apicultura'!B8*'Piscicultura-Apicultura'!F8","v":0},{"$f":"F7*'Piscicultura-Apicultura'!B51","v":0},{"$f":"'Piscicultura-Apicultura'!B8*'Piscicultura-Apicultura'!G8","v":0},{"$f":"H7*'Piscicultura-Apicultura'!B51","v":0}]
[{"$f":"'Piscicultura-Apicultura'!A52","v":""},{"$f":"'Piscicultura-Apicultura'!B9*'Piscicultura-Apicultura'!D9","v":0},{"$f":"B8*'Piscicultura-Apicultura'!B52","v":0},{"$f":"'Piscicultura-Apicultura'!B9*'Piscicultura-Apicultura'!E9","v":0},{"$f":"D8*'Piscicultura-Apicultura'!B52","v":0},{"$f":"'Piscicultura-Apicultura'!B9*'Piscicultura-Apicultura'!F9","v":0},{"$f":"F8*'Piscicultura-Apicultura'!B52","v":0},{"$f":"'Piscicultura-Apicultura'!B9*'Piscicultura-Apicultura'!G9","v":0},{"$f":"H8*'Piscicultura-Apicultura'!B52","v":0}]
[{"$f":"'Piscicultura-Apicultura'!A53","v":""},{"$f":"'Piscicultura-Apicultura'!B10*'Piscicultura-Apicultura'!D10","v":0},{"$f":"B9*'Piscicultura-Apicultura'!B53","v":0},{"$f":"'Piscicultura-Apicultura'!B10*'Piscicultura-Apicultura'!E10","v":0},{"$f":"D9*'Piscicultura-Apicultura'!B53","v":0},{"$f":"'Piscicultura-Apicultura'!B10*'Piscicultura-Apicultura'!F10","v":0},{"$f":"F9*'Piscicultura-Apicultura'!B53","v":0},{"$f":"'Piscicultura-Apicultura'!B10*'Piscicultura-Apicultura'!G10","v":0},{"$f":"H9*'Piscicultura-Apicultura'!B53","v":0}]
[{"$f":"'Piscicultura-Apicultura'!A54","v":""},{"$f":"'Piscicultura-Apicultura'!B11*'Piscicultura-Apicultura'!D11","v":0},{"$f":"B10*'Piscicultura-Apicultura'!B54","v":0},{"$f":"'Piscicultura-Apicultura'!B11*'Piscicultura-Apicultura'!E11","v":0},{"$f":"D10*'Piscicultura-Apicultura'!B54","v":0},{"$f":"'Piscicultura-Apicultura'!B11*'Piscicultura-Apicultura'!F11","v":0},{"$f":"F10*'Piscicultura-Apicultura'!B54","v":0},{"$f":"'Piscicultura-Apicultura'!B11*'Piscicultura-Apicultura'!G11","v":0},{"$f":"H10*'Piscicultura-Apicultura'!B54","v":0}]
[{"$f":"'Piscicultura-Apicultura'!A55","v":""},{"$f":"'Piscicultura-Apicultura'!B12*'Piscicultura-Apicultura'!D12","v":0},{"$f":"B11*'Piscicultura-Apicultura'!B55","v":0},{"$f":"'Piscicultura-Apicultura'!B12*'Piscicultura-Apicultura'!E12","v":0},{"$f":"D11*'Piscicultura-Apicultura'!B55","v":0},{"$f":"'Piscicultura-Apicultura'!B12*'Piscicultura-Apicultura'!F12","v":0},{"$f":"F11*'Piscicultura-Apicultura'!B55","v":0},{"$f":"'Piscicultura-Apicultura'!B12*'Piscicultura-Apicultura'!G12","v":0},{"$f":"H11*'Piscicultura-Apicultura'!B55","v":0}]
[{"$f":"'Piscicultura-Apicultura'!A56","v":""},{"$f":"'Piscicultura-Apicultura'!B13*'Piscicultura-Apicultura'!D13","v":0},{"$f":"B12*'Piscicultura-Apicultura'!B56","v":0},{"$f":"'Piscicultura-Apicultura'!B13*'Piscicultura-Apicultura'!E13","v":0},{"$f":"D12*'Piscicultura-Apicultura'!B56","v":0},{"$f":"'Piscicultura-Apicultura'!B13*'Piscicultura-Apicultura'!F13","v":0},{"$f":"F12*'Piscicultura-Apicultura'!B56","v":0},{"$f":"'Piscicultura-Apicultura'!B13*'Piscicultura-Apicultura'!G13","v":0},{"$f":"H12*'Piscicultura-Apicultura'!B56","v":0}]
[{"$f":"'Piscicultura-Apicultura'!A57","v":""},{"$f":"'Piscicultura-Apicultura'!B14*'Piscicultura-Apicultura'!D14","v":0},{"$f":"B13*'Piscicultura-Apicultura'!B57","v":0},{"$f":"'Piscicultura-Apicultura'!B14*'Piscicultura-Apicultura'!E14","v":0},{"$f":"D13*'Piscicultura-Apicultura'!B57","v":0},{"$f":"'Piscicultura-Apicultura'!B14*'Piscicultura-Apicultura'!F14","v":0},{"$f":"F13*'Piscicultura-Apicultura'!B57","v":0},{"$f":"'Piscicultura-Apicultura'!B14*'Piscicultura-Apicultura'!G14","v":0},{"$f":"H13*'Piscicultura-Apicultura'!B57","v":0}]
[{"$f":"'Piscicultura-Apicultura'!A58","v":""},{"$f":"'Piscicultura-Apicultura'!B15*'Piscicultura-Apicultura'!D15","v":0},{"$f":"B14*'Piscicultura-Apicultura'!B58","v":0},{"$f":"'Piscicultura-Apicultura'!B15*'Piscicultura-Apicultura'!E15","v":0},{"$f":"D14*'Piscicultura-Apicultura'!B58","v":0},{"$f":"'Piscicultura-Apicultura'!B15*'Piscicultura-Apicultura'!F15","v":0},{"$f":"F14*'Piscicultura-Apicultura'!B58","v":0},{"$f":"'Piscicultura-Apicultura'!B15*'Piscicultura-Apicultura'!G15","v":0},{"$f":"H14*'Piscicultura-Apicultura'!B58","v":0}]
[{"$f":"'Piscicultura-Apicultura'!A59","v":""},{"$f":"'Piscicultura-Apicultura'!B16*'Piscicultura-Apicultura'!D16","v":0},{"$f":"B15*'Piscicultura-Apicultura'!B59","v":0},{"$f":"'Piscicultura-Apicultura'!B16*'Piscicultura-Apicultura'!E16","v":0},{"$f":"D15*'Piscicultura-Apicultura'!B59","v":0},{"$f":"'Piscicultura-Apicultura'!B16*'Piscicultura-Apicultura'!F16","v":0},{"$f":"F15*'Piscicultura-Apicultura'!B59","v":0},{"$f":"'Piscicultura-Apicultura'!B16*'Piscicultura-Apicultura'!G16","v":0},{"$f":"H15*'Piscicultura-Apicultura'!B59","v":0}]
["Total",null,{"$f":"SUM(C4:C15)","v":0},null,{"$f":"SUM(E4:E15)","v":0},null,{"$f":"SUM(G4:G15)","v":0},null,{"$f":"SUM(I4:I15)","v":0}]
[]
["Produtos Comercializados","Produção"]
[null,"Ano 5",null,"Ano 6",null,"Ano 7",null,"Ano 8"]
[null,"Qtd","Valor","Qtd","Valor","Qtd","Valor","Qtd","Valor"]
[{"$f":"'Piscicultura-Apicultura'!A48","v":""},{"$f":"'Piscicultura-Apicultura'!B19*'Piscicultura-Apicultura'!D19","v":0},{"$f":"B21*'Piscicultura-Apicultura'!B48","v":0},{"$f":"'Piscicultura-Apicultura'!B19*'Piscicultura-Apicultura'!E19","v":0},{"$f":"D21*'Piscicultura-Apicultura'!B48","v":0},{"$f":"'Piscicultura-Apicultura'!B19*'Piscicultura-Apicultura'!F19","v":0},{"$f":"F21*'Piscicultura-Apicultura'!B48","v":0},{"$f":"'Piscicultura-Apicultura'!B19*'Piscicultura-Apicultura'!G19","v":0},{"$f":"H21*'Piscicultura-Apicultura'!B48","v":0}]
[{"$f":"'Piscicultura-Apicultura'!A49","v":""},{"$f":"'Piscicultura-Apicultura'!B20*'Piscicultura-Apicultura'!D20","v":0},{"$f":"B22*'Piscicultura-Apicultura'!B49","v":0},{"$f":"'Piscicultura-Apicultura'!B20*'Piscicultura-Apicultura'!E20","v":0},{"$f":"D22*'Piscicultura-Apicultura'!B49","v":0},{"$f":"'Piscicultura-Apicultura'!B20*'Piscicultura-Apicultura'!F20","v":0},{"$f":"F22*'Piscicultura-Apicultura'!B49","v":0},{"$f":"'Piscicultura-Apicultura'!B20*'Piscicultura-Apicultura'!G20","v":0},{"$f":"H22*'Piscicultura-Apicultura'!B49","v":0}]
[{"$f":"'Piscicultura-Apicultura'!A50","v":""},{"$f":"'Piscicultura-Apicultura'!B21*'Piscicultura-Apicultura'!D21","v":0},{"$f":"B23*'Piscicultura-Apicultura'!B50","v":0},{"$f":"'Piscicultura-Apicultura'!B21*'Piscicultura-Apicultura'!E21","v":0},{"$f":"D23*'Piscicultura-Apicultura'!B50","v":0},{"$f":"'Piscicultura-Apicultura'!B21*'Piscicultura-Apicultura'!F21","v":0},{"$f":"F23*'Piscicultura-Apicultura'!B50","v":0},{"$f":"'Piscicultura-Apicultura'!B21*'Piscicultura-Apicultura'!G21","v":0},{"$f":"H23*'Piscicultura-Apicultura'!B50","v":0}]
[{"$f":"'Piscicultura-Apicultura'!A51","v":""},{"$f":"'Piscicultura-Apicultura'!B22*'Piscicultura-Apicultura'!D22","v":0},{"$f":"B24*'Piscicultura-Apicultura'!B51","v":0},{"$f":"'Piscicultura-Apicultura'!B22*'Piscicultura-Apicultura'!E22","v":0},{"$f":"D24*'Piscicultura-Apicultura'!B51","v":0},{"$f":"'Piscicultura-Apicultura'!B22*'Piscicultura-Apicultura'!F22","v":0},{"$f":"F24*'Piscicultura-Apicultura'!B51","v":0},{"$f":"'Piscicultura-Apicultura'!B22*'Piscicultura-Apicultura'!G22","v":0},{"$f":"H24*'Piscicultura-Apicultura'!B51","v":0}]
[{"$f":"'Piscicultura-Apicultura'!A52","v":""},{"$f":"'Piscicultura-Apicultura'!B23*'Piscicultura-Apicultura'!D23","v":0},{"$f":"B25*'Piscicultura-Apicultura'!B52","v":0},{"$f":"'Piscicultura-Apicultura'!B23*'Piscicultura-Apicultura'!E23","v":0},{"$f":"D25*'Piscicultura-Apicultura'!B52","v":0},{"$f":"'Piscicultura-Apicultura'!B23*'Piscicultura-Apicultura'!F23","v":0},{"$f":"F25*'Piscicultura-Apicultura'!B52","v":0},{"$f":"'Piscicultura-Apicultura'!B23*'Piscicultura-Apicultura'!G23","v":0},{"$f":"H25*'Piscicultura-Apicultura'!B52","v":0}]
[{"$f":"'Piscicultura-Apicultura'!A53","v":""},{"$f":"'Piscicultura-Apicultura'!B24*'Piscicultura-Apicultura'!D24","v":0},{"$f":"B26*'Piscicultura-Apicultura'!B53","v":0},{"$f":"'Piscicultura-Apicultura'!B24*'Piscicultura-Apicultura'!E24","v":0},{"$f":"D26*'Piscicultura-Apicultura'!B53","v":0},{"$f":"'Piscicultura-Apicultura'!B24*'Piscicultura-Apicultura'!F24","v":0},{"$f":"F26*'Piscicultura-Apicultura'!B53","v":0},{"$f":"'Piscicultura-Apicultura'!B24*'Piscicultura-Apicultura'!G24","v":0},{"$f":"H26*'Piscicultura-Apicultura'!B53","v":0}]
[{"$f":"'Piscicultura-Apicultura'!A54","v":""},{"$f":"'Piscicultura-Apicultura'!B25*'Piscicultura-Apicultura'!D25","v":0},{"$f":"B27*'Piscicultura-Apicultura'!B54","v":0},{"$f":"'Piscicultura-Apicultura'!B25*'Piscicultura-Apicultura'!E25","v":0},{"$f":"D27*'Piscicultura-Apicultura'!B54","v":0},{"$f":"'Piscicultura-Apicultura'!B25*'Piscicultura-Apicultura'!F25","v":0},{"$f":"F27*'Piscicultura-Apicultura'!B54","v":0},{"$f":"'Piscicultura-Apicultura'!B25*'Piscicultura-Apicultura'!G25","v":0},{"$f":"H27*'Piscicultura-Apicultura'!B54","v":0}]
[{"$f":"'Piscicultura-Apicultura'!A55","v":""},{"$f":"'Piscicultura-Apicultura'!B26*'Piscicultura-Apicultura'!D26","v":0},{"$f":"B28*'Piscicultura-Apicultura'!B55","v":0},{"$f":"'Piscicultura-Apicultura'!B26*'Piscicultura-Apicultura'!E26","v":0},{"$f":"D28*'Piscicultura-Apicultura'!B55","v":0},{"$f":"'Piscicultura-Apicultura'!B26*'Piscicultura-Apicultura'!F26","v":0},{"$f":"F28*'Piscicultura-Apicultura'!B55","v":0},{"$f":"'Piscicultura-Apicultura'!B26*'Piscicultura-Apicultura'!G26","v":0},{"$f":"H28*'Piscicultura-Apicultura'!B55","v":0}]
[{"$f":"'Piscicultura-Apicultura'!A56","v":""},{"$f":"'Piscicultura-Apicultura'!B27*'Piscicultura-Apicultura'!D27","v":0},{"$f":"B29*'Piscicultura-Apicultura'!B56","v":0},{"$f":"'Piscicultura-Apicultura'!B27*'Piscicultura-Apicultura'!E27","v":0},{"$f":"D29*'Piscicultura-Apicultura'!B56","v":0},{"$f":"'Piscicultura-Apicultura'!B27*'Piscicultura-Apicultura'!F27","v":0},{"$f":"F29*'Piscicultura-Apicultura'!B56","v":0},{"$f":"'Piscicultura-Apicultura'!B27*'Piscicultura-Apicultura'!G27","v":0},{"$f":"H29*'Piscicultura-Apicultura'!B56","v":0}]
[{"$f":"'Piscicultura-Apicultura'!A57","v":""},{"$f":"'Piscicultura-Apicultura'!B28*'Piscicultura-Apicultura'!D28","v":0},{"$f":"B30*'Piscicultura-Apicultura'!B57","v":0},{"$f":"'Piscicultura-Apicultura'!B28*'Piscicultura-Apicultura'!E28","v":0},{"$f":"D30*'Piscicultura-Apicultura'!B57","v":0},{"$f":"'Piscicultura-Apicultura'!B28*'Piscicultura-Apicultura'!F28","v":0},{"$f":"F30*'Piscicultura-Apicultura'!B57","v":0},{"$f":"'Piscicultura-Apicultura'!B28*'Piscicultura-Apicultura'!G28","v":0},{"$f":"H30*'Piscicultura-Apicultura'!B57","v":0}]
[{"$f":"'Piscicultura-Apicultura'!A58","v":""},{"$f":"'Piscicultura-Apicultura'!B29*'Piscicultura-Apicultura'!D29","v":0},{"$f":"B31*'Piscicultura-Apicultura'!B58","v":0},{"$f":"'Piscicultura-Apicultura'!B29*'Piscicultura-Apicultura'!E29","v":0},{"$f":"D31*'Piscicultura-Apicultura'!B58","v":0},{"$f":"'Piscicultura-Apicultura'!B29*'Piscicultura-Apicultura'!F29","v":0},{"$f":"F31*'Piscicultura-Apicultura'!B58","v":0},{"$f":"'Piscicultura-Apicultura'!B29*'Piscicultura-Apicultura'!G29","v":0},{"$f":"H31*'Piscicultura-Apicultura'!B58","v":0}]
[{"$f":"'Piscicultura-Apicultura'!A59","v":""},{"$f":"'Piscicultura-Apicultura'!B30*'Piscicultura-Apicultura'!D30","v":0},{"$f":"B32*'Piscicultura-Apicultura'!B59","v":0},{"$f":"'Piscicultura-Apicultura'!B30*'Piscicultura-Apicultura'!E30","v":0},{"$f":"D32*'Piscicultura-Apicultura'!B59","v":0},{"$f":"'Piscicultura-Apicultura'!B30*'Piscicultura-Apicultura'!F30","v":0},{"$f":"F32*'Piscicultura-Apicultura'!B59","v":0},{"$f":"'Piscicultura-Apicultura'!B30*'Piscicultura-Apicultura'!G30","v":0},{"$f":"H32*'Piscicultura-Apicultura'!B59","v":0}]
["Total",null,{"$f":"SUM(C21:C32)","v":0},null,{"$f":"SUM(E21:E32)","v":0},null,{"$f":"SUM(G21:G32)","v":0},null,{"$f":"SUM(I21:I32)","v":0}]
[]
["Produtos Comercializados","Produção"]
[null,"Ano 9",null,"Ano 10",null,"Ano 11",null,"Ano 12"]
[null,"Qtd","Valor","Qtd","Valor","Qtd","Valor","Qtd","Valor"]
[{"$f":"'Piscicultura-Apicultura'!A48","v":""},{"$f":"'Piscicultura-Apicultura'!B33*'Piscicultura-Apicultura'!D33","v":0},{"$f":"B38*'Piscicultura-Apicultura'!B48","v":0},{"$f":"'Piscicultura-Apicultura'!B33*'Piscicultura-Apicultura'!E33","v":0},{"$f":"D38*'Piscicultura-Apicultura'!B48","v":0},{"$f":"'Piscicultura-Apicultura'!B33*'Piscicultura-Apicultura'!F33","v":0},{"$f":"F38*'Piscicultura-Apicultura'!B48","v":0},{"$f":"'Piscicultura-Apicultura'!B33*'Piscicultura-Apicultura'!G33","v":0},{"$f":"H38*'Piscicultura-Apicultura'!B48","v":0}]
[{"$f":"'Piscicultura-Apicultura'!A49","v":""},{"$f":"'Piscicultura-Apicultura'!B34*'Piscicultura-Apicultura'!D34","v":0},{"$f":"B39*'Piscicultura-Apicultura'!B49","v":0},{"$f":"'Piscicultura-Apicultura'!B34*'Piscicultura-Apicultura'!E34","v":0},{"$f":"D39*'Piscicultura-Apicultura'!B49","v":0},{"$f":"'Piscicultura-Apicultura'!B34*'Piscicultura-Apicultura'!F34","v":0},{"$f":"F39*'Piscicultura-Apicultura'!B49","v":0},{"$f":"'Piscicultura-Apicultura'!B34*'Piscicultura-Apicultura'!G34","v":0},{"$f":"H39*'Piscicultura-Apicultura'!B49","v":0}]
[{"$f":"'Piscicultura-Apicultura'!A50","v":""},{"$f":"'Piscicultura-Apicultura'!B35*'Piscicultura-Apicultura'!D35","v":0},{"$f":"B40*'Piscicultura-Apicultura'!B50","v":0},{"$f":"'Piscicultura-Apicultura'!B35*'Piscicultura-Apicultura'!E35","v":0},{"$f":"D40*'Piscicultura-Apicultura'!B50","v":0},{"$f":"'Piscicultura-Apicultura'!B35*'Piscicultura-Apicultura'!F35","v":0},{"$f":"F40*'Piscicultura-Apicultura'!B50","v":0},{"$f":"'Piscicultura-Apicultura'!B35*'Piscicultura-Apicultura'!G35","v":0},{"$f":"H40*'Piscicultura-Apicultura'!B50","v":0}]
[{"$f":"'Piscicultura-Apicultura'!A51","v":""},{"$f":"'Piscicultura-Apicultura'!B36*'Piscicultura-Apicultura'!D36","v":0},{"$f":"B41*'Piscicultura-Apicultura'!B51","v":0},{"$f":"'Piscicultura-Apicultura'!B36*'Piscicultura-Apicultura'!E36","v":0},{"$f":"D41*'Piscicultura-Apicultura'!B51","v":0},{"$f":"'Piscicultura-Apicultura'!B36*'Piscicultura-Apicultura'!F36","v":0},{"$f":"F41*'Piscicultura-Apicultura'!B51","v":0},{"$f":"'Piscicultura-Apicultura'!B36*'Piscicultura-Apicultura'!G36","v":0},{"$f":"H41*'Piscicultura-Apicultura'!B51","v":0}]
[{"$f":"'Piscicultura-Apicultura'!A52","v":""},{"$f":"'Piscicultura-Apicultura'!B37*'Piscicultura-Apicultura'!D37","v":0},{"$f":"B42*'Piscicultura-Apicultura'!B52","v":0},{"$f":"'Piscicultura-Apicultura'!B37*'Piscicultura-Apicultura'!E37","v":0},{"$f":"D42*'Piscicultura-Apicultura'!B52","v":0},{"$f":"'Piscicultura-Apicultura'!B37*'Piscicultura-Apicultura'!F37","v":0},{"$f":"F42*'Piscicultura-Apicultura'!B52","v":0},{"$f":"'Piscicultura-Apicultura'!B37*'Piscicultura-Apicultura'!G37","v":0},{"$f":"H42*'Piscicultura-Apicultura'!B52","v":0}]
[{"$f":"'Piscicultura-Apicultura'!A53","v":""},{"$f":"'Piscicultura-Apicultura'!B38*'Piscicultura-Apicultura'!D38","v":0},{"$f":"B43*'Piscicultura-Apicultura'!B53","v":0},{"$f":"'Piscicultura-Apicultura'!B38*'Piscicultura-Apicultura'!E38","v":0},{"$f":"D43*'Piscicultura-Apicultura'!B53","v":0},{"$f":"'Piscicultura-Apicultura'!B38*'Piscicultura-Apicultura'!F38","v":0},{"$f":"F43*'Piscicultura-Apicultura'!B53","v":0},{"$f":"'Piscicultura-Apicultura'!B38*'Piscicultura-Apicultura'!G38","v":0},{"$f":"H43*'Piscicultura-Apicultura'!B53","v":0}]
[{"$f":"'Piscicultura-Apicultura'!A54","v":""},{"$f":"'Piscicultura-Apicultura'!B39*'Piscicultura-Apicultura'!D39","v":0},{"$f":"B44*'Piscicultura-Apicultura'!B54","v":0},{"$f":"'Piscicultura-Apicultura'!B39*'Piscicultura-Apicultura'!E39","v":0},{"$f":"D44*'Piscicultura-Apicultura'!B54","v":0},{"$f":"'Piscicultura-Apicultura'!B39*'Piscicultura-Apicultura'!F39","v":0},{"$f":"F44*'Piscicultura-Apicultura'!B54","v":0},{"$f":"'Piscicultura-Apicultura'!B39*'Piscicultura-Apicultura'!G39","v":0},{"$f":"H44*'Piscicultura-Apicultura'!B54","v":0}]
[{"$f":"'Piscicultura-Apicultura'!A55","v":""},{"$f":"'Piscicultura-Apicultura'!B40*'Piscicultura-Apicultura'!D40","v":0},{"$f":"B45*'Piscicultura-Apicultura'!B55","v":0},{"$f":"'Piscicultura-Apicultura'!B40*'Piscicultura-Apicultura'!E40","v":0},{"$f":"D45*'Piscicultura-Apicultura'!B55","v":0},{"$f":"'Piscicultura-Apicultura'!B40*'Piscicultura-Apicultura'!F40","v":0},{"$f":"F45*'Piscicultura-Apicultura'!B55","v":0},{"$f":"'Piscicultura-Apicultura'!B40*'Piscicultura-Apicultura'!G40","v":0},{"$f":"H45*'Piscicultura-Apicultura'!B55","v":0}]
[{"$f":"'Piscicultura-Apicultura'!A56","v":""},{"$f":"'Piscicultura-Apicultura'!B41*'Piscicultura-Apicultura'!D41","v":0},{"$f":"B46*'Piscicultura-Apicultura'!B56","v":0},{"$f":"'Piscicultura-Apicultura'!B41*'Piscicultura-Apicultura'!E41","v":0},{"$f":"D46*'Piscicultura-Apicultura'!B56","v":0},{"$f":"'Piscicultura-Apicultura'!B41*'Piscicultura-Apicultura'!F41","v":0},{"$f":"F46*'Piscicultura-Apicultura'!B56","v":0},{"$f":"'Piscicultura-Apicultura'!B41*'Piscicultura-Apicultura'!G41","v":0},{"$f":"H46*'Piscicultura-Apicultura'!B56","v":0}]
[{"$f":"'Piscicultura-Apicultura'!A57","v":""},{"$f":"'Piscicultura-Apicultura'!B42*'Piscicultura-Apicultura'!D42","v":0},{"$f":"B47*'Piscicultura-Apicultura'!B57","v":0},{"$f":"'Piscicultura-Apicultura'!B42*'Piscicultura-Apicultura'!E42","v":0},{"$f":"D47*'Piscicultura-Apicultura'!B57","v":0},{"$f":"'Piscicultura-Apicultura'!B42*'Piscicultura-Apicultura'!F42","v":0},{"$f":"F47*'Piscicultura-Apicultura'!B57","v":0},{"$f":"'Piscicultura-Apicultura'!B42*'Piscicultura-Apicultura'!G42","v":0},{"$f":"H47*'Piscicultura-Apicultura'!B57","v":0}]
[{"$f":"'Piscicultura-Apicultura'!A58","v":""},{"$f":"'Piscicultura-Apicultura'!B43*'Piscicultura-Apicultura'!D43","v":0},{"$f":"B48*'Piscicultura-Apicultura'!B58","v":0},{"$f":"'Piscicultura-Apicultura'!B43*'Piscicultura-Apicultura'!E43","v":0},{"$f":"D48*'Piscicultura-Apicultura'!B58","v":0},{"$f":"'Piscicultura-Apicultura'!B43*'Piscicultura-Apicultura'!F43","v":0},{"$f":"F48*'Piscicultura-Apicultura'!B58","v":0},{"$f":"'Piscicultura-Apicultura'!B43*'Piscicultura-Apicultura'!G43","v":0},{"$f":"H48*'Piscicultura-Apicultura'!B58","v":0}]
[{"$f":"'Piscicultura-Apicultura'!A59","v":""},{"$f":"'Piscicultura-Apicultura'!B44*'Piscicultura-Apicultura'!D44","v":0},{"$f":"B49*'Piscicultura-Apicultura'!B59","v":0},{"$f":"'Piscicultura-Apicultura'!B44*'Piscicultura-Apicultura'!E44","v":0},{"$f":"D49*'Piscicultura-Apicultura'!B59","v":0},{"$f":"'Piscicultura-Apicultura'!B44*'Piscicultura-Apicultura'!F44","v":0},{"$f":"F49*'Piscicultura-Apicultura'!B59","v":0},{"$f":"'Piscicultura-Apicultura'!B44*'Piscicultura-Apicultura'!G44","v":0},{"$f":"H49*'Piscicultura-Apicultura'!B59","v":0}]
["Total",null,{"$f":"SUM(C38:C49)","v":0},null,{"$f":"SUM(E38:E49)","v":0},null,{"$f":"SUM(G38:G49)","v":0},null,{"$f":"SUM(I38:I49)","v":0}]
[]
["Especificação","Custo Operacional - Despesas não Financiadas"]
[null,"Ano 1","Ano 2","Ano 3","Ano 4","Ano 5","Ano 6","Ano 7","Ano 8"]
["Insumos ",{"$f":"SUM(IF('Piscicultura-Apicultura'!G66=1,'Piscicultura-Apicultura'!F70,0)+IF('Piscicultura-Apicultura'!G72=1,'Piscicultura-Apicultura'!F76,0)+IF('Piscicultura-Apicultura'!G78=1,SUM('Piscicultura-Apicultura'!F82),0))","v":0},{"$f":"SUM(IF('Piscicultura-Apicultura'!$G$66<=2,'Piscicultura-Apicultura'!$F$70,0)+IF('Piscicultura-Apicultura'!$G$72<=2,'Piscicultura-Apicultura'!$F$76,0)+IF('Piscicultura-Apicultura'!$G$78<=2,'Piscicultura-Apicultura'!$F$82,0))","v":0},{"$f":"SUM(IF('Piscicultura-Apicultura'!$G$66<=3,'Piscicultura-Apicultura'!$F$70,0)+IF('Piscicultura-Apicultura'!$G$72<=3,'Piscicultura-Apicultura'!$F$76,0)+IF('Piscicultura-Apicultura'!$G$78<=3,'Piscicultura-Apicultura'!$F$82,0))","v":0},{"$f":"SUM(IF('Piscicultura-Apicultura'!$G$66<=4,'Piscicultura-Apicultura'!$F$70,0)+IF('Piscicultura-Apicultura'!$G$72<=4,'Piscicultura-Apicultura'!$F$76,0)+IF('Piscicultura-Apicultura'!$G$78<=4,'Piscicultura-Apicultura'!$F$82,0))","v":0},{"$f":"SUM(IF('Piscicultura-Apicultura'!$G$66<=5,'Piscicultura-Apicultura'!$F$70,0)+IF('Piscicultura-Apicultura'!$G$72<=5,'Piscicultura-Apicultura'!$F$76,0)+IF('Piscicultura-Apicultura'!$G$78<=5,'Piscicultura-Apicultura'!$F$82,0))","v":0},{"$f":"SUM(IF('Piscicultura-Apicultura'!$G$66<=6,'Piscicultura-Apicultura'!$F$70,0)+IF('Piscicultura-Apicultura'!$G$72<=6,'Piscicultura-Apicultura'!$F$76,0)+IF('Piscicultura-Apicultura'!$G$78<=6,'Piscicultura-Apicultura'!$F$82,0))","v":0},{"$f":"SUM(IF('Piscicultura-Apicultura'!$G$66<=7,'Piscicultura-Apicultura'!$F$70,0)+IF('Piscicultura-Apicultura'!$G$72<=7,'Piscicultura-Apicultura'!$F$76,0)+IF('Piscicultura-Apicultura'!$G$78<=7,'Piscicultura-Apicultura'!$F$82,0))","v":0},{"$f":"SUM(IF('Piscicultura-Apicultura'!$G$66<=8,'Piscicultura-Apicultura'!$F$70,0)+IF('Piscicultura-Apicultura'!$G$72<=8,'Piscicultura-Apicultura'!$F$76,0)+IF('Piscicultura-Apicultura'!$G$78<=8,'Piscicultura-Apicultura'!$F$82,0))","v":0}]
["Serviços",{"$f":"SUM(IF('Piscicultura-Apicultura'!G85=1,'Piscicultura-Apicultura'!F89,0)+IF('Piscicultura-Apicultura'!G91=1,'Piscicultura-Apicultura'!F95,0)+IF('Piscicultura-Apicultura'!G97=1,'Piscicultura-Apicultura'!F101,0))","v":0},{"$f":"SUM(IF('Piscicultura-Apicultura'!G85<=2,'Piscicultura-Apicultura'!F89,0)+IF('Piscicultura-Apicultura'!G91<=2,'Piscicultura-Apicultura'!F95,0)+IF('Piscicultura-Apicultura'!G97<=2,'Piscicultura-Apicultura'!F101,0))","v":0},{"$f":"SUM(IF('Piscicultura-Apicultura'!G85<=3,'Piscicultura-Apicultura'!F89,0)+IF('Piscicultura-Apicultura'!G91<=3,'Piscicultura-Apicultura'!F95,0)+IF('Piscicultura-Apicultura'!G97<=3,'Piscicultura-Apicultura'!F101,0))","v":0},{"$f":"SUM(IF('Piscicultura-Apicultura'!$G$85<=4,'Piscicultura-Apicultura'!$F$89,0)+IF('Piscicultura-Apicultura'!$G$91<=4,'Piscicultura-Apicultura'!$F$95,0)+IF('Piscicultura-Apicultura'!$G$97<=4,'Piscicultura-Apicultura'!$F$101,0))","v":0},{"$f":"SUM(IF('Piscicultura-Apicultura'!$G$85<=5,'Piscicultura-Apicultura'!$F$89,0)+IF('Piscicultura-Apicultura'!$G$91<=5,'Piscicultura-Apicultura'!$F$95,0)+IF('Piscicultura-Apicultura'!$G$97<=5,'Piscicultura-Apicultura'!$F$101,0))","v":0},{"$f":"SUM(IF('Piscicultura-Apicultura'!$G$85<=6,'Piscicultura-Apicultura'!$F$89,0)+IF('Piscicultura-Apicultura'!$G$91<=6,'Piscicultura-Apicultura'!$F$95,0)+IF('Piscicultura-Apicultura'!$G$97<=6,'Piscicultura-Apicultura'!$F$101,0))","v":0},{"$f":"SUM(IF('Piscicultura-Apicultura'!$G$85<=7,'Piscicultura-Apicultura'!$F$89,0)+IF('Piscicultura-Apicultura'!$G$91<=7,'Piscicultura-Apicultura'!$F$95,0)+IF('Piscicultura-Apicultura'!$G$97<=7,'Piscicultura-Apicultura'!$F$101,0))","v":0},{"$f":"SUM(IF('Piscicultura-Apicultura'!$G$85<=8,'Piscicultura-Apicultura'!$F$89,0)+IF('Piscicultura-Apicultura'!$G$91<=8,'Piscicultura-Apicultura'!$F$95,0)+IF('Piscicultura-Apicultura'!$G$97<=8,'Piscicultura-Apicultura'!$F$101,0))","v":0}]
["Outros Desembolsos",{"$f":"IF('Piscicultura-Apicultura'!G103=1,'Piscicultura-Apicultura'!F107,0)","v":0},{"$f":"IF('Piscicultura-Apicultura'!$G$103<=2,'Piscicultura-Apicultura'!$F$107,0)","v":0},{"$f":"IF('Piscicultura-Apicultura'!$G$103<=3,'Piscicultura-Apicultura'!$F$107,0)","v":0},{"$f":"IF('Piscicultura-Apicultura'!$G$103<=4,'Piscicultura-Apicultura'!$F$107,0)","v":0},{"$f":"IF('Piscicultura-Apicultura'!$G$103<=5,'Piscicultura-Apicultura'!$F$107,0)","v":0},{"$f":"IF('Piscicultura-Apicultura'!$G$103<=6,'Piscicultura-Apicultura'!$F$107,0)","v":0},{"$f":"IF('Piscicultura-Apicultura'!$G$103<=7,'Piscicultura-Apicultura'!$F$107,0)","v":0},{"$f":"IF('Piscicultura-Apicultura'!$G$103<=8,'Piscicultura-Apicultura'!$F$107,0)","v":0}]
["Total",{"$f":"SUM(B54:B56)","v":0},{"$f":"SUM(C54:C56)","v":0},0,0,0,0,0,0]
[]
["Especificação","Custo Operacional - Despesas não Financiadas"]
[null,"Ano 9","Ano 10","Ano 11","Ano 12","Ano 13","Ano 14","Ano 15","Ano 16"]
["Insumos ",{"$f":"SUM(IF('Piscicultura-Apicultura'!$G$66<=9,'Piscicultura-Apicultura'!$F$70,0)+IF('Piscicultura-Apicultura'!$G$72<=9,'Piscicultura-Apicultura'!$F$76,0)+IF('Piscicultura-Apicultura'!$G$78<=9,'Piscicultura-Apicultura'!$F$82,0))","v":0},{"$f":"SUM(IF('Piscicultura-Apicultura'!$G$66<=10,'Piscicultura-Apicultura'!$F$70,0)+IF('Piscicultura-Apicultura'!$G$72<=10,'Piscicultura-Apicultura'!$F$76,0)+IF('Piscicultura-Apicultura'!$G$78<=10,'Piscicultura-Apicultura'!$F$82,0))","v":0},{"$f":"SUM(IF('Piscicultura-Apicultura'!$G$66<=11,'Piscicultura-Apicultura'!$F$70,0)+IF('Piscicultura-Apicultura'!$G$72<=11,'Piscicultura-Apicultura'!$F$76,0)+IF('Piscicultura-Apicultura'!$G$78<=11,'Piscicultura-Apicultura'!$F$82,0))","v":0},{"$f":"SUM(IF('Piscicultura-Apicultura'!$G$66<=12,'Piscicultura-Apicultura'!$F$70,0)+IF('Piscicultura-Apicultura'!$G$72<=12,'Piscicultura-Apicultura'!$F$76,0)+IF('Piscicultura-Apicultura'!$G$78<=12,'Piscicultura-Apicultura'!$F$82,0))","v":0}]
["Serviços",{"$f":"SUM(IF('Piscicultura-Apicultura'!$G$85<=9,'Piscicultura-Apicultura'!$F$89,0)+IF('Piscicultura-Apicultura'!$G$91<=9,'Piscicultura-Apicultura'!$F$95,0)+IF('Piscicultura-Apicultura'!$G$97<=9,'Piscicultura-Apicultura'!$F$101,0))","v":0},{"$f":"SUM(IF('Piscicultura-Apicultura'!$G$85<=10,'Piscicultura-Apicultura'!$F$89,0)+IF('Piscicultura-Apicultura'!$G$91<=10,'Piscicultura-Apicultura'!$F$95,0)+IF('Piscicultura-Apicultura'!$G$97<=10,'Piscicultura-Apicultura'!$F$101,0))","v":0},{"$f":"SUM(IF('Piscicultura-Apicultura'!$G$85<=11,'Piscicultura-Apicultura'!$F$89,0)+IF('Piscicultura-Apicultura'!$G$91<=11,'Piscicultura-Apicultura'!$F$95,0)+IF('Piscicultura-Apicultura'!$G$97<=11,'Piscicultura-Apicultura'!$F$101,0))","v":0},{"$f":"SUM(IF('Piscicultura-Apicultura'!$G$85<=12,'Piscicultura-Apicultura'!$F$89,0)+IF('Piscicultura-Apicultura'!$G$91<=12,'Piscicultura-Apicultura'!$F$95,0)+IF('Piscicultura-Apicultura'!$G$97<=12,'Piscicultura-Apicultura'!$F$101,0))","v":0}]
["Outros Desembolsos",{"$f":"IF('Piscicultura-Apicultura'!$G$103<=9,'Piscicultura-Apicultura'!$F$107,0)","v":0},{"$f":"IF('Piscicultura-Apicultura'!$G$103<=10,'Piscicultura-Apicultura'!$F$107,0)","v":0},{"$f":"IF('Piscicultura-Apicultura'!$G$103<=11,'Piscicultura-Apicultura'!$F$107,0)","v":0},{"$f":"IF('Piscicultura-Apicultura'!$G$103<=12,'Piscicultura-Apicultura'!$F$107,0)","v":0}]
["Total",{"$f":"SUM(B61:B63)","v":0},{"$f":"SUM(C61:C63)","v":0},0,{"$f":"SUM(E61:E63)","v":0},0,0,0,0]

{"sheet":"Suporte forrageiro","index":20,"n_rows":49,"n_cols":9,"rows_kept":49,"cut":false,"hidden":true,"merged":[[36,2,36,3],[12,0,13,0],[12,1,12,2],[12,3,12,4],[12,5,12,6],[24,0,25,0],[24,1,24,2],[24,3,24,4],[24,5,24,6],[24,7,24,8],[12,7,12,8],[0,0,1,0],[0,1,0,2],[0,3,0,4],[0,5,0,6],[0,7,0,8]]}
["Categoria","Ano 1",null,"Ano 2",null,"Ano 3",null,"Ano 4"]
[null,"Área (ha)","Capacidade  (ha)","Área (ha)","Capacidade  (ha)","Área (ha)","Capacidade  (ha)","Área (ha)","Capacidade  (ha)"]
["Mecanizado - Sistema Rotacionado Intensivo",{"$f":"IF($A3=\"\",\"\",Pecuária!$B63)","v":0},{"$f":"IF($A3=\"\",\"\",'Suporte forrageiro'!B3*Pecuária!$E63)","v":0},{"$f":"IF($A3=\"\",\"\",Pecuária!$B63)","v":0},{"$f":"IF($A3=\"\",\"\",'Suporte forrageiro'!D3*Pecuária!$E63)","v":0},{"$f":"IF($A3=\"\",\"\",Pecuária!$B63)","v":0},{"$f":"IF($A3=\"\",\"\",'Suporte forrageiro'!F3*Pecuária!$E63)","v":0},{"$f":"IF($A3=\"\",\"\",Pecuária!$B63)","v":0},{"$f":"IF($A3=\"\",\"\",'Suporte forrageiro'!H3*Pecuária!$E63)","v":0}]
["Mecanizado - Tradicional",{"$f":"IF($A4=\"\",\"\",Pecuária!$B64)","v":0},{"$f":"IF($A4=\"\",\"\",'Suporte forrageiro'!B4*Pecuária!$E64)","v":0},{"$f":"IF($A4=\"\",\"\",Pecuária!$B64)","v":0},{"$f":"IF($A4=\"\",\"\",'Suporte forrageiro'!D4*Pecuária!$E64)","v":0},{"$f":"IF($A4=\"\",\"\",Pecuária!$B64)","v":0},{"$f":"IF($A4=\"\",\"\",'Suporte forrageiro'!F4*Pecuária!$E64)","v":0},{"$f":"IF($A4=\"\",\"\",Pecuária!$B64)","v":0},{"$f":"IF($A4=\"\",\"\",'Suporte forrageiro'!H4*Pecuária!$E64)","v":0}]
["Não Mecanizado ",{"$f":"IF($A5=\"\",\"\",Pecuária!$B65)","v":0},{"$f":"IF($A5=\"\",\"\",'Suporte forrageiro'!B5*Pecuária!$E65)","v":0},{"$f":"IF($A5=\"\",\"\",Pecuária!$B65)","v":0},{"$f":"IF($A5=\"\",\"\",'Suporte forrageiro'!D5*Pecuária!$E65)","v":0},{"$f":"IF($A5=\"\",\"\",Pecuária!$B65)","v":0},{"$f":"IF($A5=\"\",\"\",'Suporte forrageiro'!F5*Pecuária!$E65)","v":0},{"$f":"IF($A5=\"\",\"\",Pecuária!$B65)","v":0},{"$f":"IF($A5=\"\",\"\",'Suporte forrageiro'!H5*Pecuária!$E65)","v":0}]
["Capineira",{"$f":"IF($A6=\"\",\"\",Pecuária!$B66)","v":0},{"$f":"IF($A6=\"\",\"\",'Suporte forrageiro'!B6*Pecuária!$E66)","v":0},{"$f":"IF($A6=\"\",\"\",Pecuária!$B66)","v":0},{"$f":"IF($A6=\"\",\"\",'Suporte forrageiro'!D6*Pecuária!$E66)","v":0},{"$f":"IF($A6=\"\",\"\",Pecuária!$B66)","v":0},{"$f":"IF($A6=\"\",\"\",'Suporte forrageiro'!F6*Pecuária!$E66)","v":0},{"$f":"IF($A6=\"\",\"\",Pecuária!$B66)","v":0},{"$f":"IF($A6=\"\",\"\",'Suporte forrageiro'!H6*Pecuária!$E66)","v":0}]
["Pastagens Nativas",{"$f":"IF($A7=\"\",\"\",Pecuária!$B67)","v":0},{"$f":"IF($A7=\"\",\"\",'Suporte forrageiro'!B7*Pecuária!$E67)","v":0},{"$f":"IF($A7=\"\",\"\",Pecuária!$B67)","v":0},{"$f":"IF($A7=\"\",\"\",'Suporte forrageiro'!D7*Pecuária!$E67)","v":0},{"$f":"IF($A7=\"\",\"\",Pecuária!$B67)","v":0},{"$f":"IF($A7=\"\",\"\",'Suporte forrageiro'!F7*Pecuária!$E67)","v":0},{"$f":"IF($A7=\"\",\"\",Pecuária!$B67)","v":0},{"$f":"IF($A7=\"\",\"\",'Suporte forrageiro'!H7*Pecuária!$E67)","v":0}]
["Total",{"$f":"SUM(B3:B7)","v":0},{"$f":"SUM(C3:C7)","v":0},{"$f":"SUM(D3:D7)","v":0},0,0,0,0,0]
["Uso do Suporte Forrageiro - A",null,{"$f":"IFERROR(('Evolução rebanho'!I14)/'Suporte forrageiro'!C8,0)","v":0},null,{"$f":"IFERROR(('Evolução rebanho'!Q14)/'Suporte forrageiro'!E8,0)","v":0},null,{"$f":"IFERROR(('Evolução rebanho'!I28)/'Suporte forrageiro'!G8,0)","v":0},null,{"$f":"IFERROR(('Evolução rebanho'!Q28)/'Suporte forrageiro'!I8,0)","v":0}]
["Uso do Suporte Forrageiro - B",null,{"$f":"IFERROR(('Evolução rebanho'!I98)/'Suporte forrageiro'!C8,0)","v":0},null,{"$f":"IFERROR(('Evolução rebanho'!Q98)/'Suporte forrageiro'!E8,0)","v":0},null,{"$f":"IFERROR(('Evolução rebanho'!I112)/'Suporte forrageiro'!G8,0)","v":0},null,{"$f":"IFERROR(('Evolução rebanho'!Q112)/'Suporte forrageiro'!I8,0)","v":0}]
["Uso do Suporte Forrageiro - Total",null,{"$f":"SUM(C9:C10)","v":0},null,{"$f":"SUM(E9:E10)","v":0},null,{"$f":"SUM(G9:G10)","v":0},null,{"$f":"SUM(I9:I10)","v":0}]
[]
["Categoria","Ano 5",null,"Ano 6",null,"Ano 7",null,"Ano 8"]
[null,"Área (ha)","Capacidade  (ha)","Área (ha)","Capacidade  (ha)","Área (ha)","Capacidade  (ha)","Área (ha)","Capacidade  (ha)"]
["Mecanizado - Sistema Rotacionado Intensivo",{"$f":"IF($A15=\"\",\"\",Pecuária!$B63)","v":0},{"$f":"IF($A15=\"\",\"\",'Suporte forrageiro'!B15*Pecuária!$E63)","v":0},{"$f":"IF($A15=\"\",\"\",Pecuária!$B63)","v":0},{"$f":"IF($A15=\"\",\"\",'Suporte forrageiro'!D15*Pecuária!$E63)","v":0},{"$f":"IF($A15=\"\",\"\",Pecuária!$B63)","v":0},{"$f":"IF($A15=\"\",\"\",'Suporte forrageiro'!F15*Pecuária!$E63)","v":0},{"$f":"IF($A15=\"\",\"\",Pecuária!$B63)","v":0},{"$f":"IF($A15=\"\",\"\",'Suporte forrageiro'!H15*Pecuária!$E63)","v":0}]
["Mecanizado - Tradicional",{"$f":"IF($A16=\"\",\"\",Pecuária!$B64)","v":0},{"$f":"IF($A16=\"\",\"\",'Suporte forrageiro'!B16*Pecuária!$E64)","v":0},{"$f":"IF($A16=\"\",\"\",Pecuária!$B64)","v":0},{"$f":"IF($A16=\"\",\"\",'Suporte forrageiro'!D16*Pecuária!$E64)","v":0},{"$f":"IF($A16=\"\",\"\",Pecuária!$B64)","v":0},{"$f":"IF($A16=\"\",\"\",'Suporte forrageiro'!F16*Pecuária!$E64)","v":0},{"$f":"IF($A16=\"\",\"\",Pecuária!$B64)","v":0},{"$f":"IF($A16=\"\",\"\",'Suporte forrageiro'!H16*Pecuária!$E64)","v":0}]
["Não Mecanizado ",{"$f":"IF($A17=\"\",\"\",Pecuária!$B65)","v":0},{"$f":"IF($A17=\"\",\"\",'Suporte forrageiro'!B17*Pecuária!$E65)","v":0},{"$f":"IF($A17=\"\",\"\",Pecuária!$B65)","v":0},{"$f":"IF($A17=\"\",\"\",'Suporte forrageiro'!D17*Pecuária!$E65)","v":0},{"$f":"IF($A17=\"\",\"\",Pecuária!$B65)","v":0},{"$f":"IF($A17=\"\",\"\",'Suporte forrageiro'!F17*Pecuária!$E65)","v":0},{"$f":"IF($A17=\"\",\"\",Pecuária!$B65)","v":0},{"$f":"IF($A17=\"\",\"\",'Suporte forrageiro'!H17*Pecuária!$E65)","v":0}]
["Capineira",{"$f":"IF($A18=\"\",\"\",Pecuária!$B66)","v":0},{"$f":"IF($A18=\"\",\"\",'Suporte forrageiro'!B18*Pecuária!$E66)","v":0},{"$f":"IF($A18=\"\",\"\",Pecuária!$B66)","v":0},{"$f":"IF($A18=\"\",\"\",'Suporte forrageiro'!D18*Pecuária!$E66)","v":0},{"$f":"IF($A18=\"\",\"\",Pecuária!$B66)","v":0},{"$f":"IF($A18=\"\",\"\",'Suporte forrageiro'!F18*Pecuária!$E66)","v":0},{"$f":"IF($A18=\"\",\"\",Pecuária!$B66)","v":0},{"$f":"IF($A18=\"\",\"\",'Suporte forrageiro'!H18*Pecuária!$E66)","v":0}]
["Pastagens Nativas",{"$f":"IF($A19=\"\",\"\",Pecuária!$B67)","v":0},{"$f":"IF($A19=\"\",\"\",'Suporte forrageiro'!B19*Pecuária!$E67)","v":0},{"$f":"IF($A19=\"\",\"\",Pecuária!$B67)","v":0},{"$f":"IF($A19=\"\",\"\",'Suporte forrageiro'!D19*Pecuária!$E67)","v":0},{"$f":"IF($A19=\"\",\"\",Pecuária!$B67)","v":0},{"$f":"IF($A19=\"\",\"\",'Suporte forrageiro'!F19*Pecuária!$E67)","v":0},{"$f":"IF($A19=\"\",\"\",Pecuária!$B67)","v":0},{"$f":"IF($A19=\"\",\"\",'Suporte forrageiro'!H19*Pecuária!$E67)","v":0}]
["Total",{"$f":"SUM(B15:B19)","v":0},{"$f":"SUM(C15:C19)","v":0},{"$f":"SUM(D15:D19)","v":0},{"$f":"SUM(E15:E19)","v":0},{"$f":"SUM(F15:F19)","v":0},{"$f":"SUM(G15:G19)","v":0},{"$f":"SUM(H15:H19)","v":0},{"$f":"SUM(I15:I19)","v":0}]
["Uso do Suporte Forrageiro - A",null,{"$f":"IFERROR(('Evolução rebanho'!I42)/'Suporte forrageiro'!C20,0)","v":0},null,{"$f":"IFERROR(('Evolução rebanho'!Q42)/'Suporte forrageiro'!E20,0)","v":0},null,{"$f":"IFERROR(('Evolução rebanho'!I56)/'Suporte forrageiro'!G20,0)","v":0},null,{"$f":"IFERROR(('Evolução rebanho'!Q56)/'Suporte forrageiro'!I20,0)","v":0}]
["Uso do Suporte Forrageiro - B",null,{"$f":"IFERROR(('Evolução rebanho'!I126)/'Suporte forrageiro'!C20,0)","v":0},null,{"$f":"IFERROR(('Evolução rebanho'!Q126)/'Suporte forrageiro'!E20,0)","v":0},null,{"$f":"IFERROR(('Evolução rebanho'!I140)/'Suporte forrageiro'!G20,0)","v":0},null,{"$f":"IFERROR(('Evolução rebanho'!Q140)/'Suporte forrageiro'!I20,0)","v":0}]
["Uso do Suporte Forrageiro - Total",null,{"$f":"SUM(C21:C22)","v":0},null,{"$f":"SUM(E21:E22)","v":0},null,{"$f":"SUM(G21:G22)","v":0},null,{"$f":"SUM(I21:I22)","v":0}]
[]
["Categoria","Ano 9",null,"Ano 10",null,"Ano 11",null,"Ano 12"]
[null,"Área (ha)","Capacidade  (ha)","Área (ha)","Capacidade  (ha)","Área (ha)","Capacidade  (ha)","Área (ha)","Capacidade  (ha)"]
["Mecanizado - Sistema Rotacionado Intensivo",{"$f":"IF($A27=\"\",\"\",Pecuária!$B63)","v":0},{"$f":"IF($A27=\"\",\"\",'Suporte forrageiro'!B27*Pecuária!$E63)","v":0},{"$f":"IF($A27=\"\",\"\",Pecuária!$B63)","v":0},{"$f":"IF($A27=\"\",\"\",'Suporte forrageiro'!D27*Pecuária!$E63)","v":0},{"$f":"IF($A27=\"\",\"\",Pecuária!$B63)","v":0},{"$f":"IF($A27=\"\",\"\",'Suporte forrageiro'!F27*Pecuária!$E63)","v":0},{"$f":"IF($A27=\"\",\"\",Pecuária!$B63)","v":0},{"$f":"IF($A27=\"\",\"\",'Suporte forrageiro'!H27*Pecuária!$E63)","v":0}]
["Mecanizado - Tradicional",{"$f":"IF($A28=\"\",\"\",Pecuária!$B64)","v":0},{"$f":"IF($A28=\"\",\"\",'Suporte forrageiro'!B28*Pecuária!$E64)","v":0},{"$f":"IF($A28=\"\",\"\",Pecuária!$B64)","v":0},{"$f":"IF($A28=\"\",\"\",'Suporte forrageiro'!D28*Pecuária!$E64)","v":0},{"$f":"IF($A28=\"\",\"\",Pecuária!$B64)","v":0},{"$f":"IF($A28=\"\",\"\",'Suporte forrageiro'!F28*Pecuária!$E64)","v":0},{"$f":"IF($A28=\"\",\"\",Pecuária!$B64)","v":0},{"$f":"IF($A28=\"\",\"\",'Suporte forrageiro'!H28*Pecuária!$E64)","v":0}]
["Não Mecanizado ",{"$f":"IF($A29=\"\",\"\",Pecuária!$B65)","v":0},{"$f":"IF($A29=\"\",\"\",'Suporte forrageiro'!B29*Pecuária!$E65)","v":0},{"$f":"IF($A29=\"\",\"\",Pecuária!$B65)","v":0},{"$f":"IF($A29=\"\",\"\",'Suporte forrageiro'!D29*Pecuária!$E65)","v":0},{"$f":"IF($A29=\"\",\"\",Pecuária!$B65)","v":0},{"$f":"IF($A29=\"\",\"\",'Suporte forrageiro'!F29*Pecuária!$E65)","v":0},{"$f":"IF($A29=\"\",\"\",Pecuária!$B65)","v":0},{"$f":"IF($A29=\"\",\"\",'Suporte forrageiro'!H29*Pecuária!$E65)","v":0}]
["Capineira",{"$f":"IF($A30=\"\",\"\",Pecuária!$B66)","v":0},{"$f":"IF($A30=\"\",\"\",'Suporte forrageiro'!B30*Pecuária!$E66)","v":0},{"$f":"IF($A30=\"\",\"\",Pecuária!$B66)","v":0},{"$f":"IF($A30=\"\",\"\",'Suporte forrageiro'!D30*Pecuária!$E66)","v":0},{"$f":"IF($A30=\"\",\"\",Pecuária!$B66)","v":0},{"$f":"IF($A30=\"\",\"\",'Suporte forrageiro'!F30*Pecuária!$E66)","v":0},{"$f":"IF($A30=\"\",\"\",Pecuária!$B66)","v":0},{"$f":"IF($A30=\"\",\"\",'Suporte forrageiro'!H30*Pecuária!$E66)","v":0}]
["Pastagens Nativas",{"$f":"IF($A31=\"\",\"\",Pecuária!$B67)","v":0},{"$f":"IF($A31=\"\",\"\",'Suporte forrageiro'!B31*Pecuária!$E67)","v":0},{"$f":"IF($A31=\"\",\"\",Pecuária!$B67)","v":0},{"$f":"IF($A31=\"\",\"\",'Suporte forrageiro'!D31*Pecuária!$E67)","v":0},{"$f":"IF($A31=\"\",\"\",Pecuária!$B67)","v":0},{"$f":"IF($A31=\"\",\"\",'Suporte forrageiro'!F31*Pecuária!$E67)","v":0},{"$f":"IF($A31=\"\",\"\",Pecuária!$B67)","v":0},{"$f":"IF($A31=\"\",\"\",'Suporte forrageiro'!H31*Pecuária!$E67)","v":0}]
["Total",{"$f":"SUM(B27:B31)","v":0},{"$f":"SUM(C27:C31)","v":0},{"$f":"SUM(D27:D31)","v":0},{"$f":"SUM(E27:E31)","v":0},{"$f":"SUM(F27:F31)","v":0},{"$f":"SUM(G27:G31)","v":0},{"$f":"SUM(H27:H31)","v":0},{"$f":"SUM(I27:I31)","v":0}]
["Uso do Suporte Forrageiro - A",null,{"$f":"IFERROR(('Evolução rebanho'!I70)/'Suporte forrageiro'!C32,0)","v":0},null,{"$f":"IFERROR(('Evolução rebanho'!Q70)/'Suporte forrageiro'!E32,0)","v":0},null,{"$f":"IFERROR(('Evolução rebanho'!I83)/'Suporte forrageiro'!G32,0)","v":0},null,{"$f":"IFERROR(('Evolução rebanho'!Q83)/'Suporte forrageiro'!I32,0)","v":0}]
["Uso do Suporte Forrageiro - B",null,{"$f":"IFERROR(('Evolução rebanho'!I154)/'Suporte forrageiro'!C32,0)","v":0},null,{"$f":"IFERROR(('Evolução rebanho'!Q154)/'Suporte forrageiro'!E32,0)","v":0},null,{"$f":"IFERROR(('Evolução rebanho'!I168)/'Suporte forrageiro'!G32,0)","v":0},null,{"$f":"IFERROR(('Evolução rebanho'!Q168)/'Suporte forrageiro'!I32,0)","v":0}]
["Uso do Suporte Forrageiro - Total",null,{"$f":"SUM(C33:C34)","v":0},null,{"$f":"SUM(E33:E34)","v":0},null,{"$f":"SUM(G33:G34)","v":0},null,{"$f":"SUM(I33:I34)","v":0}]
[]
[null,"Ano","Consumo/Disponibilidade",null,"UA","%"]
[null,1,{"$f":"REPT(\"|\",(C11*100))","v":""},{"$f":"IF(C11>85%,\"Suporte Estourado\",REPT(\"|\",(85-(C11*100))))","v":"|||||||||||||||||||||||||||||||||||||||||||||||||||||||||||||||||||||||||||||||||||||"},{"$f":"'Evolução rebanho'!I14+'Evolução rebanho'!I98","v":0},{"$f":"C11","v":0}]
[null,2,{"$f":"REPT(\"|\",(E11*100))","v":""},{"$f":"IF(E11>85%,\"Suporte Estourado\",REPT(\"|\",(85-(E11*100))))","v":"|||||||||||||||||||||||||||||||||||||||||||||||||||||||||||||||||||||||||||||||||||||"},{"$f":"'Evolução rebanho'!Q14+'Evolução rebanho'!Q98","v":0},{"$f":"E11","v":0}]
[null,3,{"$f":"REPT(\"|\",(G11*100))","v":""},{"$f":"IF(G11>85%,\"Suporte Estourado\",REPT(\"|\",(85-(G11*100))))","v":"|||||||||||||||||||||||||||||||||||||||||||||||||||||||||||||||||||||||||||||||||||||"},{"$f":"'Evolução rebanho'!I28+'Evolução rebanho'!I112","v":0},{"$f":"G11","v":0}]
[null,4,{"$f":"REPT(\"|\",(I11*100))","v":""},{"$f":"IF(I11>85%,\"Suporte Estourado\",REPT(\"|\",(85-(I11*100))))","v":"|||||||||||||||||||||||||||||||||||||||||||||||||||||||||||||||||||||||||||||||||||||"},{"$f":"'Evolução rebanho'!Q28+'Evolução rebanho'!Q112","v":0},{"$f":"I11","v":0}]
[null,5,{"$f":"REPT(\"|\",(C23*100))","v":""},{"$f":"IF(C23>85%,\"Suporte Estourado\",REPT(\"|\",(85-(C23*100))))","v":"|||||||||||||||||||||||||||||||||||||||||||||||||||||||||||||||||||||||||||||||||||||"},{"$f":"'Evolução rebanho'!I42+'Evolução rebanho'!I126","v":0},{"$f":"C23","v":0}]
[null,6,{"$f":"REPT(\"|\",(E23*100))","v":""},{"$f":"IF(E23>85%,\"Suporte Estourado\",REPT(\"|\",(85-(E23*100))))","v":"|||||||||||||||||||||||||||||||||||||||||||||||||||||||||||||||||||||||||||||||||||||"},{"$f":"'Evolução rebanho'!Q42+'Evolução rebanho'!Q126","v":0},{"$f":"E23","v":0}]
[null,7,{"$f":"REPT(\"|\",(G23*100))","v":""},{"$f":"IF(G23>85%,\"Suporte Estourado\",REPT(\"|\",(85-(G23*100))))","v":"|||||||||||||||||||||||||||||||||||||||||||||||||||||||||||||||||||||||||||||||||||||"},{"$f":"'Evolução rebanho'!I56+'Evolução rebanho'!I140","v":0},{"$f":"G23","v":0}]
[null,8,{"$f":"REPT(\"|\",(I23*100))","v":""},{"$f":"IF(I23>85%,\"Suporte Estourado\",REPT(\"|\",(85-(I23*100))))","v":"|||||||||||||||||||||||||||||||||||||||||||||||||||||||||||||||||||||||||||||||||||||"},{"$f":"'Evolução rebanho'!Q56+'Evolução rebanho'!Q140","v":0},{"$f":"I23","v":0}]
[null,9,{"$f":"REPT(\"|\",(C35*100))","v":""},{"$f":"IF(C35>85%,\"Suporte Estourado\",REPT(\"|\",(85-(C35*100))))","v":"|||||||||||||||||||||||||||||||||||||||||||||||||||||||||||||||||||||||||||||||||||||"},{"$f":"'Evolução rebanho'!I70+'Evolução rebanho'!I154","v":0},{"$f":"C35","v":0}]
[null,10,{"$f":"REPT(\"|\",(C35*100))","v":""},{"$f":"IF(E35>85%,\"Suporte Estourado\",REPT(\"|\",(85-(E35*100))))","v":"|||||||||||||||||||||||||||||||||||||||||||||||||||||||||||||||||||||||||||||||||||||"},{"$f":"'Evolução rebanho'!Q70+'Evolução rebanho'!Q154","v":0},{"$f":"E35","v":0}]
[null,11,{"$f":"REPT(\"|\",(G35*100))","v":""},{"$f":"IF(G35>85%,\"Suporte Estourado\",REPT(\"|\",(85-(G35*100))))","v":"|||||||||||||||||||||||||||||||||||||||||||||||||||||||||||||||||||||||||||||||||||||"},{"$f":"'Evolução rebanho'!I83+'Evolução rebanho'!I168","v":0},{"$f":"G35","v":0}]
[null,12,{"$f":"REPT(\"|\",(I35*100))","v":""},{"$f":"IF(I35>85%,\"Suporte Estourado\",REPT(\"|\",(85-(I35*100))))","v":"|||||||||||||||||||||||||||||||||||||||||||||||||||||||||||||||||||||||||||||||||||||"},{"$f":"'Evolução rebanho'!Q83+'Evolução rebanho'!Q168","v":0},{"$f":"I35","v":0}]

{"sheet":"Evolução rebanho","index":21,"n_rows":168,"n_cols":17,"rows_kept":168,"cut":false,"hidden":true,"merged":[[0,0,0,16],[1,0,3,0],[1,1,1,8],[1,9,1,16],[2,7,2,8],[2,15,2,16],[29,0,31,0],[29,1,29,8],[29,9,29,16],[30,7,30,8],[30,15,30,16],[15,0,17,0],[15,1,15,8],[15,9,15,16],[16,7,16,8],[16,15,16,16],[84,0,84,16],[43,0,45,0],[43,1,43,8],[43,9,43,16],[44,7,44,8],[44,15,44,16],[57,0,59,0],[57,1,57,8],[57,9,57,16],[58,7,58,8],[58,15,58,16],[70,0,72,0],[70,1,70,8],[70,9,70,16],[71,7,71,8],[71,15,71,16],[99,0,101,0],[99,1,99,8],[99,9,99,16],[100,7,100,8],[100,15,100,16],[85,0,87,0],[85,1,85,8],[85,9,85,16],[86,7,86,8],[86,15,86,16],[127,0,129,0],[127,1,127,8],[127,9,127,16],[128,7,128,8],[128,15,128,16],[113,0,115,0],[113,1,113,8],[113,9,113,16],[114,7,114,8],[114,15,114,16],[155,0,157,0],[155,1,155,8],[155,9,155,16],[156,7,156,8],[156,15,156,16],[141,0,143,0],[141,1,141,8],[141,9,141,16],[142,7,142,8],[142,15,142,16]]}
["Evolução do Rebanho - A"]
["Categoria","Ano 1",null,null,null,null,null,null,null,"Ano 2"]
[null,"Qtd Inicial ","Aquis.","Nasc.","Perda","Venda","Qtd Final","Qtd Média",null,"Qtd Inicial ","Aquis.","Nasc.","Perda","Venda","Qtd Final","Qtd Média"]
[null,"(cab.)","(cab.)","(cab.)","(cab.)","(cab.)","(cab.)","(cab.)","(UA)","(cab.)","(cab.)","(cab.)","(cab.)","(cab.)","(cab.)","(cab.)","(UA)"]
["Reprodutores",{"$f":"Pecuária!B5","v":0},{"$f":"Pecuária!C5+Pecuária!C19","v":0},null,{"$f":"ROUND((B5+C5)*Pecuária!$C$47,0)","v":0},{"$f":"ROUND((B5+C5-E5)*Pecuária!$C$83,0)","v":0},{"$f":"ROUND(B5+C5-E5-F5,0)","v":0},{"$f":"ROUND(SUM(B5,C5)-SUM(E5,F5)/2,0)","v":0},{"$f":"ROUND(H5*Pecuária!$C$71,0)","v":0},{"$f":"G5","v":0},{"$f":"Pecuária!D19","v":0},null,{"$f":"ROUND((J5+K5)*Pecuária!$C$47,0)","v":0},{"$f":"ROUND((J5+K5-M5)*Pecuária!$C$83,0)","v":0},{"$f":"ROUND(J5+K5-M5-N5,0)","v":0},{"$f":"ROUND(SUM(J5,K5)-SUM(M5,N5)/2,0)","v":0},{"$f":"ROUND(P5*Pecuária!$C$71,0)","v":0}]
["Matrizes",{"$f":"Pecuária!B6","v":0},{"$f":"Pecuária!C6+Pecuária!C20","v":0},null,{"$f":"ROUND((B6+C6)*Pecuária!$C$47,0)","v":0},{"$f":"ROUND((B6+C6-E6)*Pecuária!$C$84,0)","v":0},{"$f":"ROUND(B6+C6-E6-F6,0)","v":0},{"$f":"ROUND(SUM(B6,C6)-SUM(E6,F6)/2,0)","v":0},{"$f":"ROUND(H6*Pecuária!$C$72,0)","v":0},{"$f":"G6+G9","v":0},{"$f":"Pecuária!D20","v":0},null,{"$f":"ROUND((J6+K6)*Pecuária!$C$47,0)","v":0},{"$f":"ROUND((J6+K6-M6)*Pecuária!$C$84,0)","v":0},0,{"$f":"ROUND(SUM(J6,K6)-SUM(M6,N6)/2,0)","v":0},{"$f":"ROUND(P6*Pecuária!$C$72,0)","v":0}]
["Bois",{"$f":"Pecuária!B7","v":0},{"$f":"Pecuária!C7+Pecuária!C21","v":0},null,{"$f":"ROUND((B7+C7)*Pecuária!$C$47,0)","v":0},{"$f":"IF(OR(Pecuária!$C$85=\"bois\",Pecuária!$C$86=\"bois\"),ROUND((B7+C7-E7)*100%,0),\"0\")","v":"0"},0,{"$f":"ROUND(SUM(B7,C7)-E7/2,0)","v":0},{"$f":"ROUND(H7*Pecuária!$C$73,0)","v":0},{"$f":"G7+G8","v":0},{"$f":"Pecuária!D21","v":0},null,{"$f":"ROUND((J7+K7)*Pecuária!$C$47,0)","v":0},{"$f":"IF(OR(Pecuária!$C$85=\"bois\",Pecuária!$C$86=\"bois\"),ROUND((J7+K7-M7)*100%,0),\"0\")","v":"0"},0,{"$f":"ROUND(SUM(J7,K7)-M7/2,0)","v":0},{"$f":"ROUND(P7*Pecuária!$C$73,0)","v":0}]
["Novilhos",{"$f":"Pecuária!B8","v":0},{"$f":"Pecuária!C8+Pecuária!C22","v":0},null,{"$f":"ROUND((B8+C8)*Pecuária!$C$46,0)","v":0},{"$f":"IF(OR(Pecuária!$C$85=\"novilho\",Pecuária!$C$86=\"novilho\"),ROUND((B8+C8-E8)*100%,0),\"0\")","v":"0"},0,{"$f":"ROUND(SUM(B8,C8)-E8/2,0)","v":0},{"$f":"ROUND(H8*Pecuária!$C$74,0)","v":0},{"$f":"G10","v":0},{"$f":"Pecuária!D22","v":0},null,{"$f":"ROUND((J8+K8)*Pecuária!$C$46,0)","v":0},{"$f":"IF(OR(Pecuária!$C$85=\"novilho\",Pecuária!$C$86=\"novilho\"),ROUND((J8+K8-M8)*100%,0),\"0\")","v":"0"},0,{"$f":"ROUND(SUM(J8,K8)-M8/2,0)","v":0},{"$f":"ROUND(P8*Pecuária!$C$74,0)","v":0}]
["Novilhas ",{"$f":"Pecuária!B9","v":0},{"$f":"Pecuária!C9+Pecuária!C23","v":0},null,{"$f":"ROUND((B9+C9)*Pecuária!$C$46,0)","v":0},{"$f":"IF(OR(Pecuária!$C$87=\"novilha\",Pecuária!$C$88=\"novilha\"),ROUND((B9+C9-E9)*100%,0),\"0\")","v":"0"},0,{"$f":"ROUND(SUM(B9,C9)-E9/2,0)","v":0},{"$f":"ROUND(H9*Pecuária!$C$75,0)","v":0},{"$f":"G11","v":0},{"$f":"Pecuária!D23","v":0},null,{"$f":"ROUND((J9+K9)*Pecuária!$C$46,0)","v":0},{"$f":"IF(OR(Pecuária!$C$87=\"novilha\",Pecuária!$C$88=\"novilha\"),ROUND((J9+K9-M9)*100%,0),\"0\")","v":"0"},0,{"$f":"ROUND(SUM(J9,K9)-M9/2,0)","v":0},{"$f":"ROUND(P9*Pecuária!$C$75,0)","v":0}]
["Garrotes",{"$f":"Pecuária!B10","v":0},{"$f":"Pecuária!C10+Pecuária!C24","v":0},null,{"$f":"ROUND((B10+C10)*Pecuária!$C$45,0)","v":0},{"$f":"IF(OR(Pecuária!$C$85=\"garrote\",Pecuária!$C$86=\"garrote\"),ROUND((B10+C10-E10)*100%,0),\"0\")","v":"0"},0,{"$f":"ROUND(SUM(B10,C10)-E10/2,0)","v":0},{"$f":"ROUND(H10*Pecuária!$C$76,0)","v":0},{"$f":"G12","v":0},{"$f":"Pecuária!D24","v":0},null,{"$f":"ROUND((J10+K10)*Pecuária!$C$45,0)","v":0},{"$f":"IF(OR(Pecuária!$C$85=\"garrote\",Pecuária!$C$86=\"garrote\"),ROUND((J10+K10-M10)*100%,0),\"0\")","v":"0"},0,{"$f":"ROUND(SUM(J10,K10)-M10/2,0)","v":0},{"$f":"ROUND(P10*Pecuária!$C$76,0)","v":0}]
["Garrotas ",{"$f":"Pecuária!B11","v":0},{"$f":"Pecuária!C11+Pecuária!C25","v":0},null,{"$f":"ROUND((B11+C11)*Pecuária!$C$45,0)","v":0},{"$f":"IF(OR(Pecuária!$C$87=\"garrota\",Pecuária!$C$88=\"garrota\"),ROUND((B11+C11-E11)*100%,0),\"0\")","v":"0"},0,{"$f":"ROUND(SUM(B11,C11)-E11/2,0)","v":0},{"$f":"ROUND(H11*Pecuária!$C$77,0)","v":0},{"$f":"G13","v":0},{"$f":"Pecuária!D25","v":0},null,{"$f":"ROUND((J11+K11)*Pecuária!$C$45,0)","v":0},{"$f":"IF(OR(Pecuária!$C$87=\"garrota\",Pecuária!$C$88=\"garrota\"),ROUND((J11+K11-M11)*100%,0),\"0\")","v":"0"},0,{"$f":"ROUND(SUM(J11,K11)-M11/2,0)","v":0},{"$f":"ROUND(P11*Pecuária!$C$77,0)","v":0}]
["Bezerros ",{"$f":"Pecuária!B12","v":0},{"$f":"Pecuária!C12+Pecuária!C26","v":0},{"$f":"$B$6*Pecuária!$C$43*50%+$C$6*Pecuária!$C$43/2*50%","v":0},{"$f":"ROUND((B12+C12+D12)*Pecuária!$C$44,0)","v":0},{"$f":"IF(OR(Pecuária!$C$85=\"bezerro\",Pecuária!$C$86=\"bezerro\"),(B12+C12+D12-E12)*100%,0)","v":0},{"$f":"ROUND(B12+C12+D12-E12-F12,0)","v":0},{"$f":"ROUND(SUM(B12,C12)+D12/2-E12/2,0)","v":0},{"$f":"ROUND(H12*Pecuária!$C$78,0)","v":0},null,{"$f":"Pecuária!D26","v":0},{"$f":"$J$6*Pecuária!C43*50%+$K$6*Pecuária!C43/2*50%","v":0},{"$f":"ROUND((J12+K12+L12)*Pecuária!$C$44,0)","v":0},{"$f":"IF(OR(Pecuária!$C$85=\"bezerro\",Pecuária!$C$86=\"bezerro\"),ROUND((J12+K12+L12-M12)*100%,0),\"0\")","v":"0"},{"$f":"ROUND(J12+K12+L12-M12-N12,0)","v":0},{"$f":"ROUND(SUM(J12,K12)+L12/2-M12/2,0)","v":0},{"$f":"ROUND(P12*Pecuária!$C$78,0)","v":0}]
["Bezerras ",{"$f":"Pecuária!B13","v":0},{"$f":"Pecuária!C13+Pecuária!C27","v":0},{"$f":"$B$6*Pecuária!$C$43*50%+$C$6*Pecuária!$C$43/2*50%","v":0},{"$f":"ROUND((B13+C13+D13)*Pecuária!$C$44,0)","v":0},{"$f":"IF(OR(Pecuária!$C$87=\"bezerra\",Pecuária!$C$88=\"bezerra\"),ROUND((B13+C13+D13-E13)*100%,0),\"0\")","v":"0"},{"$f":"ROUND(B13+C13+D13-E13-F13,0)","v":0},{"$f":"ROUND(SUM(B13,C13)+D13/2-E13/2,0)","v":0},{"$f":"ROUND(H13*Pecuária!$C$79,0)","v":0},null,{"$f":"Pecuária!D27","v":0},{"$f":"$J$6*Pecuária!C43*50%+$K$6*Pecuária!C43/2*50%","v":0},{"$f":"ROUND((J13+K13+L13)*Pecuária!$C$44,0)","v":0},{"$f":"IF(OR(Pecuária!$C$87=\"bezerra\",Pecuária!$C$88=\"bezerra\"),ROUND((J13+K13+L13-M13)*100%,0),\"0\")","v":"0"},{"$f":"ROUND(J13+K13+L13-M13-N13,0)","v":0},{"$f":"ROUND(SUM(J13,K13)+L13/2-M13/2,0)","v":0},{"$f":"ROUND(P13*Pecuária!$C$79,0)","v":0}]
["Total",{"$f":"SUM(B5:B13)","v":0},{"$f":"SUM(C5:C13)","v":0},{"$f":"SUM(D12:D13)","v":0},{"$f":"SUM(E5:E13)","v":0},0,0,{"$f":"SUM(H5:H13)","v":0},0,0,0,0,0,0,0,0,0]
[]
["Categoria","Ano 3",null,null,null,null,null,null,null,"Ano 4"]
[null,"Qtd Inicial ","Aquis.","Nasc.","Perda","Venda","Qtd Final","Qtd Média",null,"Qtd Inicial ","Aquis.","Nasc.","Perda","Venda","Qtd Final","Qtd Média"]
[null,"(cab.)","(cab.)","(cab.)","(cab.)","(cab.)","(cab.)","(cab.)","(UA)","(cab.)","(cab.)","(cab.)","(cab.)","(cab.)","(cab.)","(cab.)","(UA)"]
["Reprodutores",{"$f":"O5","v":0},{"$f":"Pecuária!$E19","v":0},null,{"$f":"ROUND((B19+C19)*Pecuária!$C$47,0)","v":0},{"$f":"ROUND((B19+C19-E19)*Pecuária!$C$83,0)","v":0},{"$f":"ROUND(B19+C19-E19-F19,0)","v":0},{"$f":"ROUND(SUM(B19,C19)-SUM(E19,F19)/2,0)","v":0},{"$f":"ROUND(H19*Pecuária!$C$71,0)","v":0},{"$f":"G19","v":0},{"$f":"Pecuária!$E19","v":0},null,{"$f":"ROUND((J19+K19)*Pecuária!$C$47,0)","v":0},{"$f":"ROUND((J19+K19-M19)*Pecuária!$C$83,0)","v":0},{"$f":"ROUND(J19+K19-M19-N19,0)","v":0},{"$f":"ROUND(SUM(J19,K19)-SUM(M19,N19)/2,0)","v":0},{"$f":"ROUND(P19*Pecuária!$C$71,0)","v":0}]
["Matrizes",{"$f":"O6+O9","v":0},{"$f":"Pecuária!$E20","v":0},null,{"$f":"ROUND((B20+C20)*Pecuária!$C$47,0)","v":0},{"$f":"ROUND((B20+C20-E20)*Pecuária!$C$84,0)","v":0},0,{"$f":"ROUND(SUM(B20,C20)-SUM(E20,F20)/2,0)","v":0},{"$f":"ROUND(H20*Pecuária!$C$72,0)","v":0},{"$f":"G20+G23","v":0},{"$f":"Pecuária!$E20","v":0},null,{"$f":"ROUND((J20+K20)*Pecuária!$C$47,0)","v":0},{"$f":"ROUND((J20+K20-M20)*Pecuária!$C$84,0)","v":0},{"$f":"ROUND(J20+K20-M20-N20,0)","v":0},{"$f":"ROUND(SUM(J20,K20)-SUM(M20,N20)/2,0)","v":0},{"$f":"ROUND(P20*Pecuária!$C$72,0)","v":0}]
["Bois",{"$f":"O7+O8","v":0},{"$f":"Pecuária!$E21","v":0},null,{"$f":"ROUND((B21+C21)*Pecuária!$C$47,0)","v":0},{"$f":"IF(OR(Pecuária!$C$85=\"bois\",Pecuária!$C$86=\"bois\"),ROUND((B21+C21-E21)*100%,0),\"0\")","v":"0"},0,{"$f":"ROUND(SUM(B21,C21)-E21/2,0)","v":0},{"$f":"ROUND(H21*Pecuária!$C$73,0)","v":0},{"$f":"G21+G22","v":0},{"$f":"Pecuária!$E21","v":0},null,{"$f":"ROUND((J21+K21)*Pecuária!$C$47,0)","v":0},{"$f":"IF(OR(Pecuária!$C$85=\"bois\",Pecuária!$C$86=\"bois\"),ROUND((J21+K21-M21)*100%,0),\"0\")","v":"0"},0,{"$f":"ROUND(SUM(J21,K21)-M21/2,0)","v":0},{"$f":"ROUND(P21*Pecuária!$C$73,0)","v":0}]
["Novilhos",{"$f":"O10","v":0},{"$f":"Pecuária!$E22","v":0},null,{"$f":"ROUND((B22+C22)*Pecuária!$C$46,0)","v":0},{"$f":"IF(OR(Pecuária!$C$85=\"novilho\",Pecuária!$C$86=\"novilho\"),ROUND((B22+C22-E22)*100%,0),\"0\")","v":"0"},0,{"$f":"ROUND(SUM(B22,C22)-E22/2,0)","v":0},{"$f":"ROUND(H22*Pecuária!$C$74,0)","v":0},{"$f":"G24","v":0},{"$f":"Pecuária!$E22","v":0},null,{"$f":"ROUND((J22+K22)*Pecuária!$C$46,0)","v":0},{"$f":"IF(OR(Pecuária!$C$85=\"novilho\",Pecuária!$C$86=\"novilho\"),ROUND((J22+K22-M22)*100%,0),\"0\")","v":"0"},0,{"$f":"ROUND(SUM(J22,K22)-M22/2,0)","v":0},{"$f":"ROUND(P22*Pecuária!$C$74,0)","v":0}]
["Novilhas ",{"$f":"O11","v":0},{"$f":"Pecuária!$E23","v":0},null,{"$f":"ROUND((B23+C23)*Pecuária!$C$46,0)","v":0},{"$f":"IF(OR(Pecuária!$C$87=\"novilha\",Pecuária!$C$88=\"novilha\"),ROUND((B23+C23-E23)*100%,0),\"0\")","v":"0"},0,{"$f":"ROUND(SUM(B23,C23)-E23/2,0)","v":0},{"$f":"ROUND(H23*Pecuária!$C$75,0)","v":0},{"$f":"G25","v":0},{"$f":"Pecuária!$E23","v":0},null,{"$f":"ROUND((J23+K23)*Pecuária!$C$46,0)","v":0},{"$f":"IF(OR(Pecuária!$C$87=\"novilha\",Pecuária!$C$88=\"novilha\"),ROUND((J23+K23-M23)*100%,0),\"0\")","v":"0"},0,{"$f":"ROUND(SUM(J23,K23)-M23/2,0)","v":0},{"$f":"ROUND(P23*Pecuária!$C$75,0)","v":0}]
["Garrotes",{"$f":"O12","v":0},{"$f":"Pecuária!$E24","v":0},null,{"$f":"ROUND((B24+C24)*Pecuária!$C$45,0)","v":0},{"$f":"IF(OR(Pecuária!$C$85=\"garrote\",Pecuária!$C$86=\"garrote\"),ROUND((B24+C24-E24)*100%,0),\"0\")","v":"0"},0,{"$f":"ROUND(SUM(B24,C24)-E24/2,0)","v":0},{"$f":"ROUND(H24*Pecuária!$C$76,0)","v":0},{"$f":"G26","v":0},{"$f":"Pecuária!$E24","v":0},null,{"$f":"ROUND((J24+K24)*Pecuária!$C$45,0)","v":0},{"$f":"IF(OR(Pecuária!$C$85=\"garrote\",Pecuária!$C$86=\"garrote\"),ROUND((J24+K24-M24)*100%,0),\"0\")","v":"0"},0,{"$f":"ROUND(SUM(J24,K24)-M24/2,0)","v":0},{"$f":"ROUND(P24*Pecuária!$C$76,0)","v":0}]
["Garrotas ",{"$f":"O13","v":0},{"$f":"Pecuária!$E25","v":0},null,{"$f":"ROUND((B25+C25)*Pecuária!$C$45,0)","v":0},{"$f":"IF(OR(Pecuária!$C$87=\"garrota\",Pecuária!$C$88=\"garrota\"),ROUND((B25+C25-E25)*100%,0),\"0\")","v":"0"},0,{"$f":"ROUND(SUM(B25,C25)-E25/2,0)","v":0},{"$f":"ROUND(H25*Pecuária!$C$77,0)","v":0},{"$f":"G27","v":0},{"$f":"Pecuária!$E25","v":0},null,{"$f":"ROUND((J25+K25)*Pecuária!$C$45,0)","v":0},{"$f":"IF(OR(Pecuária!$C$87=\"garrota\",Pecuária!$C$88=\"garrota\"),ROUND((J25+K25-M25)*100%,0),\"0\")","v":"0"},0,{"$f":"ROUND(SUM(J25,K25)-M25/2,0)","v":0},{"$f":"ROUND(P25*Pecuária!$C$77,0)","v":0}]
["Bezerros ",null,{"$f":"Pecuária!$E26","v":0},{"$f":"$B20*Pecuária!$C$43*50%+$C20*Pecuária!$C$43/2*50%","v":0},{"$f":"ROUND((B26+C26+D26)*Pecuária!$C$44,0)","v":0},{"$f":"IF(OR(Pecuária!$C$85=\"bezerro\",Pecuária!$C$86=\"bezerro\"),ROUND((B26+C26+D26-E26)*100%,0),\"0\")","v":"0"},{"$f":"ROUND(B26+C26+D26-E26-F26,0)","v":0},{"$f":"ROUND(SUM(B26,C26)+D26/2-E26/2,0)","v":0},{"$f":"ROUND(H26*Pecuária!$C$78,0)","v":0},null,{"$f":"Pecuária!$E26","v":0},{"$f":"J20*Pecuária!$C$43*50%+K20*Pecuária!$C$43/2*50%","v":0},{"$f":"ROUND((J26+K26+L26)*Pecuária!$C$44,0)","v":0},{"$f":"IF(OR(Pecuária!$C$85=\"bezerro\",Pecuária!$C$86=\"bezerro\"),ROUND((J26+K26+L26-M26)*100%,0),\"0\")","v":"0"},{"$f":"ROUND(J26+K26+L26-M26-N26,0)","v":0},{"$f":"ROUND(SUM(J26,K26)+L26/2-M26/2,0)","v":0},{"$f":"ROUND(P26*Pecuária!$C$78,0)","v":0}]
["Bezerras ",null,{"$f":"Pecuária!$E27","v":0},{"$f":"$B20*Pecuária!$C$43*50%+$C20*Pecuária!$C$43/2*50%","v":0},{"$f":"ROUND((B27+C27+D27)*Pecuária!$C$44,0)","v":0},{"$f":"IF(OR(Pecuária!$C$87=\"bezerra\",Pecuária!$C$88=\"bezerra\"),ROUND((B27+C27+D27-E27)*100%,0),\"0\")","v":"0"},{"$f":"ROUND(B27+C27+D27-E27-F27,0)","v":0},{"$f":"ROUND(SUM(B27,C27)+D27/2-E27/2,0)","v":0},{"$f":"ROUND(H27*Pecuária!$C$79,0)","v":0},null,{"$f":"Pecuária!$E27","v":0},{"$f":"$J20*Pecuária!$C$43*50%+$K20*Pecuária!$C$43/2*50%","v":0},{"$f":"ROUND((J27+K27+L27)*Pecuária!$C$44,0)","v":0},{"$f":"IF(OR(Pecuária!$C$87=\"bezerra\",Pecuária!$C$88=\"bezerra\"),ROUND((J27+K27+L27-M27)*100%,0),\"0\")","v":"0"},{"$f":"ROUND(J27+K27+L27-M27-N27,0)","v":0},{"$f":"ROUND(SUM(J27,K27)+L27/2-M27/2,0)","v":0},{"$f":"ROUND(P27*Pecuária!$C$79,0)","v":0}]
["Total",{"$f":"SUM(B19:B27)","v":0},0,0,0,0,0,0,0,0,{"$f":"SUM(K19:K27)","v":0},0,0,0,0,0,0]
[]
["Categoria","Ano 5",null,null,null,null,null,null,null,"Ano 6"]
[null,"Qtd Inicial ","Aquis.","Nasc.","Perda","Venda","Qtd Final","Qtd Média",null,"Qtd Inicial ","Aquis.","Nasc.","Perda","Venda","Qtd Final","Qtd Média"]
[null,"(cab.)","(cab.)","(cab.)","(cab.)","(cab.)","(cab.)","(cab.)","(UA)","(cab.)","(cab.)","(cab.)","(cab.)","(cab.)","(cab.)","(cab.)","(UA)"]
["Reprodutores",{"$f":"O19","v":0},{"$f":"Pecuária!$E19","v":0},null,{"$f":"ROUND((B33+C33)*Pecuária!$C$47,0)","v":0},{"$f":"ROUND((B33+C33-E33)*Pecuária!$C$83,0)","v":0},{"$f":"ROUND(B33+C33-E33-F33,0)","v":0},{"$f":"ROUND(SUM(B33,C33)-SUM(E33,F33)/2,0)","v":0},{"$f":"ROUND(H33*Pecuária!$C$71,0)","v":0},{"$f":"G33","v":0},{"$f":"Pecuária!$E19","v":0},null,{"$f":"ROUND((J33+K33)*Pecuária!$C$47,0)","v":0},{"$f":"ROUND((J33+K33-M33)*Pecuária!$C$83,0)","v":0},{"$f":"ROUND(J33+K33-M33-N33,0)","v":0},{"$f":"ROUND(SUM(J33,K33)-SUM(M33,N33)/2,0)","v":0},{"$f":"ROUND(P33*Pecuária!$C$71,0)","v":0}]
["Matrizes",{"$f":"O20+O23","v":0},{"$f":"Pecuária!$E20","v":0},null,{"$f":"ROUND((B34+C34)*Pecuária!$C$47,0)","v":0},{"$f":"ROUND((B34+C34-E34)*Pecuária!$C$84,0)","v":0},0,{"$f":"ROUND(SUM(B34,C34)-SUM(E34,F34)/2,0)","v":0},{"$f":"ROUND(H34*Pecuária!$C$72,0)","v":0},{"$f":"G34+G37","v":0},{"$f":"Pecuária!$E20","v":0},null,{"$f":"ROUND((J34+K34)*Pecuária!$C$47,0)","v":0},{"$f":"ROUND((J34+K34-M34)*Pecuária!$C$84,0)","v":0},0,{"$f":"ROUND(SUM(J34,K34)-SUM(M34,N34)/2,0)","v":0},{"$f":"ROUND(P34*Pecuária!$C$72,0)","v":0}]
["Bois",{"$f":"O21+O22","v":0},{"$f":"Pecuária!$E21","v":0},null,{"$f":"ROUND((B35+C35)*Pecuária!$C$47,0)","v":0},{"$f":"IF(OR(Pecuária!$C$85=\"bois\",Pecuária!$C$86=\"bois\"),ROUND((B35+C35-E35)*100%,0),\"0\")","v":"0"},0,{"$f":"ROUND(SUM(B35,C35)-E35/2,0)","v":0},{"$f":"ROUND(H35*Pecuária!$C$73,0)","v":0},{"$f":"G35+G36","v":0},{"$f":"Pecuária!$E21","v":0},null,{"$f":"ROUND((J35+K35)*Pecuária!$C$47,0)","v":0},{"$f":"IF(OR(Pecuária!$C$85=\"bois\",Pecuária!$C$86=\"bois\"),ROUND((J35+K35-M35)*100%,0),\"0\")","v":"0"},0,{"$f":"ROUND(SUM(J35,K35)-M35/2,0)","v":0},{"$f":"ROUND(P35*Pecuária!$C$73,0)","v":0}]
["Novilhos",{"$f":"O24","v":0},{"$f":"Pecuária!$E22","v":0},null,{"$f":"ROUND((B36+C36)*Pecuária!$C$46,0)","v":0},{"$f":"IF(OR(Pecuária!$C$85=\"novilho\",Pecuária!$C$86=\"novilho\"),ROUND((B36+C36-E36)*100%,0),\"0\")","v":"0"},0,{"$f":"ROUND(SUM(B36,C36)-E36/2,0)","v":0},{"$f":"ROUND(H36*Pecuária!$C$74,0)","v":0},{"$f":"G38","v":0},{"$f":"Pecuária!$E22","v":0},null,{"$f":"ROUND((J36+K36)*Pecuária!$C$46,0)","v":0},{"$f":"IF(OR(Pecuária!$C$85=\"novilho\",Pecuária!$C$86=\"novilho\"),ROUND((J36+K36-M36)*100%,0),\"0\")","v":"0"},0,{"$f":"ROUND(SUM(J36,K36)-M36/2,0)","v":0},{"$f":"ROUND(P36*Pecuária!$C$74,0)","v":0}]
["Novilhas ",{"$f":"O25","v":0},{"$f":"Pecuária!$E23","v":0},null,{"$f":"ROUND((B37+C37)*Pecuária!$C$46,0)","v":0},{"$f":"IF(OR(Pecuária!$C$87=\"novilha\",Pecuária!$C$88=\"novilha\"),ROUND((B37+C37-E37)*100%,0),\"0\")","v":"0"},0,{"$f":"ROUND(SUM(B37,C37)-E37/2,0)","v":0},{"$f":"ROUND(H37*Pecuária!$C$75,0)","v":0},{"$f":"G39","v":0},{"$f":"Pecuária!$E23","v":0},null,{"$f":"ROUND((J37+K37)*Pecuária!$C$46,0)","v":0},{"$f":"IF(OR(Pecuária!$C$87=\"novilha\",Pecuária!$C$88=\"novilha\"),ROUND((J37+K37-M37)*100%,0),\"0\")","v":"0"},0,{"$f":"ROUND(SUM(J37,K37)-M37/2,0)","v":0},{"$f":"ROUND(P37*Pecuária!$C$75,0)","v":0}]
["Garrotes",{"$f":"O26","v":0},{"$f":"Pecuária!$E24","v":0},null,{"$f":"ROUND((B38+C38)*Pecuária!$C$45,0)","v":0},{"$f":"IF(OR(Pecuária!$C$85=\"garrote\",Pecuária!$C$86=\"garrote\"),ROUND((B38+C38-E38)*100%,0),\"0\")","v":"0"},0,{"$f":"ROUND(SUM(B38,C38)-E38/2,0)","v":0},{"$f":"ROUND(H38*Pecuária!$C$76,0)","v":0},{"$f":"G40","v":0},{"$f":"Pecuária!$E24","v":0},null,{"$f":"ROUND((J38+K38)*Pecuária!$C$45,0)","v":0},{"$f":"IF(OR(Pecuária!$C$85=\"garrote\",Pecuária!$C$86=\"garrote\"),ROUND((J38+K38-M38)*100%,0),\"0\")","v":"0"},0,{"$f":"ROUND(SUM(J38,K38)-M38/2,0)","v":0},{"$f":"ROUND(P38*Pecuária!$C$76,0)","v":0}]
["Garrotas ",{"$f":"O27","v":0},{"$f":"Pecuária!$E25","v":0},null,{"$f":"ROUND((B39+C39)*Pecuária!$C$45,0)","v":0},{"$f":"IF(OR(Pecuária!$C$87=\"garrota\",Pecuária!$C$88=\"garrota\"),ROUND((B39+C39-E39)*100%,0),\"0\")","v":"0"},0,{"$f":"ROUND(SUM(B39,C39)-E39/2,0)","v":0},{"$f":"ROUND(H39*Pecuária!$C$77,0)","v":0},{"$f":"G41","v":0},{"$f":"Pecuária!$E25","v":0},null,{"$f":"ROUND((J39+K39)*Pecuária!$C$45,0)","v":0},{"$f":"IF(OR(Pecuária!$C$87=\"garrota\",Pecuária!$C$88=\"garrota\"),ROUND((J39+K39-M39)*100%,0),\"0\")","v":"0"},0,{"$f":"ROUND(SUM(J39,K39)-M39/2,0)","v":0},{"$f":"ROUND(P39*Pecuária!$C$77,0)","v":0}]
["Bezerros ",null,{"$f":"Pecuária!$E26","v":0},{"$f":"$B34*Pecuária!$C$43*50%+$C34*Pecuária!$C$43/2*50%","v":0},{"$f":"ROUND((B40+C40+D40)*Pecuária!$C$44,0)","v":0},{"$f":"IF(OR(Pecuária!$C$85=\"bezerro\",Pecuária!$C$86=\"bezerro\"),ROUND((B40+C40+D40-E40)*100%,0),\"0\")","v":"0"},{"$f":"ROUND(B40+C40+D40-E40-F40,0)","v":0},{"$f":"ROUND(SUM(B40,C40)+D40/2-E40/2,0)","v":0},{"$f":"ROUND(H40*Pecuária!$C$78,0)","v":0},null,{"$f":"Pecuária!$E26","v":0},{"$f":"J34*Pecuária!$C$43*50%+K34*Pecuária!$C$43/2*50%","v":0},{"$f":"ROUND((J40+K40+L40)*Pecuária!$C$44,0)","v":0},{"$f":"IF(OR(Pecuária!$C$85=\"bezerro\",Pecuária!$C$86=\"bezerro\"),ROUND((J40+K40+L40-M40)*100%,0),\"0\")","v":"0"},{"$f":"ROUND(J40+K40+L40-M40-N40,0)","v":0},{"$f":"ROUND(SUM(J40,K40)+L40/2-M40/2,0)","v":0},{"$f":"ROUND(P40*Pecuária!$C$78,0)","v":0}]
["Bezerras ",null,{"$f":"Pecuária!$E27","v":0},{"$f":"$B34*Pecuária!$C$43*50%+$C34*Pecuária!$C$43/2*50%","v":0},{"$f":"ROUND((B41+C41+D41)*Pecuária!$C$44,0)","v":0},{"$f":"IF(OR(Pecuária!$C$87=\"bezerra\",Pecuária!$C$88=\"bezerra\"),ROUND((B41+C41+D41-E41)*100%,0),\"0\")","v":"0"},{"$f":"ROUND(B41+C41+D41-E41-F41,0)","v":0},{"$f":"ROUND(SUM(B41,C41)+D41/2-E41/2,0)","v":0},{"$f":"ROUND(H41*Pecuária!$C$79,0)","v":0},null,{"$f":"Pecuária!$E27","v":0},{"$f":"$J34*Pecuária!$C$43*50%+$K34*Pecuária!$C$43/2*50%","v":0},{"$f":"ROUND((J41+K41+L41)*Pecuária!$C$44,0)","v":0},{"$f":"IF(OR(Pecuária!$C$87=\"bezerra\",Pecuária!$C$88=\"bezerra\"),ROUND((J41+K41+L41-M41)*100%,0),\"0\")","v":"0"},{"$f":"ROUND(J41+K41+L41-M41-N41,0)","v":0},{"$f":"ROUND(SUM(J41,K41)+L41/2-M41/2,0)","v":0},{"$f":"ROUND(P41*Pecuária!$C$79,0)","v":0}]
["Total",{"$f":"SUM(B33:B41)","v":0},{"$f":"SUM(C33:C41)","v":0},{"$f":"SUM(D40:D41)","v":0},{"$f":"SUM(E33:E41)","v":0},0,0,0,0,0,0,0,0,0,0,0,0]
[]
["Categoria","Ano 7",null,null,null,null,null,null,null,"Ano 8"]
[null,"Qtd Inicial ","Aquis.","Nasc.","Perda","Venda","Qtd Final","Qtd Média",null,"Qtd Inicial ","Aquis.","Nasc.","Perda","Venda","Qtd Final","Qtd Média"]
[null,"(cab.)","(cab.)","(cab.)","(cab.)","(cab.)","(cab.)","(cab.)","(UA)","(cab.)","(cab.)","(cab.)","(cab.)","(cab.)","(cab.)","(cab.)","(UA)"]
["Reprodutores",{"$f":"O33","v":0},{"$f":"Pecuária!$E19","v":0},null,{"$f":"ROUND((B47+C47)*Pecuária!$C$47,0)","v":0},{"$f":"ROUND((B47+C47-E47)*Pecuária!$C$83,0)","v":0},{"$f":"ROUND(B47+C47-E47-F47,0)","v":0},{"$f":"ROUND(SUM(B47,C47)-SUM(E47,F47)/2,0)","v":0},{"$f":"ROUND(H47*Pecuária!$C$71,0)","v":0},{"$f":"G47","v":0},{"$f":"Pecuária!$E19","v":0},null,{"$f":"ROUND((J47+K47)*Pecuária!$C$47,0)","v":0},{"$f":"ROUND((J47+K47-M47)*Pecuária!$C$83,0)","v":0},{"$f":"ROUND(J47+K47-M47-N47,0)","v":0},{"$f":"ROUND(SUM(J47,K47)-SUM(M47,N47)/2,0)","v":0},{"$f":"ROUND(P47*Pecuária!$C$71,0)","v":0}]
["Matrizes",{"$f":"O34+O37","v":0},{"$f":"Pecuária!$E20","v":0},null,{"$f":"ROUND((B48+C48)*Pecuária!$C$47,0)","v":0},{"$f":"ROUND((B48+C48-E48)*Pecuária!$C$84,0)","v":0},0,{"$f":"ROUND(SUM(B48,C48)-SUM(E48,F48)/2,0)","v":0},{"$f":"ROUND(H48*Pecuária!$C$72,0)","v":0},{"$f":"G48+G51","v":0},{"$f":"Pecuária!$E20","v":0},null,{"$f":"ROUND((J48+K48)*Pecuária!$C$47,0)","v":0},{"$f":"ROUND((J48+K48-M48)*Pecuária!$C$84,0)","v":0},0,{"$f":"ROUND(SUM(J48,K48)-SUM(M48,N48)/2,0)","v":0},{"$f":"ROUND(P48*Pecuária!$C$72,0)","v":0}]
["Bois",{"$f":"O35+O36","v":0},{"$f":"Pecuária!$E21","v":0},null,{"$f":"ROUND((B49+C49)*Pecuária!$C$47,0)","v":0},{"$f":"IF(OR(Pecuária!$C$85=\"bois\",Pecuária!$C$86=\"bois\"),ROUND((B49+C49-E49)*100%,0),\"0\")","v":"0"},0,{"$f":"ROUND(SUM(B49,C49)-E49/2,0)","v":0},{"$f":"ROUND(H49*Pecuária!$C$73,0)","v":0},{"$f":"G49+G50","v":0},{"$f":"Pecuária!$E21","v":0},null,{"$f":"ROUND((J49+K49)*Pecuária!$C$47,0)","v":0},{"$f":"IF(OR(Pecuária!$C$85=\"bois\",Pecuária!$C$86=\"bois\"),ROUND((J49+K49-M49)*100%,0),\"0\")","v":"0"},0,{"$f":"ROUND(SUM(J49,K49)-M49/2,0)","v":0},{"$f":"ROUND(P49*Pecuária!$C$73,0)","v":0}]
["Novilhos",{"$f":"O38","v":0},{"$f":"Pecuária!$E22","v":0},null,{"$f":"ROUND((B50+C50)*Pecuária!$C$46,0)","v":0},{"$f":"IF(OR(Pecuária!$C$85=\"novilho\",Pecuária!$C$86=\"novilho\"),ROUND((B50+C50-E50)*100%,0),\"0\")","v":"0"},0,{"$f":"ROUND(SUM(B50,C50)-E50/2,0)","v":0},{"$f":"ROUND(H50*Pecuária!$C$74,0)","v":0},{"$f":"G52","v":0},{"$f":"Pecuária!$E22","v":0},null,{"$f":"ROUND((J50+K50)*Pecuária!$C$46,0)","v":0},{"$f":"IF(OR(Pecuária!$C$85=\"novilho\",Pecuária!$C$86=\"novilho\"),ROUND((J50+K50-M50)*100%,0),\"0\")","v":"0"},0,{"$f":"ROUND(SUM(J50,K50)-M50/2,0)","v":0},{"$f":"ROUND(P50*Pecuária!$C$74,0)","v":0}]
["Novilhas ",{"$f":"O39","v":0},{"$f":"Pecuária!$E23","v":0},null,{"$f":"ROUND((B51+C51)*Pecuária!$C$46,0)","v":0},{"$f":"IF(OR(Pecuária!$C$87=\"novilha\",Pecuária!$C$88=\"novilha\"),ROUND((B51+C51-E51)*100%,0),\"0\")","v":"0"},0,{"$f":"ROUND(SUM(B51,C51)-E51/2,0)","v":0},{"$f":"ROUND(H51*Pecuária!$C$75,0)","v":0},{"$f":"G53","v":0},{"$f":"Pecuária!$E23","v":0},null,{"$f":"ROUND((J51+K51)*Pecuária!$C$46,0)","v":0},{"$f":"IF(OR(Pecuária!$C$87=\"novilha\",Pecuária!$C$88=\"novilha\"),ROUND((J51+K51-M51)*100%,0),\"0\")","v":"0"},0,{"$f":"ROUND(SUM(J51,K51)-M51/2,0)","v":0},{"$f":"ROUND(P51*Pecuária!$C$75,0)","v":0}]
["Garrotes",{"$f":"O40","v":0},{"$f":"Pecuária!$E24","v":0},null,{"$f":"ROUND((B52+C52)*Pecuária!$C$45,0)","v":0},{"$f":"IF(OR(Pecuária!$C$85=\"garrote\",Pecuária!$C$86=\"garrote\"),ROUND((B52+C52-E52)*100%,0),\"0\")","v":"0"},0,{"$f":"ROUND(SUM(B52,C52)-E52/2,0)","v":0},{"$f":"ROUND(H52*Pecuária!$C$76,0)","v":0},{"$f":"G54","v":0},{"$f":"Pecuária!$E24","v":0},null,{"$f":"ROUND((J52+K52)*Pecuária!$C$45,0)","v":0},{"$f":"IF(OR(Pecuária!$C$85=\"garrote\",Pecuária!$C$86=\"garrote\"),ROUND((J52+K52-M52)*100%,0),\"0\")","v":"0"},0,{"$f":"ROUND(SUM(J52,K52)-M52/2,0)","v":0},{"$f":"ROUND(P52*Pecuária!$C$76,0)","v":0}]
["Garrotas ",{"$f":"O41","v":0},{"$f":"Pecuária!$E25","v":0},null,{"$f":"ROUND((B53+C53)*Pecuária!$C$45,0)","v":0},{"$f":"IF(OR(Pecuária!$C$87=\"garrota\",Pecuária!$C$88=\"garrota\"),ROUND((B53+C53-E53)*100%,0),\"0\")","v":"0"},0,{"$f":"ROUND(SUM(B53,C53)-E53/2,0)","v":0},{"$f":"ROUND(H53*Pecuária!$C$77,0)","v":0},{"$f":"G55","v":0},{"$f":"Pecuária!$E25","v":0},null,{"$f":"ROUND((J53+K53)*Pecuária!$C$45,0)","v":0},{"$f":"IF(OR(Pecuária!$C$87=\"garrota\",Pecuária!$C$88=\"garrota\"),ROUND((J53+K53-M53)*100%,0),\"0\")","v":"0"},0,{"$f":"ROUND(SUM(J53,K53)-M53/2,0)","v":0},{"$f":"ROUND(P53*Pecuária!$C$77,0)","v":0}]
["Bezerros ",null,{"$f":"Pecuária!$E26","v":0},{"$f":"$B48*Pecuária!$C$43*50%+$C48*Pecuária!$C$43/2*50%","v":0},{"$f":"ROUND((B54+C54+D54)*Pecuária!$C$44,0)","v":0},{"$f":"IF(OR(Pecuária!$C$85=\"bezerro\",Pecuária!$C$86=\"bezerro\"),ROUND((B54+C54+D54-E54)*100%,0),\"0\")","v":"0"},{"$f":"ROUND(B54+C54+D54-E54-F54,0)","v":0},{"$f":"ROUND(SUM(B54,C54)+D54/2-E54/2,0)","v":0},{"$f":"ROUND(H54*Pecuária!$C$78,0)","v":0},null,{"$f":"Pecuária!$E26","v":0},{"$f":"J48*Pecuária!$C$43*50%+K48*Pecuária!$C$43/2*50%","v":0},{"$f":"ROUND((J54+K54+L54)*Pecuária!$C$44,0)","v":0},{"$f":"IF(OR(Pecuária!$C$85=\"bezerro\",Pecuária!$C$86=\"bezerro\"),ROUND((J54+K54+L54-M54)*100%,0),\"0\")","v":"0"},{"$f":"ROUND(J54+K54+L54-M54-N54,0)","v":0},{"$f":"ROUND(SUM(J54,K54)+L54/2-M54/2,0)","v":0},{"$f":"ROUND(P54*Pecuária!$C$78,0)","v":0}]
["Bezerras ",null,{"$f":"Pecuária!$E27","v":0},{"$f":"$B48*Pecuária!$C$43*50%+$C48*Pecuária!$C$43/2*50%","v":0},{"$f":"ROUND((B55+C55+D55)*Pecuária!$C$44,0)","v":0},{"$f":"IF(OR(Pecuária!$C$87=\"bezerra\",Pecuária!$C$88=\"bezerra\"),ROUND((B55+C55+D55-E55)*100%,0),\"0\")","v":"0"},{"$f":"ROUND(B55+C55+D55-E55-F55,0)","v":0},{"$f":"ROUND(SUM(B55,C55)+D55/2-E55/2,0)","v":0},{"$f":"ROUND(H55*Pecuária!$C$79,0)","v":0},null,{"$f":"Pecuária!$E27","v":0},{"$f":"$J48*Pecuária!$C$43*50%+$K48*Pecuária!$C$43/2*50%","v":0},{"$f":"ROUND((J55+K55+L55)*Pecuária!$C$44,0)","v":0},{"$f":"IF(OR(Pecuária!$C$87=\"bezerra\",Pecuária!$C$88=\"bezerra\"),ROUND((J55+K55+L55-M55)*100%,0),\"0\")","v":"0"},{"$f":"ROUND(J55+K55+L55-M55-N55,0)","v":0},{"$f":"ROUND(SUM(J55,K55)+L55/2-M55/2,0)","v":0},{"$f":"ROUND(P55*Pecuária!$C$79,0)","v":0}]
["Total",{"$f":"SUM(B47:B55)","v":0},{"$f":"SUM(C47:C55)","v":0},{"$f":"SUM(D54:D55)","v":0},{"$f":"SUM(E47:E55)","v":0},0,0,0,0,0,{"$f":"SUM(K47:K55)","v":0},{"$f":"SUM(L47:L55)","v":0},0,0,0,0,0]
[]
["Categoria","Ano 9",null,null,null,null,null,null,null,"Ano 10"]
[null,"Qtd Inicial ","Aquis.","Nasc.","Perda","Venda","Qtd Final","Qtd Média",null,"Qtd Inicial ","Aquis.","Nasc.","Perda","Venda","Qtd Final","Qtd Média"]
[null,"(cab.)","(cab.)","(cab.)","(cab.)","(cab.)","(cab.)","(cab.)","(UA)","(cab.)","(cab.)","(cab.)","(cab.)","(cab.)","(cab.)","(cab.)","(UA)"]
["Reprodutores",{"$f":"O47","v":0},{"$f":"Pecuária!$E19","v":0},null,{"$f":"ROUND((B61+C61)*Pecuária!$C$47,0)","v":0},{"$f":"ROUND((B61+C61-E61)*Pecuária!$C$83,0)","v":0},{"$f":"ROUND(B61+C61-E61-F61,0)","v":0},{"$f":"ROUND(SUM(B61,C61)-SUM(E61,F61)/2,0)","v":0},{"$f":"ROUND(H61*Pecuária!$C$71,0)","v":0},{"$f":"G61","v":0},{"$f":"Pecuária!$E19","v":0},null,{"$f":"ROUND((J61+K61)*Pecuária!$C$47,0)","v":0},{"$f":"ROUND((J61+K61-M61)*Pecuária!$C$83,0)","v":0},{"$f":"ROUND(J61+K61-M61-N61,0)","v":0},{"$f":"ROUND(SUM(J61,K61)-SUM(M61,N61)/2,0)","v":0},{"$f":"ROUND(P61*Pecuária!$C$71,0)","v":0}]
["Matrizes",{"$f":"O48+O51","v":0},{"$f":"Pecuária!$E20","v":0},null,{"$f":"ROUND((B62+C62)*Pecuária!$C$47,0)","v":0},{"$f":"ROUND((B62+C62-E62)*Pecuária!$C$84,0)","v":0},0,{"$f":"ROUND(SUM(B62,C62)-SUM(E62,F62)/2,0)","v":0},{"$f":"ROUND(H62*Pecuária!$C$72,0)","v":0},{"$f":"G62+G65","v":0},{"$f":"Pecuária!$E20","v":0},null,{"$f":"ROUND((J62+K62)*Pecuária!$C$47,0)","v":0},{"$f":"ROUND((J62+K62-M62)*Pecuária!$C$84,0)","v":0},0,{"$f":"ROUND(SUM(J62,K62)-SUM(M62,N62)/2,0)","v":0},{"$f":"ROUND(P62*Pecuária!$C$72,0)","v":0}]
["Bois",{"$f":"O49+O50","v":0},{"$f":"Pecuária!$E21","v":0},null,{"$f":"ROUND((B63+C63)*Pecuária!$C$47,0)","v":0},{"$f":"IF(OR(Pecuária!$C$85=\"bois\",Pecuária!$C$86=\"bois\"),ROUND((B63+C63-E63)*100%,0),\"0\")","v":"0"},0,{"$f":"ROUND(SUM(B63,C63)-E63/2,0)","v":0},{"$f":"ROUND(H63*Pecuária!$C$73,0)","v":0},{"$f":"G63+G64","v":0},{"$f":"Pecuária!$E21","v":0},null,{"$f":"ROUND((J63+K63)*Pecuária!$C$47,0)","v":0},{"$f":"IF(OR(Pecuária!$C$85=\"bois\",Pecuária!$C$86=\"bois\"),ROUND((J63+K63-M63)*100%,0),\"0\")","v":"0"},0,{"$f":"ROUND(SUM(J63,K63)-M63/2,0)","v":0},{"$f":"ROUND(P63*Pecuária!$C$73,0)","v":0}]
["Novilhos",{"$f":"O52","v":0},{"$f":"Pecuária!$E22","v":0},null,{"$f":"ROUND((B64+C64)*Pecuária!$C$46,0)","v":0},{"$f":"IF(OR(Pecuária!$C$85=\"novilho\",Pecuária!$C$86=\"novilho\"),ROUND((B64+C64-E64)*100%,0),\"0\")","v":"0"},0,{"$f":"ROUND(SUM(B64,C64)-E64/2,0)","v":0},{"$f":"ROUND(H64*Pecuária!$C$74,0)","v":0},{"$f":"G66","v":0},{"$f":"Pecuária!$E22","v":0},null,{"$f":"ROUND((J64+K64)*Pecuária!$C$46,0)","v":0},{"$f":"IF(OR(Pecuária!$C$85=\"novilho\",Pecuária!$C$86=\"novilho\"),ROUND((J64+K64-M64)*100%,0),\"0\")","v":"0"},0,{"$f":"ROUND(SUM(J64,K64)-M64/2,0)","v":0},{"$f":"ROUND(P64*Pecuária!$C$74,0)","v":0}]
["Novilhas ",{"$f":"O53","v":0},{"$f":"Pecuária!$E23","v":0},null,{"$f":"ROUND((B65+C65)*Pecuária!$C$46,0)","v":0},{"$f":"IF(OR(Pecuária!$C$87=\"novilha\",Pecuária!$C$88=\"novilha\"),ROUND((B65+C65-E65)*100%,0),\"0\")","v":"0"},0,{"$f":"ROUND(SUM(B65,C65)-E65/2,0)","v":0},{"$f":"ROUND(H65*Pecuária!$C$75,0)","v":0},{"$f":"G67","v":0},{"$f":"Pecuária!$E23","v":0},null,{"$f":"ROUND((J65+K65)*Pecuária!$C$46,0)","v":0},{"$f":"IF(OR(Pecuária!$C$87=\"novilha\",Pecuária!$C$88=\"novilha\"),ROUND((J65+K65-M65)*100%,0),\"0\")","v":"0"},0,{"$f":"ROUND(SUM(J65,K65)-M65/2,0)","v":0},{"$f":"ROUND(P65*Pecuária!$C$75,0)","v":0}]
["Garrotes",{"$f":"O54","v":0},{"$f":"Pecuária!$E24","v":0},null,{"$f":"ROUND((B66+C66)*Pecuária!$C$45,0)","v":0},{"$f":"IF(OR(Pecuária!$C$85=\"garrote\",Pecuária!$C$86=\"garrote\"),ROUND((B66+C66-E66)*100%,0),\"0\")","v":"0"},0,{"$f":"ROUND(SUM(B66,C66)-E66/2,0)","v":0},{"$f":"ROUND(H66*Pecuária!$C$76,0)","v":0},{"$f":"G68","v":0},{"$f":"Pecuária!$E24","v":0},null,{"$f":"ROUND((J66+K66)*Pecuária!$C$45,0)","v":0},{"$f":"IF(OR(Pecuária!$C$85=\"garrote\",Pecuária!$C$86=\"garrote\"),ROUND((J66+K66-M66)*100%,0),\"0\")","v":"0"},0,{"$f":"ROUND(SUM(J66,K66)-M66/2,0)","v":0},{"$f":"ROUND(P66*Pecuária!$C$76,0)","v":0}]
["Garrotas ",{"$f":"O55","v":0},{"$f":"Pecuária!$E25","v":0},null,{"$f":"ROUND((B67+C67)*Pecuária!$C$45,0)","v":0},{"$f":"IF(OR(Pecuária!$C$87=\"garrota\",Pecuária!$C$88=\"garrota\"),ROUND((B67+C67-E67)*100%,0),\"0\")","v":"0"},0,{"$f":"ROUND(SUM(B67,C67)-E67/2,0)","v":0},{"$f":"ROUND(H67*Pecuária!$C$77,0)","v":0},{"$f":"G69","v":0},{"$f":"Pecuária!$E25","v":0},null,{"$f":"ROUND((J67+K67)*Pecuária!$C$45,0)","v":0},{"$f":"IF(OR(Pecuária!$C$87=\"garrota\",Pecuária!$C$88=\"garrota\"),ROUND((J67+K67-M67)*100%,0),\"0\")","v":"0"},0,{"$f":"ROUND(SUM(J67,K67)-M67/2,0)","v":0},{"$f":"ROUND(P67*Pecuária!$C$77,0)","v":0}]
["Bezerros ",null,{"$f":"Pecuária!$E26","v":0},{"$f":"$B62*Pecuária!$C$43*50%+$C62*Pecuária!$C$43/2*50%","v":0},{"$f":"ROUND((B68+C68+D68)*Pecuária!$C$44,0)","v":0},{"$f":"IF(OR(Pecuária!$C$85=\"bezerro\",Pecuária!$C$86=\"bezerro\"),ROUND((B68+C68+D68-E68)*100%,0),\"0\")","v":"0"},{"$f":"ROUND(B68+C68+D68-E68-F68,0)","v":0},{"$f":"ROUND(SUM(B68,C68)+D68/2-E68/2,0)","v":0},{"$f":"ROUND(H68*Pecuária!$C$78,0)","v":0},null,{"$f":"Pecuária!$E26","v":0},{"$f":"J62*Pecuária!$C$43*50%+K62*Pecuária!$C$43/2*50%","v":0},{"$f":"ROUND((J68+K68+L68)*Pecuária!$C$44,0)","v":0},{"$f":"IF(OR(Pecuária!$C$85=\"bezerro\",Pecuária!$C$86=\"bezerro\"),ROUND((J68+K68+L68-M68)*100%,0),\"0\")","v":"0"},{"$f":"ROUND(J68+K68+L68-M68-N68,0)","v":0},{"$f":"ROUND(SUM(J68,K68)+L68/2-M68/2,0)","v":0},{"$f":"ROUND(P68*Pecuária!$C$78,0)","v":0}]
["Bezerras ",null,{"$f":"Pecuária!$E27","v":0},{"$f":"$B62*Pecuária!$C$43*50%+$C62*Pecuária!$C$43/2*50%","v":0},{"$f":"ROUND((B69+C69+D69)*Pecuária!$C$44,0)","v":0},{"$f":"IF(OR(Pecuária!$C$87=\"bezerra\",Pecuária!$C$88=\"bezerra\"),ROUND((B69+C69+D69-E69)*100%,0),\"0\")","v":"0"},{"$f":"ROUND(B69+C69+D69-E69-F69,0)","v":0},{"$f":"ROUND(SUM(B69,C69)+D69/2-E69/2,0)","v":0},{"$f":"ROUND(H69*Pecuária!$C$79,0)","v":0},null,{"$f":"Pecuária!$E27","v":0},{"$f":"$J62*Pecuária!$C$43*50%+$K62*Pecuária!$C$43/2*50%","v":0},{"$f":"ROUND((J69+K69+L69)*Pecuária!$C$44,0)","v":0},{"$f":"IF(OR(Pecuária!$C$87=\"bezerra\",Pecuária!$C$88=\"bezerra\"),ROUND((J69+K69+L69-M69)*100%,0),\"0\")","v":"0"},{"$f":"ROUND(J69+K69+L69-M69-N69,0)","v":0},{"$f":"ROUND(SUM(J69,K69)+L69/2-M69/2,0)","v":0},{"$f":"ROUND(P69*Pecuária!$C$79,0)","v":0}]
["Total",{"$f":"SUM(B61:B69)","v":0},{"$f":"SUM(C61:C69)","v":0},0,0,0,0,0,0,0,0,0,0,0,0,0,0]
["Categoria","Ano 11",null,null,null,null,null,null,null,"Ano 12"]
[null,"Qtd Inicial ","Aquis.","Nasc.","Perda","Venda","Qtd Final","Qtd Média",null,"Qtd Inicial ","Aquis.","Nasc.","Perda","Venda","Qtd Final","Qtd Média"]
[null,"(cab.)","(cab.)","(cab.)","(cab.)","(cab.)","(cab.)","(cab.)","(UA)","(cab.)","(cab.)","(cab.)","(cab.)","(cab.)","(cab.)","(cab.)","(UA)"]
["Reprodutores",{"$f":"O61","v":0},{"$f":"Pecuária!$E19","v":0},null,{"$f":"ROUND((B74+C74)*Pecuária!$C$47,0)","v":0},{"$f":"ROUND((B74+C74-E74)*Pecuária!$C$83,0)","v":0},{"$f":"ROUND(B74+C74-E74-F74,0)","v":0},{"$f":"ROUND(SUM(B74,C74)-SUM(E74,F74)/2,0)","v":0},{"$f":"ROUND(H74*Pecuária!$C$71,0)","v":0},{"$f":"G74","v":0},{"$f":"Pecuária!$E19","v":0},null,{"$f":"ROUND((J74+K74)*Pecuária!$C$47,0)","v":0},{"$f":"ROUND((J74+K74-M74)*Pecuária!$C$83,0)","v":0},{"$f":"ROUND(J74+K74-M74-N74,0)","v":0},{"$f":"ROUND(SUM(J74,K74)-SUM(M74,N74)/2,0)","v":0},{"$f":"ROUND(P74*Pecuária!$C$71,0)","v":0}]
["Matrizes",{"$f":"O62+O65","v":0},{"$f":"Pecuária!$E20","v":0},null,{"$f":"ROUND((B75+C75)*Pecuária!$C$47,0)","v":0},{"$f":"ROUND((B75+C75-E75)*Pecuária!$C$84,0)","v":0},0,{"$f":"ROUND(SUM(B75,C75)-SUM(E75,F75)/2,0)","v":0},{"$f":"ROUND(H75*Pecuária!$C$72,0)","v":0},{"$f":"G75+G78","v":0},{"$f":"Pecuária!$E20","v":0},null,{"$f":"ROUND((J75+K75)*Pecuária!$C$47,0)","v":0},{"$f":"ROUND((J75+K75-M75)*Pecuária!$C$84,0)","v":0},0,{"$f":"ROUND(SUM(J75,K75)-SUM(M75,N75)/2,0)","v":0},{"$f":"ROUND(P75*Pecuária!$C$72,0)","v":0}]
["Bois",{"$f":"O63+O64","v":0},{"$f":"Pecuária!$E21","v":0},null,{"$f":"ROUND((B76+C76)*Pecuária!$C$47,0)","v":0},{"$f":"IF(OR(Pecuária!$C$85=\"bois\",Pecuária!$C$86=\"bois\"),ROUND((B76+C76-E76)*100%,0),\"0\")","v":"0"},0,{"$f":"ROUND(SUM(B76,C76)-E76/2,0)","v":0},{"$f":"ROUND(H76*Pecuária!$C$73,0)","v":0},{"$f":"G76+G77","v":0},{"$f":"Pecuária!$E21","v":0},null,{"$f":"ROUND((J76+K76)*Pecuária!$C$47,0)","v":0},{"$f":"IF(OR(Pecuária!$C$85=\"bois\",Pecuária!$C$86=\"bois\"),ROUND((J76+K76-M76)*100%,0),\"0\")","v":"0"},0,{"$f":"ROUND(SUM(J76,K76)-M76/2,0)","v":0},{"$f":"ROUND(P76*Pecuária!$C$73,0)","v":0}]
["Novilhos",{"$f":"O66","v":0},{"$f":"Pecuária!$E22","v":0},null,{"$f":"ROUND((B77+C77)*Pecuária!$C$46,0)","v":0},{"$f":"IF(OR(Pecuária!$C$85=\"novilho\",Pecuária!$C$86=\"novilho\"),ROUND((B77+C77-E77)*100%,0),\"0\")","v":"0"},0,{"$f":"ROUND(SUM(B77,C77)-E77/2,0)","v":0},{"$f":"ROUND(H77*Pecuária!$C$74,0)","v":0},{"$f":"G79","v":0},{"$f":"Pecuária!$E22","v":0},null,{"$f":"ROUND((J77+K77)*Pecuária!$C$46,0)","v":0},{"$f":"IF(OR(Pecuária!$C$85=\"novilho\",Pecuária!$C$86=\"novilho\"),ROUND((J77+K77-M77)*100%,0),\"0\")","v":"0"},0,{"$f":"ROUND(SUM(J77,K77)-M77/2,0)","v":0},{"$f":"ROUND(P77*Pecuária!$C$74,0)","v":0}]
["Novilhas ",{"$f":"O67","v":0},{"$f":"Pecuária!$E23","v":0},null,{"$f":"ROUND((B78+C78)*Pecuária!$C$46,0)","v":0},{"$f":"IF(OR(Pecuária!$C$87=\"novilha\",Pecuária!$C$88=\"novilha\"),ROUND((B78+C78-E78)*100%,0),\"0\")","v":"0"},0,{"$f":"ROUND(SUM(B78,C78)-E78/2,0)","v":0},{"$f":"ROUND(H78*Pecuária!$C$75,0)","v":0},{"$f":"G80","v":0},{"$f":"Pecuária!$E23","v":0},null,{"$f":"ROUND((J78+K78)*Pecuária!$C$46,0)","v":0},{"$f":"IF(OR(Pecuária!$C$87=\"novilha\",Pecuária!$C$88=\"novilha\"),ROUND((J78+K78-M78)*100%,0),\"0\")","v":"0"},0,{"$f":"ROUND(SUM(J78,K78)-M78/2,0)","v":0},{"$f":"ROUND(P78*Pecuária!$C$75,0)","v":0}]
["Garrotes",{"$f":"O68","v":0},{"$f":"Pecuária!$E24","v":0},null,{"$f":"ROUND((B79+C79)*Pecuária!$C$45,0)","v":0},{"$f":"IF(OR(Pecuária!$C$85=\"garrote\",Pecuária!$C$86=\"garrote\"),ROUND((B79+C79-E79)*100%,0),\"0\")","v":"0"},0,{"$f":"ROUND(SUM(B79,C79)-E79/2,0)","v":0},{"$f":"ROUND(H79*Pecuária!$C$76,0)","v":0},{"$f":"G81","v":0},{"$f":"Pecuária!$E24","v":0},null,{"$f":"ROUND((J79+K79)*Pecuária!$C$45,0)","v":0},{"$f":"IF(OR(Pecuária!$C$85=\"garrote\",Pecuária!$C$86=\"garrote\"),ROUND((J79+K79-M79)*100%,0),\"0\")","v":"0"},0,{"$f":"ROUND(SUM(J79,K79)-M79/2,0)","v":0},{"$f":"ROUND(P79*Pecuária!$C$76,0)","v":0}]
["Garrotas ",{"$f":"O69","v":0},{"$f":"Pecuária!$E25","v":0},null,{"$f":"ROUND((B80+C80)*Pecuária!$C$45,0)","v":0},{"$f":"IF(OR(Pecuária!$C$87=\"garrota\",Pecuária!$C$88=\"garrota\"),ROUND((B80+C80-E80)*100%,0),\"0\")","v":"0"},0,{"$f":"ROUND(SUM(B80,C80)-E80/2,0)","v":0},{"$f":"ROUND(H80*Pecuária!$C$77,0)","v":0},{"$f":"G82","v":0},{"$f":"Pecuária!$E25","v":0},null,{"$f":"ROUND((J80+K80)*Pecuária!$C$45,0)","v":0},{"$f":"IF(OR(Pecuária!$C$87=\"garrota\",Pecuária!$C$88=\"garrota\"),ROUND((J80+K80-M80)*100%,0),\"0\")","v":"0"},0,{"$f":"ROUND(SUM(J80,K80)-M80/2,0)","v":0},{"$f":"ROUND(P80*Pecuária!$C$77,0)","v":0}]
["Bezerros ",null,{"$f":"Pecuária!$E26","v":0},{"$f":"$B75*Pecuária!$C$43*50%+$C75*Pecuária!$C$43/2*50%","v":0},{"$f":"ROUND((B81+C81+D81)*Pecuária!$C$44,0)","v":0},{"$f":"IF(OR(Pecuária!$C$85=\"bezerro\",Pecuária!$C$86=\"bezerro\"),ROUND((B81+C81+D81-E81)*100%,0),\"0\")","v":"0"},{"$f":"ROUND(B81+C81+D81-E81-F81,0)","v":0},{"$f":"ROUND(SUM(B81,C81)+D81/2-E81/2,0)","v":0},{"$f":"ROUND(H81*Pecuária!$C$78,0)","v":0},null,{"$f":"Pecuária!$E26","v":0},{"$f":"J75*Pecuária!$C$43*50%+K75*Pecuária!$C$43/2*50%","v":0},{"$f":"ROUND((J81+K81+L81)*Pecuária!$C$44,0)","v":0},{"$f":"IF(OR(Pecuária!$C$85=\"bezerro\",Pecuária!$C$86=\"bezerro\"),ROUND((J81+K81+L81-M81)*100%,0),\"0\")","v":"0"},{"$f":"ROUND(J81+K81+L81-M81-N81,0)","v":0},{"$f":"ROUND(SUM(J81,K81)+L81/2-M81/2,0)","v":0},{"$f":"ROUND(P81*Pecuária!$C$78,0)","v":0}]
["Bezerras ",null,{"$f":"Pecuária!$E27","v":0},{"$f":"$B75*Pecuária!$C$43*50%+$C75*Pecuária!$C$43/2*50%","v":0},{"$f":"ROUND((B82+C82+D82)*Pecuária!$C$44,0)","v":0},{"$f":"IF(OR(Pecuária!$C$87=\"bezerra\",Pecuária!$C$88=\"bezerra\"),ROUND((B82+C82+D82-E82)*100%,0),\"0\")","v":"0"},{"$f":"ROUND(B82+C82+D82-E82-F82,0)","v":0},{"$f":"ROUND(SUM(B82,C82)+D82/2-E82/2,0)","v":0},{"$f":"ROUND(H82*Pecuária!$C$79,0)","v":0},null,{"$f":"Pecuária!$E27","v":0},{"$f":"$J75*Pecuária!$C$43*50%+$K75*Pecuária!$C$43/2*50%","v":0},{"$f":"ROUND((J82+K82+L82)*Pecuária!$C$44,0)","v":0},{"$f":"IF(OR(Pecuária!$C$87=\"bezerra\",Pecuária!$C$88=\"bezerra\"),ROUND((J82+K82+L82-M82)*100%,0),\"0\")","v":"0"},{"$f":"ROUND(J82+K82+L82-M82-N82,0)","v":0},{"$f":"ROUND(SUM(J82,K82)+L82/2-M82/2,0)","v":0},{"$f":"ROUND(P82*Pecuária!$C$79,0)","v":0}]
["Total",{"$f":"SUM(B74:B82)","v":0},{"$f":"SUM(C74:C82)","v":0},{"$f":"SUM(D81:D82)","v":0},{"$f":"SUM(E74:E82)","v":0},0,0,0,0,0,0,0,0,0,0,0,0]
[]
["Evolução do Rebanho - B"]
["Categoria","Ano 1",null,null,null,null,null,null,null,"Ano 2"]
[null,"Qtd Inicial ","Aquis.","Nasc.","Perda","Venda","Qtd Final","Qtd Média",null,"Qtd Inicial ","Aquis.","Nasc.","Perda","Venda","Qtd Final","Qtd Média"]
[null,"(cab.)","(cab.)","(cab.)","(cab.)","(cab.)","(cab.)","(cab.)","(UA)","(cab.)","(cab.)","(cab.)","(cab.)","(cab.)","(cab.)","(cab.)","(UA)"]
["Reprodutores",{"$f":"Pecuária!D5","v":0},{"$f":"Pecuária!E5+Pecuária!C30","v":0},null,{"$f":"ROUND((B89+C89)*Pecuária!$E$47,0)","v":0},{"$f":"ROUND((B89+C89-E89)*Pecuária!$D$83,0)","v":0},{"$f":"ROUND(B89+C89-E89-F89,0)","v":0},{"$f":"ROUND(SUM(B89,C89)-SUM(E89,F89)/2,0)","v":0},{"$f":"ROUND(H89*Pecuária!$C$71,0)","v":0},{"$f":"G89","v":0},{"$f":"Pecuária!D30","v":0},null,{"$f":"ROUND((J89+K89)*Pecuária!$E$47,0)","v":0},{"$f":"ROUND((J89+K89-M89)*Pecuária!$D$83,0)","v":0},{"$f":"ROUND(J89+K89-M89-N89,0)","v":0},{"$f":"ROUND(SUM(J89,K89)-SUM(M89,N89)/2,0)","v":0},{"$f":"ROUND(P89*Pecuária!$C$71,0)","v":0}]
["Matrizes",{"$f":"Pecuária!D6","v":0},{"$f":"Pecuária!E6+Pecuária!C31","v":0},null,{"$f":"ROUND((B90+C90)*Pecuária!$E$47,0)","v":0},{"$f":"ROUND((B90+C90-E90)*Pecuária!$D$84,0)","v":0},0,{"$f":"ROUND(SUM(B90,C90)-SUM(E90,F90)/2,0)","v":0},{"$f":"ROUND(H90*Pecuária!$C$72,0)","v":0},{"$f":"G90+G93","v":0},{"$f":"Pecuária!D31","v":0},null,{"$f":"ROUND((J90+K90)*Pecuária!$E$47,0)","v":0},{"$f":"ROUND((J90+K90-M90)*Pecuária!$D$84,0)","v":0},0,{"$f":"ROUND(SUM(J90,K90)-SUM(M90,N90)/2,0)","v":0},{"$f":"ROUND(P90*Pecuária!$C$72,0)","v":0}]
["Bois",{"$f":"Pecuária!D7","v":0},{"$f":"Pecuária!E7+Pecuária!C32","v":0},null,{"$f":"ROUND((B91+C91)*Pecuária!$E$47,0)","v":0},{"$f":"IF(OR(Pecuária!$D$85=\"bois\",Pecuária!$D$86=\"bois\"),ROUND((B91+C91-E91)*100%,0),\"0\")","v":"0"},0,{"$f":"ROUND(SUM(B91,C91)-E91/2,0)","v":0},{"$f":"ROUND(H91*Pecuária!$C$73,0)","v":0},{"$f":"G91+G92","v":0},{"$f":"Pecuária!D32","v":0},null,{"$f":"ROUND((J91+K91)*Pecuária!$E$47,0)","v":0},{"$f":"IF(OR(Pecuária!$D$85=\"bois\",Pecuária!$D$86=\"bois\"),ROUND((J91+K91-M91)*100%,0),\"0\")","v":"0"},0,{"$f":"ROUND(SUM(J91,K91)-M91/2,0)","v":0},{"$f":"ROUND(P91*Pecuária!$C$73,0)","v":0}]
["Novilhos",{"$f":"Pecuária!D8","v":0},{"$f":"Pecuária!E8+Pecuária!C33","v":0},null,{"$f":"ROUND((B92+C92)*Pecuária!$E$46,0)","v":0},{"$f":"IF(OR(Pecuária!$D$85=\"novilho\",Pecuária!$D$86=\"novilho\"),ROUND((B92+C92-E92)*100%,0),\"0\")","v":"0"},0,{"$f":"ROUND(SUM(B92,C92)-E92/2,0)","v":0},{"$f":"ROUND(H92*Pecuária!$C$74,0)","v":0},{"$f":"G94","v":0},{"$f":"Pecuária!D33","v":0},null,{"$f":"ROUND((J92+K92)*Pecuária!$E$46,0)","v":0},{"$f":"IF(OR(Pecuária!$D$85=\"novilho\",Pecuária!$D$86=\"novilho\"),ROUND((J92+K92-M92)*100%,0),\"0\")","v":"0"},0,{"$f":"ROUND(SUM(J92,K92)-M92/2,0)","v":0},{"$f":"ROUND(P92*Pecuária!$C$74,0)","v":0}]
["Novilhas ",{"$f":"Pecuária!D9","v":0},{"$f":"Pecuária!E9+Pecuária!C34","v":0},null,{"$f":"ROUND((B93+C93)*Pecuária!$E$46,0)","v":0},{"$f":"IF(OR(Pecuária!$D$87=\"novilha\",Pecuária!$D$88=\"novilha\"),ROUND((B93+C93-E93)*100%,0),\"0\")","v":"0"},0,{"$f":"ROUND(SUM(B93,C93)-E93/2,0)","v":0},{"$f":"ROUND(H93*Pecuária!$C$75,0)","v":0},{"$f":"G95","v":0},{"$f":"Pecuária!D34","v":0},null,{"$f":"ROUND((J93+K93)*Pecuária!$E$46,0)","v":0},{"$f":"IF(OR(Pecuária!$D$87=\"novilha\",Pecuária!$D$88=\"novilha\"),ROUND((J93+K93-M93)*100%,0),\"0\")","v":"0"},0,{"$f":"ROUND(SUM(J93,K93)-M93/2,0)","v":0},{"$f":"ROUND(P93*Pecuária!$C$75,0)","v":0}]
["Garrotes",{"$f":"Pecuária!D10","v":0},{"$f":"Pecuária!E10+Pecuária!C35","v":0},null,{"$f":"ROUND((B94+C94)*Pecuária!$E$45,0)","v":0},{"$f":"IF(OR(Pecuária!$D$85=\"garrote\",Pecuária!$D$86=\"garrote\"),ROUND((B94+C94-E94)*100%,0),\"0\")","v":"0"},0,{"$f":"ROUND(SUM(B94,C94)-E94/2,0)","v":0},{"$f":"ROUND(H94*Pecuária!$C$76,0)","v":0},{"$f":"G96","v":0},{"$f":"Pecuária!D35","v":0},null,{"$f":"ROUND((J94+K94)*Pecuária!$E$45,0)","v":0},{"$f":"IF(OR(Pecuária!$D$85=\"garrote\",Pecuária!$D$86=\"garrote\"),ROUND((J94+K94-M94)*100%,0),\"0\")","v":"0"},0,{"$f":"ROUND(SUM(J94,K94)-M94/2,0)","v":0},{"$f":"ROUND(P94*Pecuária!$C$76,0)","v":0}]
["Garrotas ",{"$f":"Pecuária!D11","v":0},{"$f":"Pecuária!E11+Pecuária!C36","v":0},null,{"$f":"ROUND((B95+C95)*Pecuária!$E$45,0)","v":0},{"$f":"IF(OR(Pecuária!$D$87=\"garrota\",Pecuária!$D$88=\"garrota\"),ROUND((B95+C95-E95)*100%,0),\"0\")","v":"0"},0,{"$f":"ROUND(SUM(B95,C95)-E95/2,0)","v":0},{"$f":"ROUND(H95*Pecuária!$C$77,0)","v":0},{"$f":"G97","v":0},{"$f":"Pecuária!D36","v":0},null,{"$f":"ROUND((J95+K95)*Pecuária!$E$45,0)","v":0},{"$f":"IF(OR(Pecuária!$D$87=\"garrota\",Pecuária!$D$88=\"garrota\"),ROUND((J95+K95-M95)*100%,0),\"0\")","v":"0"},0,{"$f":"ROUND(SUM(J95,K95)-M95/2,0)","v":0},{"$f":"ROUND(P95*Pecuária!$C$77,0)","v":0}]
["Bezerros ",{"$f":"Pecuária!D12","v":0},{"$f":"Pecuária!E12+Pecuária!C37","v":0},{"$f":"B90*Pecuária!$E$43*50%+C90*Pecuária!$E$43/2*50%","v":0},{"$f":"ROUND((B96+C96+D96)*Pecuária!$E$44,0)","v":0},{"$f":"IF(OR(Pecuária!$D$85=\"bezerro\",Pecuária!$D$86=\"bezerro\"),ROUND((B96+C96+D96-E96)*100%,0),\"0\")","v":"0"},{"$f":"ROUND(B96+C96+D96-E96-F96,0)","v":0},{"$f":"ROUND(SUM(B96,C96)+D96/2-E96/2,0)","v":0},{"$f":"ROUND(H96*Pecuária!$C$78,0)","v":0},null,{"$f":"Pecuária!D37","v":0},{"$f":"J90*Pecuária!$E$43*50%+K90*Pecuária!$E$43/2*50%","v":0},{"$f":"ROUND((J96+K96+L96)*Pecuária!$E$44,0)","v":0},{"$f":"IF(OR(Pecuária!$D$85=\"bezerro\",Pecuária!$D$86=\"bezerro\"),ROUND((J96+K96+L96-M96)*100%,0),\"0\")","v":"0"},{"$f":"ROUND(J96+K96+L96-M96-N96,0)","v":0},{"$f":"ROUND(SUM(J96,K96)+L96/2-M96/2,0)","v":0},{"$f":"ROUND(P96*Pecuária!$C$78,0)","v":0}]
["Bezerras ",{"$f":"Pecuária!D13","v":0},{"$f":"Pecuária!E13+Pecuária!C38","v":0},{"$f":"B90*Pecuária!$E$43*50%+C90*Pecuária!$E$43/2*50%","v":0},{"$f":"ROUND((B97+C97+D97)*Pecuária!$E$44,0)","v":0},{"$f":"IF(OR(Pecuária!$D$87=\"bezerra\",Pecuária!$D$88=\"bezerra\"),ROUND((B97+C97+D97-E97)*100%,0),\"0\")","v":"0"},{"$f":"ROUND(B97+C97+D97-E97-F97,0)","v":0},{"$f":"ROUND(SUM(B97,C97)+D97/2-E97/2,0)","v":0},{"$f":"ROUND(H97*Pecuária!$C$79,0)","v":0},null,{"$f":"Pecuária!D38","v":0},{"$f":"J90*Pecuária!$E$43*50%+K90*Pecuária!$E$43/2*50%","v":0},{"$f":"ROUND((J97+K97+L97)*Pecuária!$E$44,0)","v":0},{"$f":"IF(OR(Pecuária!$D$87=\"bezerra\",Pecuária!$D$88=\"bezerra\"),ROUND((J97+K97+L97-M97)*100%,0),\"0\")","v":"0"},{"$f":"ROUND(J97+K97+L97-M97-N97,0)","v":0},{"$f":"ROUND(SUM(J97,K97)+L97/2-M97/2,0)","v":0},{"$f":"ROUND(P97*Pecuária!$C$79,0)","v":0}]
["Total",{"$f":"SUM(B89:B97)","v":0},{"$f":"SUM(C89:C97)","v":0},{"$f":"SUM(D96:D97)","v":0},{"$f":"SUM(E89:E97)","v":0},0,0,0,0,0,0,0,0,0,0,0,0]
[]
["Categoria","Ano 3",null,null,null,null,null,null,null,"Ano 4"]
[null,"Qtd Inicial ","Aquis.","Nasc.","Perda","Venda","Qtd Final","Qtd Média",null,"Qtd Inicial ","Aquis.","Nasc.","Perda","Venda","Qtd Final","Qtd Média"]
[null,"(cab.)","(cab.)","(cab.)","(cab.)","(cab.)","(cab.)","(cab.)","(UA)","(cab.)","(cab.)","(cab.)","(cab.)","(cab.)","(cab.)","(cab.)","(UA)"]
["Reprodutores",{"$f":"O89","v":0},{"$f":"Pecuária!$E$30","v":0},null,{"$f":"ROUND((B103+C103)*Pecuária!$E$47,0)","v":0},{"$f":"ROUND((B103+C103-E103)*Pecuária!$D$83,0)","v":0},{"$f":"ROUND(B103+C103-E103-F103,0)","v":0},{"$f":"ROUND(SUM(B103,C103)-SUM(E103,F103)/2,0)","v":0},{"$f":"ROUND(H103*Pecuária!$C$71,0)","v":0},{"$f":"G103","v":0},{"$f":"Pecuária!$E$30","v":0},null,{"$f":"ROUND((J103+K103)*Pecuária!$E$47,0)","v":0},{"$f":"ROUND((J103+K103-M103)*Pecuária!$D$83,0)","v":0},{"$f":"ROUND(J103+K103-M103-N103,0)","v":0},{"$f":"ROUND(SUM(J103,K103)-SUM(M103,N103)/2,0)","v":0},{"$f":"ROUND(P103*Pecuária!$C$71,0)","v":0}]
["Matrizes",{"$f":"O90+O93","v":0},{"$f":"Pecuária!$E$31","v":0},null,{"$f":"ROUND((B104+C104)*Pecuária!$E$47,0)","v":0},{"$f":"ROUND((B104+C104-E104)*Pecuária!$D$84,0)","v":0},0,{"$f":"ROUND(SUM(B104,C104)-SUM(E104,F104)/2,0)","v":0},{"$f":"ROUND(H104*Pecuária!$C$72,0)","v":0},{"$f":"G104+G107","v":0},{"$f":"Pecuária!$E$31","v":0},null,{"$f":"ROUND((J104+K104)*Pecuária!$E$47,0)","v":0},{"$f":"ROUND((J104+K104-M104)*Pecuária!$D$84,0)","v":0},0,{"$f":"ROUND(SUM(J104,K104)-SUM(M104,N104)/2,0)","v":0},{"$f":"ROUND(P104*Pecuária!$C$72,0)","v":0}]
["Bois",{"$f":"O91+O92","v":0},{"$f":"Pecuária!$E$32","v":0},null,{"$f":"ROUND((B105+C105)*Pecuária!$E$47,0)","v":0},{"$f":"IF(OR(Pecuária!$D$85=\"bois\",Pecuária!$D$86=\"bois\"),ROUND((B105+C105-E105)*100%,0),\"0\")","v":"0"},0,{"$f":"ROUND(SUM(B105,C105)-E105/2,0)","v":0},{"$f":"ROUND(H105*Pecuária!$C$73,0)","v":0},{"$f":"G105+G106","v":0},{"$f":"Pecuária!$E$32","v":0},null,{"$f":"ROUND((J105+K105)*Pecuária!$E$47,0)","v":0},{"$f":"IF(OR(Pecuária!$D$85=\"bois\",Pecuária!$D$86=\"bois\"),ROUND((J105+K105-M105)*100%,0),\"0\")","v":"0"},0,{"$f":"ROUND(SUM(J105,K105)-M105/2,0)","v":0},{"$f":"ROUND(P105*Pecuária!$C$73,0)","v":0}]
["Novilhos",{"$f":"O94","v":0},{"$f":"Pecuária!$E$33","v":0},null,{"$f":"ROUND((B106+C106)*Pecuária!$E$46,0)","v":0},{"$f":"IF(OR(Pecuária!$D$85=\"novilho\",Pecuária!$D$86=\"novilho\"),ROUND((B106+C106-E106)*100%,0),\"0\")","v":"0"},0,{"$f":"ROUND(SUM(B106,C106)-E106/2,0)","v":0},{"$f":"ROUND(H106*Pecuária!$C$74,0)","v":0},{"$f":"G108","v":0},{"$f":"Pecuária!$E$33","v":0},null,{"$f":"ROUND((J106+K106)*Pecuária!$E$46,0)","v":0},{"$f":"IF(OR(Pecuária!$D$85=\"novilho\",Pecuária!$D$86=\"novilho\"),ROUND((J106+K106-M106)*100%,0),\"0\")","v":"0"},0,{"$f":"ROUND(SUM(J106,K106)-M106/2,0)","v":0},{"$f":"ROUND(P106*Pecuária!$C$74,0)","v":0}]
["Novilhas ",{"$f":"O95","v":0},{"$f":"Pecuária!$E$34","v":0},null,{"$f":"ROUND((B107+C107)*Pecuária!$E$46,0)","v":0},{"$f":"IF(OR(Pecuária!$D$87=\"novilha\",Pecuária!$D$88=\"novilha\"),ROUND((B107+C107-E107)*100%,0),\"0\")","v":"0"},0,{"$f":"ROUND(SUM(B107,C107)-E107/2,0)","v":0},{"$f":"ROUND(H107*Pecuária!$C$75,0)","v":0},{"$f":"G109","v":0},{"$f":"Pecuária!$E$34","v":0},null,{"$f":"ROUND((J107+K107)*Pecuária!$E$46,0)","v":0},{"$f":"IF(OR(Pecuária!$D$87=\"novilha\",Pecuária!$D$88=\"novilha\"),ROUND((J107+K107-M107)*100%,0),\"0\")","v":"0"},0,{"$f":"ROUND(SUM(J107,K107)-M107/2,0)","v":0},{"$f":"ROUND(P107*Pecuária!$C$75,0)","v":0}]
["Garrotes",{"$f":"O96","v":0},{"$f":"Pecuária!$E$35","v":0},null,{"$f":"ROUND((B108+C108)*Pecuária!$E$45,0)","v":0},{"$f":"IF(OR(Pecuária!$D$85=\"garrote\",Pecuária!$D$86=\"garrote\"),ROUND((B108+C108-E108)*100%,0),\"0\")","v":"0"},0,{"$f":"ROUND(SUM(B108,C108)-E108/2,0)","v":0},{"$f":"ROUND(H108*Pecuária!$C$76,0)","v":0},{"$f":"G110","v":0},{"$f":"Pecuária!$E$35","v":0},null,{"$f":"ROUND((J108+K108)*Pecuária!$E$45,0)","v":0},{"$f":"IF(OR(Pecuária!$D$85=\"garrote\",Pecuária!$D$86=\"garrote\"),ROUND((J108+K108-M108)*100%,0),\"0\")","v":"0"},0,{"$f":"ROUND(SUM(J108,K108)-M108/2,0)","v":0},{"$f":"ROUND(P108*Pecuária!$C$76,0)","v":0}]
["Garrotas ",{"$f":"O97","v":0},{"$f":"Pecuária!$E$36","v":0},null,{"$f":"ROUND((B109+C109)*Pecuária!$E$45,0)","v":0},{"$f":"IF(OR(Pecuária!$D$87=\"garrota\",Pecuária!$D$88=\"garrota\"),ROUND((B109+C109-E109)*100%,0),\"0\")","v":"0"},0,{"$f":"ROUND(SUM(B109,C109)-E109/2,0)","v":0},{"$f":"ROUND(H109*Pecuária!$C$77,0)","v":0},{"$f":"G111","v":0},{"$f":"Pecuária!$E$36","v":0},null,{"$f":"ROUND((J109+K109)*Pecuária!$E$45,0)","v":0},{"$f":"IF(OR(Pecuária!$D$87=\"garrota\",Pecuária!$D$88=\"garrota\"),ROUND((J109+K109-M109)*100%,0),\"0\")","v":"0"},0,{"$f":"ROUND(SUM(J109,K109)-M109/2,0)","v":0},{"$f":"ROUND(P109*Pecuária!$C$77,0)","v":0}]
["Bezerros ",null,{"$f":"Pecuária!$E$37","v":0},{"$f":"B104*Pecuária!$E$43*50%+C104*Pecuária!$E$43/2*50%","v":0},{"$f":"ROUND((B110+C110+D110)*Pecuária!$E$44,0)","v":0},{"$f":"IF(OR(Pecuária!$D$85=\"bezerro\",Pecuária!$D$86=\"bezerro\"),ROUND((B110+C110+D110-E110)*100%,0),\"0\")","v":"0"},{"$f":"ROUND(B110+C110+D110-E110-F110,0)","v":0},{"$f":"ROUND(SUM(B110,C110)+D110/2-E110/2,0)","v":0},{"$f":"ROUND(H110*Pecuária!$C$78,0)","v":0},null,{"$f":"Pecuária!$E$37","v":0},{"$f":"J104*Pecuária!$E$43*50%+K104*Pecuária!$E$43/2*50%","v":0},{"$f":"ROUND((J110+K110+L110)*Pecuária!$E$44,0)","v":0},{"$f":"IF(OR(Pecuária!$D$85=\"bezerro\",Pecuária!$D$86=\"bezerro\"),ROUND((J110+K110+L110-M110)*100%,0),\"0\")","v":"0"},{"$f":"ROUND(J110+K110+L110-M110-N110,0)","v":0},{"$f":"ROUND(SUM(J110,K110)+L110/2-M110/2,0)","v":0},{"$f":"ROUND(P110*Pecuária!$C$78,0)","v":0}]
["Bezerras ",null,{"$f":"Pecuária!$E$38","v":0},{"$f":"B104*Pecuária!$E$43*50%+C104*Pecuária!$E$43/2*50%","v":0},{"$f":"ROUND((B111+C111+D111)*Pecuária!$E$44,0)","v":0},{"$f":"IF(OR(Pecuária!$D$87=\"bezerra\",Pecuária!$D$88=\"bezerra\"),ROUND((B111+C111+D111-E111)*100%,0),\"0\")","v":"0"},{"$f":"ROUND(B111+C111+D111-E111-F111,0)","v":0},{"$f":"ROUND(SUM(B111,C111)+D111/2-E111/2,0)","v":0},{"$f":"ROUND(H111*Pecuária!$C$79,0)","v":0},null,{"$f":"Pecuária!$E$38","v":0},{"$f":"J104*Pecuária!$E$43*50%+K104*Pecuária!$E$43/2*50%","v":0},{"$f":"ROUND((J111+K111+L111)*Pecuária!$E$44,0)","v":0},{"$f":"IF(OR(Pecuária!$D$87=\"bezerra\",Pecuária!$D$88=\"bezerra\"),ROUND((J111+K111+L111-M111)*100%,0),\"0\")","v":"0"},{"$f":"ROUND(J111+K111+L111-M111-N111,0)","v":0},{"$f":"ROUND(SUM(J111,K111)+L111/2-M111/2,0)","v":0},{"$f":"ROUND(P111*Pecuária!$C$79,0)","v":0}]
["Total",{"$f":"SUM(B103:B111)","v":0},0,0,0,0,0,0,0,0,0,0,0,0,0,0,0]
[]
["Categoria","Ano 5",null,null,null,null,null,null,null,"Ano 6"]
[null,"Qtd Inicial ","Aquis.","Nasc.","Perda","Venda","Qtd Final","Qtd Média",null,"Qtd Inicial ","Aquis.","Nasc.","Perda","Venda","Qtd Final","Qtd Média"]
[null,"(cab.)","(cab.)","(cab.)","(cab.)","(cab.)","(cab.)","(cab.)","(UA)","(cab.)","(cab.)","(cab.)","(cab.)","(cab.)","(cab.)","(cab.)","(UA)"]
["Reprodutores",{"$f":"O103","v":0},{"$f":"Pecuária!$E$30","v":0},null,{"$f":"ROUND((B117+C117)*Pecuária!$E$47,0)","v":0},{"$f":"ROUND((B117+C117-E117)*Pecuária!$D$83,0)","v":0},{"$f":"ROUND(B117+C117-E117-F117,0)","v":0},{"$f":"ROUND(SUM(B117,C117)-SUM(E117,F117)/2,0)","v":0},{"$f":"ROUND(H117*Pecuária!$C$71,0)","v":0},{"$f":"G117","v":0},{"$f":"Pecuária!$E$30","v":0},null,{"$f":"ROUND((J117+K117)*Pecuária!$E$47,0)","v":0},{"$f":"ROUND((J117+K117-M117)*Pecuária!$D$83,0)","v":0},{"$f":"ROUND(J117+K117-M117-N117,0)","v":0},{"$f":"ROUND(SUM(J117,K117)-SUM(M117,N117)/2,0)","v":0},{"$f":"ROUND(P117*Pecuária!$C$71,0)","v":0}]
["Matrizes",{"$f":"O104+O107","v":0},{"$f":"Pecuária!$E$31","v":0},null,{"$f":"ROUND((B118+C118)*Pecuária!$E$47,0)","v":0},{"$f":"ROUND((B118+C118-E118)*Pecuária!$D$84,0)","v":0},0,{"$f":"ROUND(SUM(B118,C118)-SUM(E118,F118)/2,0)","v":0},{"$f":"ROUND(H118*Pecuária!$C$72,0)","v":0},{"$f":"G118+G121","v":0},{"$f":"Pecuária!$E$31","v":0},null,{"$f":"ROUND((J118+K118)*Pecuária!$E$47,0)","v":0},{"$f":"ROUND((J118+K118-M118)*Pecuária!$D$84,0)","v":0},0,{"$f":"ROUND(SUM(J118,K118)-SUM(M118,N118)/2,0)","v":0},{"$f":"ROUND(P118*Pecuária!$C$72,0)","v":0}]
["Bois",{"$f":"O105+O106","v":0},{"$f":"Pecuária!$E$32","v":0},null,{"$f":"ROUND((B119+C119)*Pecuária!$E$47,0)","v":0},{"$f":"IF(OR(Pecuária!$D$85=\"bois\",Pecuária!$D$86=\"bois\"),ROUND((B119+C119-E119)*100%,0),\"0\")","v":"0"},0,{"$f":"ROUND(SUM(B119,C119)-E119/2,0)","v":0},{"$f":"ROUND(H119*Pecuária!$C$73,0)","v":0},{"$f":"G119+G120","v":0},{"$f":"Pecuária!$E$32","v":0},null,{"$f":"ROUND((J119+K119)*Pecuária!$E$47,0)","v":0},{"$f":"IF(OR(Pecuária!$D$85=\"bois\",Pecuária!$D$86=\"bois\"),ROUND((J119+K119-M119)*100%,0),\"0\")","v":"0"},0,{"$f":"ROUND(SUM(J119,K119)-M119/2,0)","v":0},{"$f":"ROUND(P119*Pecuária!$C$73,0)","v":0}]
["Novilhos",{"$f":"O108","v":0},{"$f":"Pecuária!$E$33","v":0},null,{"$f":"ROUND((B120+C120)*Pecuária!$E$46,0)","v":0},{"$f":"IF(OR(Pecuária!$D$85=\"novilho\",Pecuária!$D$86=\"novilho\"),ROUND((B120+C120-E120)*100%,0),\"0\")","v":"0"},0,{"$f":"ROUND(SUM(B120,C120)-E120/2,0)","v":0},{"$f":"ROUND(H120*Pecuária!$C$74,0)","v":0},{"$f":"G122","v":0},{"$f":"Pecuária!$E$33","v":0},null,{"$f":"ROUND((J120+K120)*Pecuária!$E$46,0)","v":0},{"$f":"IF(OR(Pecuária!$D$85=\"novilho\",Pecuária!$D$86=\"novilho\"),ROUND((J120+K120-M120)*100%,0),\"0\")","v":"0"},0,{"$f":"ROUND(SUM(J120,K120)-M120/2,0)","v":0},{"$f":"ROUND(P120*Pecuária!$C$74,0)","v":0}]
["Novilhas ",{"$f":"O109","v":0},{"$f":"Pecuária!$E$34","v":0},null,{"$f":"ROUND((B121+C121)*Pecuária!$E$46,0)","v":0},{"$f":"IF(OR(Pecuária!$D$87=\"novilha\",Pecuária!$D$88=\"novilha\"),ROUND((B121+C121-E121)*100%,0),\"0\")","v":"0"},0,{"$f":"ROUND(SUM(B121,C121)-E121/2,0)","v":0},{"$f":"ROUND(H121*Pecuária!$C$75,0)","v":0},{"$f":"G123","v":0},{"$f":"Pecuária!$E$34","v":0},null,{"$f":"ROUND((J121+K121)*Pecuária!$E$46,0)","v":0},{"$f":"IF(OR(Pecuária!$D$87=\"novilha\",Pecuária!$D$88=\"novilha\"),ROUND((J121+K121-M121)*100%,0),\"0\")","v":"0"},0,{"$f":"ROUND(SUM(J121,K121)-M121/2,0)","v":0},{"$f":"ROUND(P121*Pecuária!$C$75,0)","v":0}]
["Garrotes",{"$f":"O110","v":0},{"$f":"Pecuária!$E$35","v":0},null,{"$f":"ROUND((B122+C122)*Pecuária!$E$45,0)","v":0},{"$f":"IF(OR(Pecuária!$D$85=\"garrote\",Pecuária!$D$86=\"garrote\"),ROUND((B122+C122-E122)*100%,0),\"0\")","v":"0"},0,{"$f":"ROUND(SUM(B122,C122)-E122/2,0)","v":0},{"$f":"ROUND(H122*Pecuária!$C$76,0)","v":0},{"$f":"G124","v":0},{"$f":"Pecuária!$E$35","v":0},null,{"$f":"ROUND((J122+K122)*Pecuária!$E$45,0)","v":0},{"$f":"IF(OR(Pecuária!$D$85=\"garrote\",Pecuária!$D$86=\"garrote\"),ROUND((J122+K122-M122)*100%,0),\"0\")","v":"0"},0,{"$f":"ROUND(SUM(J122,K122)-M122/2,0)","v":0},{"$f":"ROUND(P122*Pecuária!$C$76,0)","v":0}]
["Garrotas ",{"$f":"O111","v":0},{"$f":"Pecuária!$E$36","v":0},null,{"$f":"ROUND((B123+C123)*Pecuária!$E$45,0)","v":0},{"$f":"IF(OR(Pecuária!$D$87=\"garrota\",Pecuária!$D$88=\"garrota\"),ROUND((B123+C123-E123)*100%,0),\"0\")","v":"0"},0,{"$f":"ROUND(SUM(B123,C123)-E123/2,0)","v":0},{"$f":"ROUND(H123*Pecuária!$C$77,0)","v":0},{"$f":"G125","v":0},{"$f":"Pecuária!$E$36","v":0},null,{"$f":"ROUND((J123+K123)*Pecuária!$E$45,0)","v":0},{"$f":"IF(OR(Pecuária!$D$87=\"garrota\",Pecuária!$D$88=\"garrota\"),ROUND((J123+K123-M123)*100%,0),\"0\")","v":"0"},0,{"$f":"ROUND(SUM(J123,K123)-M123/2,0)","v":0},{"$f":"ROUND(P123*Pecuária!$C$77,0)","v":0}]
["Bezerros ",null,{"$f":"Pecuária!$E$37","v":0},{"$f":"B118*Pecuária!$E$43*50%+C118*Pecuária!$E$43/2*50%","v":0},{"$f":"ROUND((B124+C124+D124)*Pecuária!$E$44,0)","v":0},{"$f":"IF(OR(Pecuária!$D$85=\"bezerro\",Pecuária!$D$86=\"bezerro\"),ROUND((B124+C124+D124-E124)*100%,0),\"0\")","v":"0"},{"$f":"ROUND(B124+C124+D124-E124-F124,0)","v":0},{"$f":"ROUND(SUM(B124,C124)+D124/2-E124/2,0)","v":0},{"$f":"ROUND(H124*Pecuária!$C$78,0)","v":0},null,{"$f":"Pecuária!$E$37","v":0},{"$f":"J118*Pecuária!$E$43*50%+K118*Pecuária!$E$43/2*50%","v":0},{"$f":"ROUND((J124+K124+L124)*Pecuária!$E$44,0)","v":0},{"$f":"IF(OR(Pecuária!$D$85=\"bezerro\",Pecuária!$D$86=\"bezerro\"),ROUND((J124+K124+L124-M124)*100%,0),\"0\")","v":"0"},{"$f":"ROUND(J124+K124+L124-M124-N124,0)","v":0},{"$f":"ROUND(SUM(J124,K124)+L124/2-M124/2,0)","v":0},{"$f":"ROUND(P124*Pecuária!$C$78,0)","v":0}]
["Bezerras ",null,{"$f":"Pecuária!$E$38","v":0},{"$f":"B118*Pecuária!$E$43*50%+C118*Pecuária!$E$43/2*50%","v":0},{"$f":"ROUND((B125+C125+D125)*Pecuária!$E$44,0)","v":0},{"$f":"IF(OR(Pecuária!$D$87=\"bezerra\",Pecuária!$D$88=\"bezerra\"),ROUND((B125+C125+D125-E125)*100%,0),\"0\")","v":"0"},{"$f":"ROUND(B125+C125+D125-E125-F125,0)","v":0},{"$f":"ROUND(SUM(B125,C125)+D125/2-E125/2,0)","v":0},{"$f":"ROUND(H125*Pecuária!$C$79,0)","v":0},null,{"$f":"Pecuária!$E$38","v":0},{"$f":"J118*Pecuária!$E$43*50%+K118*Pecuária!$E$43/2*50%","v":0},{"$f":"ROUND((J125+K125+L125)*Pecuária!$E$44,0)","v":0},{"$f":"IF(OR(Pecuária!$D$87=\"bezerra\",Pecuária!$D$88=\"bezerra\"),ROUND((J125+K125+L125-M125)*100%,0),\"0\")","v":"0"},{"$f":"ROUND(J125+K125+L125-M125-N125,0)","v":0},{"$f":"ROUND(SUM(J125,K125)+L125/2-M125/2,0)","v":0},{"$f":"ROUND(P125*Pecuária!$C$79,0)","v":0}]
["Total",{"$f":"SUM(B117:B125)","v":0},{"$f":"SUM(C117:C125)","v":0},{"$f":"SUM(D124:D125)","v":0},{"$f":"SUM(E117:E125)","v":0},0,0,0,0,0,0,0,0,0,{"$f":"SUM(O117:O125)","v":0},{"$f":"SUM(P117:P125)","v":0},0]
[]
["Categoria","Ano 7",null,null,null,null,null,null,null,"Ano 8"]
[null,"Qtd Inicial ","Aquis.","Nasc.","Perda","Venda","Qtd Final","Qtd Média",null,"Qtd Inicial ","Aquis.","Nasc.","Perda","Venda","Qtd Final","Qtd Média"]
[null,"(cab.)","(cab.)","(cab.)","(cab.)","(cab.)","(cab.)","(cab.)","(UA)","(cab.)","(cab.)","(cab.)","(cab.)","(cab.)","(cab.)","(cab.)","(UA)"]
["Reprodutores",{"$f":"O117","v":0},{"$f":"Pecuária!$E$30","v":0},null,{"$f":"ROUND((B131+C131)*Pecuária!$E$47,0)","v":0},{"$f":"ROUND((B131+C131-E131)*Pecuária!$D$83,0)","v":0},{"$f":"ROUND(B131+C131-E131-F131,0)","v":0},{"$f":"ROUND(SUM(B131,C131)-SUM(E131,F131)/2,0)","v":0},{"$f":"ROUND(H131*Pecuária!$C$71,0)","v":0},{"$f":"G131","v":0},{"$f":"Pecuária!$E$30","v":0},null,{"$f":"ROUND((J131+K131)*Pecuária!$E$47,0)","v":0},{"$f":"ROUND((J131+K131-M131)*Pecuária!$D$83,0)","v":0},{"$f":"ROUND(J131+K131-M131-N131,0)","v":0},{"$f":"ROUND(SUM(J131,K131)-SUM(M131,N131)/2,0)","v":0},{"$f":"ROUND(P131*Pecuária!$C$71,0)","v":0}]
["Matrizes",{"$f":"O118+O121","v":0},{"$f":"Pecuária!$E$31","v":0},null,{"$f":"ROUND((B132+C132)*Pecuária!$E$47,0)","v":0},{"$f":"ROUND((B132+C132-E132)*Pecuária!$D$84,0)","v":0},0,{"$f":"ROUND(SUM(B132,C132)-SUM(E132,F132)/2,0)","v":0},{"$f":"ROUND(H132*Pecuária!$C$72,0)","v":0},{"$f":"G132+G135","v":0},{"$f":"Pecuária!$E$31","v":0},null,{"$f":"ROUND((J132+K132)*Pecuária!$E$47,0)","v":0},{"$f":"ROUND((J132+K132-M132)*Pecuária!$D$84,0)","v":0},0,{"$f":"ROUND(SUM(J132,K132)-SUM(M132,N132)/2,0)","v":0},{"$f":"ROUND(P132*Pecuária!$C$72,0)","v":0}]
["Bois",{"$f":"O119+O120","v":0},{"$f":"Pecuária!$E$32","v":0},null,{"$f":"ROUND((B133+C133)*Pecuária!$E$47,0)","v":0},{"$f":"IF(OR(Pecuária!$D$85=\"bois\",Pecuária!$D$86=\"bois\"),ROUND((B133+C133-E133)*100%,0),\"0\")","v":"0"},0,{"$f":"ROUND(SUM(B133,C133)-E133/2,0)","v":0},{"$f":"ROUND(H133*Pecuária!$C$73,0)","v":0},{"$f":"G133+G134","v":0},{"$f":"Pecuária!$E$32","v":0},null,{"$f":"ROUND((J133+K133)*Pecuária!$E$47,0)","v":0},{"$f":"IF(OR(Pecuária!$D$85=\"bois\",Pecuária!$D$86=\"bois\"),ROUND((J133+K133-M133)*100%,0),\"0\")","v":"0"},0,{"$f":"ROUND(SUM(J133,K133)-M133/2,0)","v":0},{"$f":"ROUND(P133*Pecuária!$C$73,0)","v":0}]
["Novilhos",{"$f":"O122","v":0},{"$f":"Pecuária!$E$33","v":0},null,{"$f":"ROUND((B134+C134)*Pecuária!$E$46,0)","v":0},{"$f":"IF(OR(Pecuária!$D$85=\"novilho\",Pecuária!$D$86=\"novilho\"),ROUND((B134+C134-E134)*100%,0),\"0\")","v":"0"},0,{"$f":"ROUND(SUM(B134,C134)-E134/2,0)","v":0},{"$f":"ROUND(H134*Pecuária!$C$74,0)","v":0},{"$f":"G136","v":0},{"$f":"Pecuária!$E$33","v":0},null,{"$f":"ROUND((J134+K134)*Pecuária!$E$46,0)","v":0},{"$f":"IF(OR(Pecuária!$D$85=\"novilho\",Pecuária!$D$86=\"novilho\"),ROUND((J134+K134-M134)*100%,0),\"0\")","v":"0"},0,{"$f":"ROUND(SUM(J134,K134)-M134/2,0)","v":0},{"$f":"ROUND(P134*Pecuária!$C$74,0)","v":0}]
["Novilhas ",{"$f":"O123","v":0},{"$f":"Pecuária!$E$34","v":0},null,{"$f":"ROUND((B135+C135)*Pecuária!$E$46,0)","v":0},{"$f":"IF(OR(Pecuária!$D$87=\"novilha\",Pecuária!$D$88=\"novilha\"),ROUND((B135+C135-E135)*100%,0),\"0\")","v":"0"},0,{"$f":"ROUND(SUM(B135,C135)-E135/2,0)","v":0},{"$f":"ROUND(H135*Pecuária!$C$75,0)","v":0},{"$f":"G137","v":0},{"$f":"Pecuária!$E$34","v":0},null,{"$f":"ROUND((J135+K135)*Pecuária!$E$46,0)","v":0},{"$f":"IF(OR(Pecuária!$D$87=\"novilha\",Pecuária!$D$88=\"novilha\"),ROUND((J135+K135-M135)*100%,0),\"0\")","v":"0"},0,{"$f":"ROUND(SUM(J135,K135)-M135/2,0)","v":0},{"$f":"ROUND(P135*Pecuária!$C$75,0)","v":0}]
["Garrotes",{"$f":"O124","v":0},{"$f":"Pecuária!$E$35","v":0},null,{"$f":"ROUND((B136+C136)*Pecuária!$E$45,0)","v":0},{"$f":"IF(OR(Pecuária!$D$85=\"garrote\",Pecuária!$D$86=\"garrote\"),ROUND((B136+C136-E136)*100%,0),\"0\")","v":"0"},0,{"$f":"ROUND(SUM(B136,C136)-E136/2,0)","v":0},{"$f":"ROUND(H136*Pecuária!$C$76,0)","v":0},{"$f":"G138","v":0},{"$f":"Pecuária!$E$35","v":0},null,{"$f":"ROUND((J136+K136)*Pecuária!$E$45,0)","v":0},{"$f":"IF(OR(Pecuária!$D$85=\"garrote\",Pecuária!$D$86=\"garrote\"),ROUND((J136+K136-M136)*100%,0),\"0\")","v":"0"},0,{"$f":"ROUND(SUM(J136,K136)-M136/2,0)","v":0},{"$f":"ROUND(P136*Pecuária!$C$76,0)","v":0}]
["Garrotas ",{"$f":"O125","v":0},{"$f":"Pecuária!$E$36","v":0},null,{"$f":"ROUND((B137+C137)*Pecuária!$E$45,0)","v":0},{"$f":"IF(OR(Pecuária!$D$87=\"garrota\",Pecuária!$D$88=\"garrota\"),ROUND((B137+C137-E137)*100%,0),\"0\")","v":"0"},0,{"$f":"ROUND(SUM(B137,C137)-E137/2,0)","v":0},{"$f":"ROUND(H137*Pecuária!$C$77,0)","v":0},{"$f":"G139","v":0},{"$f":"Pecuária!$E$36","v":0},null,{"$f":"ROUND((J137+K137)*Pecuária!$E$45,0)","v":0},{"$f":"IF(OR(Pecuária!$D$87=\"garrota\",Pecuária!$D$88=\"garrota\"),ROUND((J137+K137-M137)*100%,0),\"0\")","v":"0"},0,{"$f":"ROUND(SUM(J137,K137)-M137/2,0)","v":0},{"$f":"ROUND(P137*Pecuária!$C$77,0)","v":0}]
["Bezerros ",null,{"$f":"Pecuária!$E$37","v":0},{"$f":"B132*Pecuária!$E$43*50%+C132*Pecuária!$E$43/2*50%","v":0},{"$f":"ROUND((B138+C138+D138)*Pecuária!$E$44,0)","v":0},{"$f":"IF(OR(Pecuária!$D$85=\"bezerro\",Pecuária!$D$86=\"bezerro\"),ROUND((B138+C138+D138-E138)*100%,0),\"0\")","v":"0"},{"$f":"ROUND(B138+C138+D138-E138-F138,0)","v":0},{"$f":"ROUND(SUM(B138,C138)+D138/2-E138/2,0)","v":0},{"$f":"ROUND(H138*Pecuária!$C$78,0)","v":0},null,{"$f":"Pecuária!$E$37","v":0},{"$f":"J132*Pecuária!$E$43*50%+K132*Pecuária!$E$43/2*50%","v":0},{"$f":"ROUND((J138+K138+L138)*Pecuária!$E$44,0)","v":0},{"$f":"IF(OR(Pecuária!$D$85=\"bezerro\",Pecuária!$D$86=\"bezerro\"),ROUND((J138+K138+L138-M138)*100%,0),\"0\")","v":"0"},{"$f":"ROUND(J138+K138+L138-M138-N138,0)","v":0},{"$f":"ROUND(SUM(J138,K138)+L138/2-M138/2,0)","v":0},{"$f":"ROUND(P138*Pecuária!$C$78,0)","v":0}]
["Bezerras ",null,{"$f":"Pecuária!$E$38","v":0},{"$f":"B132*Pecuária!$E$43*50%+C132*Pecuária!$E$43/2*50%","v":0},{"$f":"ROUND((B139+C139+D139)*Pecuária!$E$44,0)","v":0},{"$f":"IF(OR(Pecuária!$D$87=\"bezerra\",Pecuária!$D$88=\"bezerra\"),ROUND((B139+C139+D139-E139)*100%,0),\"0\")","v":"0"},{"$f":"ROUND(B139+C139+D139-E139-F139,0)","v":0},{"$f":"ROUND(SUM(B139,C139)+D139/2-E139/2,0)","v":0},{"$f":"ROUND(H139*Pecuária!$C$79,0)","v":0},null,{"$f":"Pecuária!$E$38","v":0},{"$f":"J132*Pecuária!$E$43*50%+K132*Pecuária!$E$43/2*50%","v":0},{"$f":"ROUND((J139+K139+L139)*Pecuária!$E$44,0)","v":0},{"$f":"IF(OR(Pecuária!$D$87=\"bezerra\",Pecuária!$D$88=\"bezerra\"),ROUND((J139+K139+L139-M139)*100%,0),\"0\")","v":"0"},{"$f":"ROUND(J139+K139+L139-M139-N139,0)","v":0},{"$f":"ROUND(SUM(J139,K139)+L139/2-M139/2,0)","v":0},{"$f":"ROUND(P139*Pecuária!$C$79,0)","v":0}]
["Total",{"$f":"SUM(B131:B139)","v":0},{"$f":"SUM(C131:C139)","v":0},{"$f":"SUM(D138:D139)","v":0},{"$f":"SUM(E131:E139)","v":0},0,0,0,0,0,0,0,0,0,0,0,0]
[]
["Categoria","Ano 9",null,null,null,null,null,null,null,"Ano 10"]
[null,"Qtd Inicial ","Aquis.","Nasc.","Perda","Venda","Qtd Final","Qtd Média",null,"Qtd Inicial ","Aquis.","Nasc.","Perda","Venda","Qtd Final","Qtd Média"]
[null,"(cab.)","(cab.)","(cab.)","(cab.)","(cab.)","(cab.)","(cab.)","(UA)","(cab.)","(cab.)","(cab.)","(cab.)","(cab.)","(cab.)","(cab.)","(UA)"]
["Reprodutores",{"$f":"O131","v":0},{"$f":"Pecuária!$E$30","v":0},null,{"$f":"ROUND((B145+C145)*Pecuária!$E$47,0)","v":0},{"$f":"ROUND((B145+C145-E145)*Pecuária!$D$83,0)","v":0},{"$f":"ROUND(B145+C145-E145-F145,0)","v":0},{"$f":"ROUND(SUM(B145,C145)-SUM(E145,F145)/2,0)","v":0},{"$f":"ROUND(H145*Pecuária!$C$71,0)","v":0},{"$f":"G145","v":0},{"$f":"Pecuária!$E$30","v":0},null,{"$f":"ROUND((J145+K145)*Pecuária!$E$47,0)","v":0},{"$f":"ROUND((J145+K145-M145)*Pecuária!$D$83,0)","v":0},{"$f":"ROUND(J145+K145-M145-N145,0)","v":0},{"$f":"ROUND(SUM(J145,K145)-SUM(M145,N145)/2,0)","v":0},{"$f":"ROUND(P145*Pecuária!$C$71,0)","v":0}]
["Matrizes",{"$f":"O132+O135","v":0},{"$f":"Pecuária!$E$31","v":0},null,{"$f":"ROUND((B146+C146)*Pecuária!$E$47,0)","v":0},{"$f":"ROUND((B146+C146-E146)*Pecuária!$D$84,0)","v":0},0,{"$f":"ROUND(SUM(B146,C146)-SUM(E146,F146)/2,0)","v":0},{"$f":"ROUND(H146*Pecuária!$C$72,0)","v":0},{"$f":"G146+G149","v":0},{"$f":"Pecuária!$E$31","v":0},null,{"$f":"ROUND((J146+K146)*Pecuária!$E$47,0)","v":0},{"$f":"ROUND((J146+K146-M146)*Pecuária!$D$84,0)","v":0},0,{"$f":"ROUND(SUM(J146,K146)-SUM(M146,N146)/2,0)","v":0},{"$f":"ROUND(P146*Pecuária!$C$72,0)","v":0}]
["Bois",{"$f":"O133+O134","v":0},{"$f":"Pecuária!$E$32","v":0},null,{"$f":"ROUND((B147+C147)*Pecuária!$E$47,0)","v":0},{"$f":"IF(OR(Pecuária!$D$85=\"bois\",Pecuária!$D$86=\"bois\"),ROUND((B147+C147-E147)*100%,0),\"0\")","v":"0"},0,{"$f":"ROUND(SUM(B147,C147)-E147/2,0)","v":0},{"$f":"ROUND(H147*Pecuária!$C$73,0)","v":0},{"$f":"G147+G148","v":0},{"$f":"Pecuária!$E$32","v":0},null,{"$f":"ROUND((J147+K147)*Pecuária!$E$47,0)","v":0},{"$f":"IF(OR(Pecuária!$D$85=\"bois\",Pecuária!$D$86=\"bois\"),ROUND((J147+K147-M147)*100%,0),\"0\")","v":"0"},0,{"$f":"ROUND(SUM(J147,K147)-M147/2,0)","v":0},{"$f":"ROUND(P147*Pecuária!$C$73,0)","v":0}]
["Novilhos",{"$f":"O136","v":0},{"$f":"Pecuária!$E$33","v":0},null,{"$f":"ROUND((B148+C148)*Pecuária!$E$46,0)","v":0},{"$f":"IF(OR(Pecuária!$D$85=\"novilho\",Pecuária!$D$86=\"novilho\"),ROUND((B148+C148-E148)*100%,0),\"0\")","v":"0"},0,{"$f":"ROUND(SUM(B148,C148)-E148/2,0)","v":0},{"$f":"ROUND(H148*Pecuária!$C$74,0)","v":0},{"$f":"G150","v":0},{"$f":"Pecuária!$E$33","v":0},null,{"$f":"ROUND((J148+K148)*Pecuária!$E$46,0)","v":0},{"$f":"IF(OR(Pecuária!$D$85=\"novilho\",Pecuária!$D$86=\"novilho\"),ROUND((J148+K148-M148)*100%,0),\"0\")","v":"0"},0,{"$f":"ROUND(SUM(J148,K148)-M148/2,0)","v":0},{"$f":"ROUND(P148*Pecuária!$C$74,0)","v":0}]
["Novilhas ",{"$f":"O137","v":0},{"$f":"Pecuária!$E$34","v":0},null,{"$f":"ROUND((B149+C149)*Pecuária!$E$46,0)","v":0},{"$f":"IF(OR(Pecuária!$D$87=\"novilha\",Pecuária!$D$88=\"novilha\"),ROUND((B149+C149-E149)*100%,0),\"0\")","v":"0"},0,{"$f":"ROUND(SUM(B149,C149)-E149/2,0)","v":0},{"$f":"ROUND(H149*Pecuária!$C$75,0)","v":0},{"$f":"G151","v":0},{"$f":"Pecuária!$E$34","v":0},null,{"$f":"ROUND((J149+K149)*Pecuária!$E$46,0)","v":0},{"$f":"IF(OR(Pecuária!$D$87=\"novilha\",Pecuária!$D$88=\"novilha\"),ROUND((J149+K149-M149)*100%,0),\"0\")","v":"0"},0,{"$f":"ROUND(SUM(J149,K149)-M149/2,0)","v":0},{"$f":"ROUND(P149*Pecuária!$C$75,0)","v":0}]
["Garrotes",{"$f":"O138","v":0},{"$f":"Pecuária!$E$35","v":0},null,{"$f":"ROUND((B150+C150)*Pecuária!$E$45,0)","v":0},{"$f":"IF(OR(Pecuária!$D$85=\"garrote\",Pecuária!$D$86=\"garrote\"),ROUND((B150+C150-E150)*100%,0),\"0\")","v":"0"},0,{"$f":"ROUND(SUM(B150,C150)-E150/2,0)","v":0},{"$f":"ROUND(H150*Pecuária!$C$76,0)","v":0},{"$f":"G152","v":0},{"$f":"Pecuária!$E$35","v":0},null,{"$f":"ROUND((J150+K150)*Pecuária!$E$45,0)","v":0},{"$f":"IF(OR(Pecuária!$D$85=\"garrote\",Pecuária!$D$86=\"garrote\"),ROUND((J150+K150-M150)*100%,0),\"0\")","v":"0"},0,{"$f":"ROUND(SUM(J150,K150)-M150/2,0)","v":0},{"$f":"ROUND(P150*Pecuária!$C$76,0)","v":0}]
["Garrotas ",{"$f":"O139","v":0},{"$f":"Pecuária!$E$36","v":0},null,{"$f":"ROUND((B151+C151)*Pecuária!$E$45,0)","v":0},{"$f":"IF(OR(Pecuária!$D$87=\"garrota\",Pecuária!$D$88=\"garrota\"),ROUND((B151+C151-E151)*100%,0),\"0\")","v":"0"},0,{"$f":"ROUND(SUM(B151,C151)-E151/2,0)","v":0},{"$f":"ROUND(H151*Pecuária!$C$77,0)","v":0},{"$f":"G153","v":0},{"$f":"Pecuária!$E$36","v":0},null,{"$f":"ROUND((J151+K151)*Pecuária!$E$45,0)","v":0},{"$f":"IF(OR(Pecuária!$D$87=\"garrota\",Pecuária!$D$88=\"garrota\"),ROUND((J151+K151-M151)*100%,0),\"0\")","v":"0"},0,{"$f":"ROUND(SUM(J151,K151)-M151/2,0)","v":0},{"$f":"ROUND(P151*Pecuária!$C$77,0)","v":0}]
["Bezerros ",null,{"$f":"Pecuária!$E$37","v":0},{"$f":"B146*Pecuária!$E$43*50%+C146*Pecuária!$E$43/2*50%","v":0},{"$f":"ROUND((B152+C152+D152)*Pecuária!$E$44,0)","v":0},{"$f":"IF(OR(Pecuária!$D$85=\"bezerro\",Pecuária!$D$86=\"bezerro\"),ROUND((B152+C152+D152-E152)*100%,0),\"0\")","v":"0"},{"$f":"ROUND(B152+C152+D152-E152-F152,0)","v":0},{"$f":"ROUND(SUM(B152,C152)+D152/2-E152/2,0)","v":0},{"$f":"ROUND(H152*Pecuária!$C$78,0)","v":0},null,{"$f":"Pecuária!$E$37","v":0},{"$f":"J146*Pecuária!$E$43*50%+K146*Pecuária!$E$43/2*50%","v":0},{"$f":"ROUND((J152+K152+L152)*Pecuária!$E$44,0)","v":0},{"$f":"IF(OR(Pecuária!$D$85=\"bezerro\",Pecuária!$D$86=\"bezerro\"),ROUND((J152+K152+L152-M152)*100%,0),\"0\")","v":"0"},{"$f":"ROUND(J152+K152+L152-M152-N152,0)","v":0},{"$f":"ROUND(SUM(J152,K152)+L152/2-M152/2,0)","v":0},{"$f":"ROUND(P152*Pecuária!$C$78,0)","v":0}]
["Bezerras ",null,{"$f":"Pecuária!$E$38","v":0},{"$f":"B146*Pecuária!$E$43*50%+C146*Pecuária!$E$43/2*50%","v":0},{"$f":"ROUND((B153+C153+D153)*Pecuária!$E$44,0)","v":0},{"$f":"IF(OR(Pecuária!$D$87=\"bezerra\",Pecuária!$D$88=\"bezerra\"),ROUND((B153+C153+D153-E153)*100%,0),\"0\")","v":"0"},{"$f":"ROUND(B153+C153+D153-E153-F153,0)","v":0},{"$f":"ROUND(SUM(B153,C153)+D153/2-E153/2,0)","v":0},{"$f":"ROUND(H153*Pecuária!$C$79,0)","v":0},null,{"$f":"Pecuária!$E$38","v":0},{"$f":"J146*Pecuária!$E$43*50%+K146*Pecuária!$E$43/2*50%","v":0},{"$f":"ROUND((J153+K153+L153)*Pecuária!$E$44,0)","v":0},{"$f":"IF(OR(Pecuária!$D$87=\"bezerra\",Pecuária!$D$88=\"bezerra\"),ROUND((J153+K153+L153-M153)*100%,0),\"0\")","v":"0"},{"$f":"ROUND(J153+K153+L153-M153-N153,0)","v":0},{"$f":"ROUND(SUM(J153,K153)+L153/2-M153/2,0)","v":0},{"$f":"ROUND(P153*Pecuária!$C$79,0)","v":0}]
["Total",{"$f":"SUM(B145:B153)","v":0},0,0,0,0,0,0,0,0,0,0,0,0,0,0,0]
[]
["Categoria","Ano 11",null,null,null,null,null,null,null,"Ano 12"]
[null,"Qtd Inicial ","Aquis.","Nasc.","Perda","Venda","Qtd Final","Qtd Média",null,"Qtd Inicial ","Aquis.","Nasc.","Perda","Venda","Qtd Final","Qtd Média"]
[null,"(cab.)","(cab.)","(cab.)","(cab.)","(cab.)","(cab.)","(cab.)","(UA)","(cab.)","(cab.)","(cab.)","(cab.)","(cab.)","(cab.)","(cab.)","(UA)"]
["Reprodutores",{"$f":"O145","v":0},{"$f":"Pecuária!$E$30","v":0},null,{"$f":"ROUND((B159+C159)*Pecuária!$E$47,0)","v":0},{"$f":"ROUND((B159+C159-E159)*Pecuária!$D$83,0)","v":0},{"$f":"ROUND(B159+C159-E159-F159,0)","v":0},{"$f":"ROUND(SUM(B159,C159)-SUM(E159,F159)/2,0)","v":0},{"$f":"ROUND(H159*Pecuária!$C$71,0)","v":0},{"$f":"G159","v":0},{"$f":"Pecuária!$E$30","v":0},null,{"$f":"ROUND((J159+K159)*Pecuária!$E$47,0)","v":0},{"$f":"ROUND((J159+K159-M159)*Pecuária!$D$83,0)","v":0},{"$f":"ROUND(J159+K159-M159-N159,0)","v":0},{"$f":"ROUND(SUM(J159,K159)-SUM(M159,N159)/2,0)","v":0},{"$f":"ROUND(P159*Pecuária!$C$71,0)","v":0}]
["Matrizes",{"$f":"O146+O149","v":0},{"$f":"Pecuária!$E$31","v":0},null,{"$f":"ROUND((B160+C160)*Pecuária!$E$47,0)","v":0},{"$f":"ROUND((B160+C160-E160)*Pecuária!$D$84,0)","v":0},0,{"$f":"ROUND(SUM(B160,C160)-SUM(E160,F160)/2,0)","v":0},{"$f":"ROUND(H160*Pecuária!$C$72,0)","v":0},{"$f":"G160+G163","v":0},{"$f":"Pecuária!$E$31","v":0},null,{"$f":"ROUND((J160+K160)*Pecuária!$E$47,0)","v":0},{"$f":"ROUND((J160+K160-M160)*Pecuária!$D$84,0)","v":0},0,{"$f":"ROUND(SUM(J160,K160)-SUM(M160,N160)/2,0)","v":0},{"$f":"ROUND(P160*Pecuária!$C$72,0)","v":0}]
["Bois",{"$f":"O147+O148","v":0},{"$f":"Pecuária!$E$32","v":0},null,{"$f":"ROUND((B161+C161)*Pecuária!$E$47,0)","v":0},{"$f":"IF(OR(Pecuária!$D$85=\"bois\",Pecuária!$D$86=\"bois\"),ROUND((B161+C161-E161)*100%,0),\"0\")","v":"0"},0,{"$f":"ROUND(SUM(B161,C161)-E161/2,0)","v":0},{"$f":"ROUND(H161*Pecuária!$C$73,0)","v":0},{"$f":"G161+G162","v":0},{"$f":"Pecuária!$E$32","v":0},null,{"$f":"ROUND((J161+K161)*Pecuária!$E$47,0)","v":0},{"$f":"IF(OR(Pecuária!$D$85=\"bois\",Pecuária!$D$86=\"bois\"),ROUND((J161+K161-M161)*100%,0),\"0\")","v":"0"},0,{"$f":"ROUND(SUM(J161,K161)-M161/2,0)","v":0},{"$f":"ROUND(P161*Pecuária!$C$73,0)","v":0}]
["Novilhos",{"$f":"O150","v":0},{"$f":"Pecuária!$E$33","v":0},null,{"$f":"ROUND((B162+C162)*Pecuária!$E$46,0)","v":0},{"$f":"IF(OR(Pecuária!$D$85=\"novilho\",Pecuária!$D$86=\"novilho\"),ROUND((B162+C162-E162)*100%,0),\"0\")","v":"0"},0,{"$f":"ROUND(SUM(B162,C162)-E162/2,0)","v":0},{"$f":"ROUND(H162*Pecuária!$C$74,0)","v":0},{"$f":"G164","v":0},{"$f":"Pecuária!$E$33","v":0},null,{"$f":"ROUND((J162+K162)*Pecuária!$E$46,0)","v":0},{"$f":"IF(OR(Pecuária!$D$85=\"novilho\",Pecuária!$D$86=\"novilho\"),ROUND((J162+K162-M162)*100%,0),\"0\")","v":"0"},0,{"$f":"ROUND(SUM(J162,K162)-M162/2,0)","v":0},{"$f":"ROUND(P162*Pecuária!$C$74,0)","v":0}]
["Novilhas ",{"$f":"O151","v":0},{"$f":"Pecuária!$E$34","v":0},null,{"$f":"ROUND((B163+C163)*Pecuária!$E$46,0)","v":0},{"$f":"IF(OR(Pecuária!$D$87=\"novilha\",Pecuária!$D$88=\"novilha\"),ROUND((B163+C163-E163)*100%,0),\"0\")","v":"0"},0,{"$f":"ROUND(SUM(B163,C163)-E163/2,0)","v":0},{"$f":"ROUND(H163*Pecuária!$C$75,0)","v":0},{"$f":"G165","v":0},{"$f":"Pecuária!$E$34","v":0},null,{"$f":"ROUND((J163+K163)*Pecuária!$E$46,0)","v":0},{"$f":"IF(OR(Pecuária!$D$87=\"novilha\",Pecuária!$D$88=\"novilha\"),ROUND((J163+K163-M163)*100%,0),\"0\")","v":"0"},0,{"$f":"ROUND(SUM(J163,K163)-M163/2,0)","v":0},{"$f":"ROUND(P163*Pecuária!$C$75,0)","v":0}]
["Garrotes",{"$f":"O152","v":0},{"$f":"Pecuária!$E$35","v":0},null,{"$f":"ROUND((B164+C164)*Pecuária!$E$45,0)","v":0},{"$f":"IF(OR(Pecuária!$D$85=\"garrote\",Pecuária!$D$86=\"garrote\"),ROUND((B164+C164-E164)*100%,0),\"0\")","v":"0"},0,{"$f":"ROUND(SUM(B164,C164)-E164/2,0)","v":0},{"$f":"ROUND(H164*Pecuária!$C$76,0)","v":0},{"$f":"G166","v":0},{"$f":"Pecuária!$E$35","v":0},null,{"$f":"ROUND((J164+K164)*Pecuária!$E$45,0)","v":0},{"$f":"IF(OR(Pecuária!$D$85=\"garrote\",Pecuária!$D$86=\"garrote\"),ROUND((J164+K164-M164)*100%,0),\"0\")","v":"0"},0,{"$f":"ROUND(SUM(J164,K164)-M164/2,0)","v":0},{"$f":"ROUND(P164*Pecuária!$C$76,0)","v":0}]
["Garrotas ",{"$f":"O153","v":0},{"$f":"Pecuária!$E$36","v":0},null,{"$f":"ROUND((B165+C165)*Pecuária!$E$45,0)","v":0},{"$f":"IF(OR(Pecuária!$D$87=\"garrota\",Pecuária!$D$88=\"garrota\"),ROUND((B165+C165-E165)*100%,0),\"0\")","v":"0"},0,{"$f":"ROUND(SUM(B165,C165)-E165/2,0)","v":0},{"$f":"ROUND(H165*Pecuária!$C$77,0)","v":0},{"$f":"G167","v":0},{"$f":"Pecuária!$E$36","v":0},null,{"$f":"ROUND((J165+K165)*Pecuária!$E$45,0)","v":0},{"$f":"IF(OR(Pecuária!$D$87=\"garrota\",Pecuária!$D$88=\"garrota\"),ROUND((J165+K165-M165)*100%,0),\"0\")","v":"0"},0,{"$f":"ROUND(SUM(J165,K165)-M165/2,0)","v":0},{"$f":"ROUND(P165*Pecuária!$C$77,0)","v":0}]
["Bezerros ",null,{"$f":"Pecuária!$E$37","v":0},{"$f":"B160*Pecuária!$E$43*50%+C160*Pecuária!$E$43/2*50%","v":0},{"$f":"ROUND((B166+C166+D166)*Pecuária!$E$44,0)","v":0},{"$f":"IF(OR(Pecuária!$D$85=\"bezerro\",Pecuária!$D$86=\"bezerro\"),ROUND((B166+C166+D166-E166)*100%,0),\"0\")","v":"0"},{"$f":"ROUND(B166+C166+D166-E166-F166,0)","v":0},{"$f":"ROUND(SUM(B166,C166)+D166/2-E166/2,0)","v":0},{"$f":"ROUND(H166*Pecuária!$C$78,0)","v":0},null,{"$f":"Pecuária!$E$37","v":0},{"$f":"J160*Pecuária!$E$43*50%+K160*Pecuária!$E$43/2*50%","v":0},{"$f":"ROUND((J166+K166+L166)*Pecuária!$E$44,0)","v":0},{"$f":"IF(OR(Pecuária!$D$85=\"bezerro\",Pecuária!$D$86=\"bezerro\"),ROUND((J166+K166+L166-M166)*100%,0),\"0\")","v":"0"},{"$f":"ROUND(J166+K166+L166-M166-N166,0)","v":0},{"$f":"ROUND(SUM(J166,K166)+L166/2-M166/2,0)","v":0},{"$f":"ROUND(P166*Pecuária!$C$78,0)","v":0}]
["Bezerras ",null,{"$f":"Pecuária!$E$38","v":0},{"$f":"B160*Pecuária!$E$43*50%+C160*Pecuária!$E$43/2*50%","v":0},{"$f":"ROUND((B167+C167+D167)*Pecuária!$E$44,0)","v":0},{"$f":"IF(OR(Pecuária!$D$87=\"bezerra\",Pecuária!$D$88=\"bezerra\"),ROUND((B167+C167+D167-E167)*100%,0),\"0\")","v":"0"},{"$f":"ROUND(B167+C167+D167-E167-F167,0)","v":0},{"$f":"ROUND(SUM(B167,C167)+D167/2-E167/2,0)","v":0},{"$f":"ROUND(H167*Pecuária!$C$79,0)","v":0},null,{"$f":"Pecuária!$E$38","v":0},{"$f":"J160*Pecuária!$E$43*50%+K160*Pecuária!$E$43/2*50%","v":0},{"$f":"ROUND((J167+K167+L167)*Pecuária!$E$44,0)","v":0},{"$f":"IF(OR(Pecuária!$D$87=\"bezerra\",Pecuária!$D$88=\"bezerra\"),ROUND((J167+K167+L167-M167)*100%,0),\"0\")","v":"0"},{"$f":"ROUND(J167+K167+L167-M167-N167,0)","v":0},{"$f":"ROUND(SUM(J167,K167)+L167/2-M167/2,0)","v":0},{"$f":"ROUND(P167*Pecuária!$C$79,0)","v":0}]
["Total",{"$f":"SUM(B159:B167)","v":0},{"$f":"SUM(C159:C167)","v":0},{"$f":"SUM(D166:D167)","v":0},{"$f":"SUM(E159:E167)","v":0},0,0,0,0,0,0,0,0,0,0,0,0]

{"sheet":"Mem pecuaria","index":22,"n_rows":118,"n_cols":13,"rows_kept":118,"cut":false,"hidden":true,"merged":[[0,0,0,12],[1,0,3,0],[1,1,1,12],[2,1,2,2],[2,3,2,4],[2,5,2,6],[2,7,2,8],[2,9,2,10],[2,11,2,12],[18,0,20,0],[18,1,18,12],[19,1,19,2],[19,3,19,4],[19,5,19,6],[19,7,19,8],[19,9,19,10],[19,11,19,12],[35,0,35,12],[36,0,38,0],[36,1,36,12],[37,1,37,2],[37,3,37,4],[37,5,37,6],[37,7,37,8],[37,9,37,10],[37,11,37,12],[53,0,55,0],[53,1,53,12],[54,1,54,2],[54,3,54,4],[54,5,54,6],[54,7,54,8],[54,9,54,10],[54,11,54,12],[112,0,112,12],[70,0,72,0],[70,1,70,12],[98,0,100,0],[98,1,98,12]]}
["Receitas - Rebanho A"]
["Produtos Comercializados","Produção"]
[null,"Ano 1",null,"Ano 2",null,"Ano 3",null,"Ano 4",null,"Ano 5",null,"Ano 6"]
[null,"Qtd","Valor","Qtd","Valor","Qtd","Valor","Qtd","Valor","Qtd","Valor","Qtd","Valor"]
["Touro descartado",{"$f":"'Evolução rebanho'!F5","v":0},{"$f":"B5*Pecuária!$B94","v":0},{"$f":"'Evolução rebanho'!N5","v":0},{"$f":"D5*Pecuária!B94","v":0},{"$f":"'Evolução rebanho'!F19","v":0},{"$f":"F5*Pecuária!B94","v":0},{"$f":"'Evolução rebanho'!N19","v":0},{"$f":"H5*Pecuária!B94","v":0},{"$f":"'Evolução rebanho'!F33","v":0},{"$f":"J5*Pecuária!$B$94","v":0},{"$f":"'Evolução rebanho'!N33","v":0},{"$f":"L5*Pecuária!$B$94","v":0}]
["Matriz descartada",{"$f":"'Evolução rebanho'!F6","v":0},{"$f":"B6*Pecuária!B95","v":0},{"$f":"'Evolução rebanho'!N6","v":0},{"$f":"D6*Pecuária!B95","v":0},{"$f":"'Evolução rebanho'!F20","v":0},{"$f":"F6*Pecuária!B95","v":0},{"$f":"'Evolução rebanho'!N20","v":0},{"$f":"H6*Pecuária!B95","v":0},{"$f":"'Evolução rebanho'!F34","v":0},{"$f":"J6*Pecuária!$B$95","v":0},{"$f":"'Evolução rebanho'!N34","v":0},{"$f":"L6*Pecuária!$B$95","v":0}]
["Boi Gordo p/ abate",{"$f":"'Evolução rebanho'!F7","v":"0"},{"$f":"B7*Pecuária!B96","v":0},{"$f":"'Evolução rebanho'!N7","v":"0"},{"$f":"D7*Pecuária!B96","v":0},{"$f":"'Evolução rebanho'!F21","v":"0"},{"$f":"F7*Pecuária!B96","v":0},{"$f":"'Evolução rebanho'!N21","v":"0"},{"$f":"H7*Pecuária!B96","v":0},{"$f":"'Evolução rebanho'!F35","v":"0"},{"$f":"J7*Pecuária!$B$96","v":0},{"$f":"'Evolução rebanho'!N35","v":"0"},{"$f":"L7*Pecuária!$B$96","v":0}]
["Novilho Gordo",{"$f":"'Evolução rebanho'!F8","v":"0"},{"$f":"B8*Pecuária!B97","v":0},{"$f":"'Evolução rebanho'!N8","v":"0"},{"$f":"D8*Pecuária!B97","v":0},{"$f":"'Evolução rebanho'!F22","v":"0"},{"$f":"F8*Pecuária!B97","v":0},{"$f":"'Evolução rebanho'!N22","v":"0"},{"$f":"H8*Pecuária!B97","v":0},{"$f":"'Evolução rebanho'!F36","v":"0"},{"$f":"J8*Pecuária!$B$97","v":0},{"$f":"'Evolução rebanho'!N36","v":"0"},{"$f":"L8*Pecuária!$B$97","v":0}]
["Fêmea Excedente",{"$f":"'Evolução rebanho'!F9","v":"0"},{"$f":"B9*Pecuária!B98","v":0},{"$f":"'Evolução rebanho'!N9","v":"0"},{"$f":"D9*Pecuária!B98","v":0},{"$f":"'Evolução rebanho'!F23","v":"0"},{"$f":"F9*Pecuária!B98","v":0},{"$f":"'Evolução rebanho'!N23","v":"0"},{"$f":"H9*Pecuária!B98","v":0},{"$f":"'Evolução rebanho'!F37","v":"0"},{"$f":"J9*Pecuária!$B$98","v":0},{"$f":"'Evolução rebanho'!N37","v":"0"},{"$f":"L9*Pecuária!$B$98","v":0}]
["Garrotes ",{"$f":"'Evolução rebanho'!F10","v":"0"},{"$f":"B10*Pecuária!B99","v":0},{"$f":"'Evolução rebanho'!N10","v":"0"},{"$f":"D10*Pecuária!B99","v":0},{"$f":"'Evolução rebanho'!F24","v":"0"},{"$f":"F10*Pecuária!B99","v":0},{"$f":"'Evolução rebanho'!N24","v":"0"},{"$f":"H10*Pecuária!B99","v":0},{"$f":"'Evolução rebanho'!F38","v":"0"},{"$f":"J10*Pecuária!$B$99","v":0},{"$f":"'Evolução rebanho'!N38","v":"0"},{"$f":"L10*Pecuária!$B$99","v":0}]
["Garrotas ",{"$f":"'Evolução rebanho'!F11","v":"0"},{"$f":"B11*Pecuária!B100","v":0},{"$f":"'Evolução rebanho'!N11","v":"0"},{"$f":"D11*Pecuária!B100","v":0},{"$f":"'Evolução rebanho'!F25","v":"0"},{"$f":"F11*Pecuária!B100","v":0},{"$f":"'Evolução rebanho'!N25","v":"0"},{"$f":"H11*Pecuária!B100","v":0},{"$f":"'Evolução rebanho'!F39","v":"0"},{"$f":"J11*Pecuária!$B$100","v":0},{"$f":"'Evolução rebanho'!N39","v":"0"},{"$f":"L11*Pecuária!$B$100","v":0}]
["Bezerros ",{"$f":"'Evolução rebanho'!F12","v":0},{"$f":"B12*Pecuária!B101","v":0},{"$f":"'Evolução rebanho'!N12","v":"0"},{"$f":"D12*Pecuária!B101","v":0},{"$f":"'Evolução rebanho'!F26","v":"0"},{"$f":"F12*Pecuária!B101","v":0},{"$f":"'Evolução rebanho'!N26","v":"0"},{"$f":"H12*Pecuária!B101","v":0},{"$f":"'Evolução rebanho'!F40","v":"0"},{"$f":"J12*Pecuária!$B$101","v":0},{"$f":"'Evolução rebanho'!N40","v":"0"},{"$f":"L12*Pecuária!$B$101","v":0}]
["Bezerras ",{"$f":"'Evolução rebanho'!F13","v":"0"},{"$f":"B13*Pecuária!B102","v":0},{"$f":"'Evolução rebanho'!N13","v":"0"},{"$f":"D13*Pecuária!B102","v":0},{"$f":"'Evolução rebanho'!F27","v":"0"},{"$f":"F13*Pecuária!B102","v":0},{"$f":"'Evolução rebanho'!N27","v":"0"},{"$f":"H13*Pecuária!B102","v":0},{"$f":"'Evolução rebanho'!F41","v":"0"},{"$f":"J13*Pecuária!$B$102","v":0},{"$f":"'Evolução rebanho'!N41","v":"0"},{"$f":"L13*Pecuária!$B$102","v":0}]
["Leite (l)",{"$f":"IF(Pecuária!$C$89=\"Leite\",('Evolução rebanho'!$B$6+'Evolução rebanho'!$C$6)*Pecuária!C43*Pecuária!C54*Pecuária!C55*100%,\"0\")","v":"0"},{"$f":"B14*Pecuária!B103","v":0},{"$f":"IF(Pecuária!$C$89=\"Leite\",('Evolução rebanho'!J6+'Evolução rebanho'!K6)*Pecuária!C43*Pecuária!C54*Pecuária!C55*100%,0)","v":0},{"$f":"D14*Pecuária!B103","v":0},{"$f":"IF(Pecuária!$C$89=\"Leite\",('Evolução rebanho'!B20+'Evolução rebanho'!C20)*Pecuária!C43*Pecuária!C54*Pecuária!C55*100%,0)","v":0},{"$f":"F14*Pecuária!B103","v":0},{"$f":"IF(Pecuária!$C$89=\"Leite\",('Evolução rebanho'!J20+'Evolução rebanho'!K20)*Pecuária!C43*Pecuária!C54*Pecuária!C55*100%,0)","v":0},{"$f":"H14*Pecuária!B103","v":0},{"$f":"IF(Pecuária!$C$89=\"Leite\",('Evolução rebanho'!B34+'Evolução rebanho'!C34)*Pecuária!C43*Pecuária!C54*Pecuária!C55*100%,0)","v":0},{"$f":"J14*Pecuária!$B$103","v":0},{"$f":"IF(Pecuária!$C$89=\"Leite\",('Evolução rebanho'!J34+'Evolução rebanho'!K34)*Pecuária!C43*Pecuária!C54*Pecuária!C55*100%,0)","v":0},{"$f":"L14*Pecuária!$B$103","v":0}]
["Queijo (kg)",{"$f":"IF(Pecuária!$C$89=\"queijo\",IFERROR(('Evolução rebanho'!$B$6+'Evolução rebanho'!$C$6)*Pecuária!$C$43*Pecuária!$C$54*Pecuária!$C$55*100%/Pecuária!C56,0),0)","v":0},{"$f":"B15*Pecuária!B104","v":0},{"$f":"IF(Pecuária!$C$89=\"queijo\",IFERROR(('Evolução rebanho'!$J$6+'Evolução rebanho'!$K$6)*Pecuária!$C$43*Pecuária!$C$54*Pecuária!$C$55*100%/Pecuária!C56,0),0)","v":0},{"$f":"D15*Pecuária!B104","v":0},{"$f":"IF(Pecuária!$C$89=\"queijo\",IFERROR(('Evolução rebanho'!$B$20+'Evolução rebanho'!$C$20)*Pecuária!$C$43*Pecuária!$C$54*Pecuária!$C$55*100%/Pecuária!C56,0),0)","v":0},{"$f":"F15*Pecuária!B104","v":0},{"$f":"IF(Pecuária!$C$89=\"queijo\",IFERROR(('Evolução rebanho'!J20+'Evolução rebanho'!K20)*Pecuária!$C$43*Pecuária!$C$54*Pecuária!$C$55*100%/Pecuária!C56,0),0)","v":0},{"$f":"H15*Pecuária!B104","v":0},{"$f":"IF(Pecuária!$C$89=\"queijo\",IFERROR(('Evolução rebanho'!B34+'Evolução rebanho'!C34)*Pecuária!$C$43*Pecuária!$C$54*Pecuária!$C$55*100%/Pecuária!C56,0),0)","v":0},{"$f":"J15*Pecuária!$B$104","v":0},{"$f":"IF(Pecuária!$C$89=\"queijo\",IFERROR(('Evolução rebanho'!J34+'Evolução rebanho'!K34)*Pecuária!$C$43*Pecuária!$C$54*Pecuária!$C$55*100%/Pecuária!C56,0),0)","v":0},{"$f":"L15*Pecuária!$B$104","v":0}]
["Manteiga (kg)",{"$f":"IF(Pecuária!$C$89=\"manteiga\",IFERROR(('Evolução rebanho'!$B$6+'Evolução rebanho'!$C$6)*Pecuária!$C$43*Pecuária!$C$54*Pecuária!$C$55*100%/Pecuária!C57,0),0)","v":0},{"$f":"B16*Pecuária!B105","v":0},{"$f":"IF(Pecuária!$C$89=\"manteiga\",IFERROR(('Evolução rebanho'!$J$6+'Evolução rebanho'!$K$6)*Pecuária!$C$43*Pecuária!$C$54*Pecuária!$C$55*100%/Pecuária!C57,0),0)","v":0},{"$f":"D16*Pecuária!B105","v":0},{"$f":"IF(Pecuária!$C$89=\"manteiga\",IFERROR(('Evolução rebanho'!$B$20+'Evolução rebanho'!$C$20)*Pecuária!$C$43*Pecuária!$C$54*Pecuária!$C$55*100%/Pecuária!C57,0),0)","v":0},{"$f":"F16*Pecuária!B105","v":0},{"$f":"IF(Pecuária!$C$89=\"manteiga\",IFERROR(('Evolução rebanho'!J20+'Evolução rebanho'!K20)*Pecuária!$C$43*Pecuária!$C$54*Pecuária!$C$55*100%/Pecuária!C57,0),0)","v":0},{"$f":"H16*Pecuária!B105","v":0},{"$f":"IF(Pecuária!$C$89=\"manteiga\",IFERROR(('Evolução rebanho'!B34+'Evolução rebanho'!C34)*Pecuária!$C$43*Pecuária!$C$54*Pecuária!$C$55*100%/Pecuária!C57,0),0)","v":0},{"$f":"J16*Pecuária!$B$105","v":0},{"$f":"IF(Pecuária!$C$89=\"manteiga\",IFERROR(('Evolução rebanho'!J34+'Evolução rebanho'!K34)*Pecuária!$C$43*Pecuária!$C$54*Pecuária!$C$55*100%/Pecuária!C57,0),0)","v":0},{"$f":"L16*Pecuária!$B$105","v":0}]
["Total",{"$f":"SUM(B5:B16)","v":0},0,0,{"$f":"SUM(E5:E16)","v":0},0,{"$f":"SUM(G5:G16)","v":0},0,{"$f":"SUM(I5:I16)","v":0},0,0,0,{"$f":"SUM(M5:M16)","v":0}]
[]
["Produtos Comercializados","Produção"]
[null,"Ano 7",null,"Ano 8",null,"Ano 9",null,"Ano 10",null,"Ano 11",null,"Ano 12"]
[null,"Qtd","Valor","Qtd","Valor","Qtd","Valor","Qtd","Valor","Qtd","Valor","Qtd","Valor"]
["Touro descartado",{"$f":"'Evolução rebanho'!F47","v":0},{"$f":"B22*Pecuária!$B$94","v":0},{"$f":"'Evolução rebanho'!N47","v":0},{"$f":"D22*Pecuária!$B$94","v":0},{"$f":"'Evolução rebanho'!F61","v":0},{"$f":"F22*Pecuária!$B$94","v":0},{"$f":"'Evolução rebanho'!N61","v":0},{"$f":"H22*Pecuária!$B$94","v":0},{"$f":"'Evolução rebanho'!F74","v":0},{"$f":"J22*Pecuária!$B$94","v":0},{"$f":"'Evolução rebanho'!N74","v":0},{"$f":"L22*Pecuária!$B$94","v":0}]
["Matriz descartada",{"$f":"'Evolução rebanho'!F48","v":0},{"$f":"B23*Pecuária!$B$95","v":0},{"$f":"'Evolução rebanho'!N48","v":0},{"$f":"D23*Pecuária!$B$95","v":0},{"$f":"'Evolução rebanho'!F62","v":0},{"$f":"F23*Pecuária!$B$95","v":0},{"$f":"'Evolução rebanho'!N62","v":0},{"$f":"H23*Pecuária!$B$95","v":0},{"$f":"'Evolução rebanho'!F75","v":0},{"$f":"J23*Pecuária!$B$95","v":0},{"$f":"'Evolução rebanho'!N75","v":0},{"$f":"L23*Pecuária!$B$95","v":0}]
["Boi Gordo p/ abate",{"$f":"'Evolução rebanho'!F49","v":"0"},{"$f":"B24*Pecuária!$B$96","v":0},{"$f":"'Evolução rebanho'!N49","v":"0"},{"$f":"D24*Pecuária!$B$96","v":0},{"$f":"'Evolução rebanho'!F63","v":"0"},{"$f":"F24*Pecuária!$B$96","v":0},{"$f":"'Evolução rebanho'!N63","v":"0"},{"$f":"H24*Pecuária!$B$96","v":0},{"$f":"'Evolução rebanho'!F76","v":"0"},{"$f":"J24*Pecuária!$B$96","v":0},{"$f":"'Evolução rebanho'!N76","v":"0"},{"$f":"L24*Pecuária!$B$96","v":0}]
["Novilho Gordo",{"$f":"'Evolução rebanho'!F50","v":"0"},{"$f":"B25*Pecuária!$B$97","v":0},{"$f":"'Evolução rebanho'!N50","v":"0"},{"$f":"D25*Pecuária!$B$97","v":0},{"$f":"'Evolução rebanho'!F64","v":"0"},{"$f":"F25*Pecuária!$B$97","v":0},{"$f":"'Evolução rebanho'!N64","v":"0"},{"$f":"H25*Pecuária!$B$97","v":0},{"$f":"'Evolução rebanho'!F77","v":"0"},{"$f":"J25*Pecuária!$B$97","v":0},{"$f":"'Evolução rebanho'!N77","v":"0"},{"$f":"L25*Pecuária!$B$97","v":0}]
["Fêmea Excedente",{"$f":"'Evolução rebanho'!F51","v":"0"},{"$f":"B26*Pecuária!$B$98","v":0},{"$f":"'Evolução rebanho'!N51","v":"0"},{"$f":"D26*Pecuária!$B$98","v":0},{"$f":"'Evolução rebanho'!F65","v":"0"},{"$f":"F26*Pecuária!$B$98","v":0},{"$f":"'Evolução rebanho'!N65","v":"0"},{"$f":"H26*Pecuária!$B$98","v":0},{"$f":"'Evolução rebanho'!F78","v":"0"},{"$f":"J26*Pecuária!$B$98","v":0},{"$f":"'Evolução rebanho'!N78","v":"0"},{"$f":"L26*Pecuária!$B$98","v":0}]
["Garrotes ",{"$f":"'Evolução rebanho'!F52","v":"0"},{"$f":"B27*Pecuária!$B$99","v":0},{"$f":"'Evolução rebanho'!N52","v":"0"},{"$f":"D27*Pecuária!$B$99","v":0},{"$f":"'Evolução rebanho'!F66","v":"0"},{"$f":"F27*Pecuária!$B$99","v":0},{"$f":"'Evolução rebanho'!N66","v":"0"},{"$f":"H27*Pecuária!$B$99","v":0},{"$f":"'Evolução rebanho'!F79","v":"0"},{"$f":"J27*Pecuária!$B$99","v":0},{"$f":"'Evolução rebanho'!N79","v":"0"},{"$f":"L27*Pecuária!$B$99","v":0}]
["Garrotas ",{"$f":"'Evolução rebanho'!F53","v":"0"},{"$f":"B28*Pecuária!$B$100","v":0},{"$f":"'Evolução rebanho'!N53","v":"0"},{"$f":"D28*Pecuária!$B$100","v":0},{"$f":"'Evolução rebanho'!F67","v":"0"},{"$f":"F28*Pecuária!$B$100","v":0},{"$f":"'Evolução rebanho'!N67","v":"0"},{"$f":"H28*Pecuária!$B$100","v":0},{"$f":"'Evolução rebanho'!F80","v":"0"},{"$f":"J28*Pecuária!$B$100","v":0},{"$f":"'Evolução rebanho'!N80","v":"0"},{"$f":"L28*Pecuária!$B$100","v":0}]
["Bezerros ",{"$f":"'Evolução rebanho'!F54","v":"0"},{"$f":"B29*Pecuária!$B$101","v":0},{"$f":"'Evolução rebanho'!N54","v":"0"},{"$f":"D29*Pecuária!$B$101","v":0},{"$f":"'Evolução rebanho'!F68","v":"0"},{"$f":"F29*Pecuária!$B$101","v":0},{"$f":"'Evolução rebanho'!N68","v":"0"},{"$f":"H29*Pecuária!$B$101","v":0},{"$f":"'Evolução rebanho'!F81","v":"0"},{"$f":"J29*Pecuária!$B$101","v":0},{"$f":"'Evolução rebanho'!N81","v":"0"},{"$f":"L29*Pecuária!$B$101","v":0}]
["Bezerras ",{"$f":"'Evolução rebanho'!F55","v":"0"},{"$f":"B30*Pecuária!$B$102","v":0},{"$f":"'Evolução rebanho'!N55","v":"0"},{"$f":"D30*Pecuária!$B$102","v":0},{"$f":"'Evolução rebanho'!F69","v":"0"},{"$f":"F30*Pecuária!$B$102","v":0},{"$f":"'Evolução rebanho'!N69","v":"0"},{"$f":"H30*Pecuária!$B$102","v":0},{"$f":"'Evolução rebanho'!F82","v":"0"},{"$f":"J30*Pecuária!$B$102","v":0},{"$f":"'Evolução rebanho'!N82","v":"0"},{"$f":"L30*Pecuária!$B$102","v":0}]
["Leite (l)",{"$f":"IF(Pecuária!$C$89=\"Leite\",('Evolução rebanho'!B48+'Evolução rebanho'!C48)*Pecuária!C43*Pecuária!C54*Pecuária!C55*100%,0)","v":0},{"$f":"B31*Pecuária!$B$103","v":0},{"$f":"IF(Pecuária!$C$89=\"Leite\",('Evolução rebanho'!J48+'Evolução rebanho'!K48)*Pecuária!C43*Pecuária!C54*Pecuária!C55*100%,0)","v":0},{"$f":"D31*Pecuária!$B$103","v":0},{"$f":"IF(Pecuária!$C$89=\"Leite\",('Evolução rebanho'!B62+'Evolução rebanho'!C62)*Pecuária!C43*Pecuária!C54*Pecuária!C55*100%,0)","v":0},{"$f":"F31*Pecuária!$B$103","v":0},{"$f":"IF(Pecuária!$C$89=\"Leite\",('Evolução rebanho'!J62+'Evolução rebanho'!K62)*Pecuária!C43*Pecuária!C54*Pecuária!C55*100%,0)","v":0},{"$f":"H31*Pecuária!$B$103","v":0},{"$f":"IF(Pecuária!$C$89=\"Leite\",('Evolução rebanho'!B75+'Evolução rebanho'!C75)*Pecuária!C43*Pecuária!C54*Pecuária!C55*100%,0)","v":0},{"$f":"J31*Pecuária!$B$103","v":0},{"$f":"IF(Pecuária!$C$89=\"Leite\",('Evolução rebanho'!J75+'Evolução rebanho'!K75)*Pecuária!C43*Pecuária!C54*Pecuária!C55*100%,0)","v":0},{"$f":"L31*Pecuária!$B$103","v":0}]
["Queijo (kg)",{"$f":"IF(Pecuária!$C$89=\"queijo\",IFERROR(('Evolução rebanho'!B48+'Evolução rebanho'!C48)*Pecuária!$C$43*Pecuária!$C$54*Pecuária!$C$55*100%/Pecuária!C56,0),0)","v":0},{"$f":"B32*Pecuária!$B$104","v":0},{"$f":"IF(Pecuária!$C$89=\"queijo\",IFERROR(('Evolução rebanho'!J48+'Evolução rebanho'!K48)*Pecuária!$C$43*Pecuária!$C$54*Pecuária!$C$55*100%/Pecuária!C56,0),0)","v":0},{"$f":"D32*Pecuária!$B$104","v":0},{"$f":"IF(Pecuária!$C$89=\"queijo\",IFERROR(('Evolução rebanho'!B62+'Evolução rebanho'!C62)*Pecuária!$C$43*Pecuária!$C$54*Pecuária!$C$55*100%/Pecuária!C56,0),0)","v":0},{"$f":"F32*Pecuária!$B$104","v":0},{"$f":"IF(Pecuária!$C$89=\"queijo\",IFERROR(('Evolução rebanho'!J62+'Evolução rebanho'!K62)*Pecuária!$C$43*Pecuária!$C$54*Pecuária!$C$55*100%/Pecuária!C56,0),0)","v":0},{"$f":"H32*Pecuária!$B$104","v":0},{"$f":"IF(Pecuária!$C$89=\"queijo\",IFERROR(('Evolução rebanho'!B75+'Evolução rebanho'!C75)*Pecuária!$C$43*Pecuária!$C$54*Pecuária!$C$55*100%/Pecuária!C56,0),0)","v":0},{"$f":"J32*Pecuária!$B$104","v":0},{"$f":"IF(Pecuária!$C$89=\"queijo\",IFERROR(('Evolução rebanho'!J75+'Evolução rebanho'!K75)*Pecuária!$C$43*Pecuária!$C$54*Pecuária!$C$55*100%/Pecuária!C56,0),0)","v":0},{"$f":"L32*Pecuária!$B$104","v":0}]
["Manteiga (kg)",{"$f":"IF(Pecuária!$C$89=\"manteiga\",IFERROR(('Evolução rebanho'!B48+'Evolução rebanho'!C48)*Pecuária!$C$43*Pecuária!$C$54*Pecuária!$C$55*100%/Pecuária!C57,0),0)","v":0},{"$f":"B33*Pecuária!$B$105","v":0},{"$f":"IF(Pecuária!$C$89=\"manteiga\",IFERROR(('Evolução rebanho'!J48+'Evolução rebanho'!K48)*Pecuária!$C$43*Pecuária!$C$54*Pecuária!$C$55*100%/Pecuária!C57,0),0)","v":0},{"$f":"D33*Pecuária!$B$105","v":0},{"$f":"IF(Pecuária!$C$89=\"manteiga\",IFERROR(('Evolução rebanho'!B62+'Evolução rebanho'!C62)*Pecuária!$C$43*Pecuária!$C$54*Pecuária!$C$55*100%/Pecuária!C57,0),0)","v":0},{"$f":"F33*Pecuária!$B$105","v":0},{"$f":"IF(Pecuária!$C$89=\"manteiga\",IFERROR(('Evolução rebanho'!J62+'Evolução rebanho'!K62)*Pecuária!$C$43*Pecuária!$C$54*Pecuária!$C$55*100%/Pecuária!C57,0),0)","v":0},{"$f":"H33*Pecuária!$B$105","v":0},{"$f":"IF(Pecuária!$C$89=\"manteiga\",IFERROR(('Evolução rebanho'!B75+'Evolução rebanho'!C75)*Pecuária!$C$43*Pecuária!$C$54*Pecuária!$C$55*100%/Pecuária!C57,0),0)","v":0},{"$f":"J33*Pecuária!$B$105","v":0},{"$f":"IF(Pecuária!$C$89=\"manteiga\",IFERROR(('Evolução rebanho'!J75+'Evolução rebanho'!K75)*Pecuária!$C$43*Pecuária!$C$54*Pecuária!$C$55*100%/Pecuária!C57,0),0)","v":0},{"$f":"L33*Pecuária!$B$105","v":0}]
["Total",{"$f":"SUM(B22:B33)","v":0},0,0,0,0,0,0,0,0,0,0,0]
[]
["Receitas - Rebanho B"]
["Produtos Comercializados","Produção"]
[null,"Ano 1",null,"Ano 2",null,"Ano 3",null,"Ano 4",null,"Ano 5",null,"Ano 6"]
[null,"Qtd","Valor","Qtd","Valor","Qtd","Valor","Qtd","Valor","Qtd","Valor","Qtd","Valor"]
["Touro descartado",{"$f":"'Evolução rebanho'!F89","v":0},{"$f":"B40*Pecuária!C94","v":0},{"$f":"'Evolução rebanho'!N89","v":0},{"$f":"D40*Pecuária!$C$94","v":0},{"$f":"'Evolução rebanho'!F103","v":0},{"$f":"F40*Pecuária!$C$94","v":0},{"$f":"'Evolução rebanho'!N103","v":0},{"$f":"H40*Pecuária!$C$94","v":0},{"$f":"'Evolução rebanho'!F117","v":0},{"$f":"J40*Pecuária!$C$94","v":0},{"$f":"'Evolução rebanho'!N117","v":0},{"$f":"L40*Pecuária!$C$94","v":0}]
["Matriz descartada",{"$f":"'Evolução rebanho'!F90","v":0},{"$f":"B41*Pecuária!C95","v":0},{"$f":"'Evolução rebanho'!N90","v":0},{"$f":"D41*Pecuária!$C$95","v":0},{"$f":"'Evolução rebanho'!F104","v":0},{"$f":"F41*Pecuária!$C$95","v":0},{"$f":"'Evolução rebanho'!N104","v":0},{"$f":"H41*Pecuária!$C$95","v":0},{"$f":"'Evolução rebanho'!F118","v":0},{"$f":"J41*Pecuária!$C$95","v":0},{"$f":"'Evolução rebanho'!N118","v":0},{"$f":"L41*Pecuária!$C$95","v":0}]
["Boi Gordo p/ abate",{"$f":"'Evolução rebanho'!F91","v":"0"},{"$f":"B42*Pecuária!C96","v":0},{"$f":"'Evolução rebanho'!N91","v":"0"},{"$f":"D42*Pecuária!$C$96","v":0},{"$f":"'Evolução rebanho'!F105","v":"0"},{"$f":"F42*Pecuária!$C$96","v":0},{"$f":"'Evolução rebanho'!N105","v":"0"},{"$f":"H42*Pecuária!$C$96","v":0},{"$f":"'Evolução rebanho'!F119","v":"0"},{"$f":"J42*Pecuária!$C$96","v":0},{"$f":"'Evolução rebanho'!N119","v":"0"},{"$f":"L42*Pecuária!$C$96","v":0}]
["Novilho Gordo",{"$f":"'Evolução rebanho'!F92","v":"0"},{"$f":"B43*Pecuária!C97","v":0},{"$f":"'Evolução rebanho'!N92","v":"0"},{"$f":"D43*Pecuária!$C$97","v":0},{"$f":"'Evolução rebanho'!F106","v":"0"},{"$f":"F43*Pecuária!$C$97","v":0},{"$f":"'Evolução rebanho'!N106","v":"0"},{"$f":"H43*Pecuária!$C$97","v":0},{"$f":"'Evolução rebanho'!F120","v":"0"},{"$f":"J43*Pecuária!$C$97","v":0},{"$f":"'Evolução rebanho'!N120","v":"0"},{"$f":"L43*Pecuária!$C$97","v":0}]
["Fêmea Excedente",{"$f":"'Evolução rebanho'!F93","v":"0"},{"$f":"B44*Pecuária!C98","v":0},{"$f":"'Evolução rebanho'!N93","v":"0"},{"$f":"D44*Pecuária!$C$98","v":0},{"$f":"'Evolução rebanho'!F107","v":"0"},{"$f":"F44*Pecuária!$C$98","v":0},{"$f":"'Evolução rebanho'!N107","v":"0"},{"$f":"H44*Pecuária!$C$98","v":0},{"$f":"'Evolução rebanho'!F121","v":"0"},{"$f":"J44*Pecuária!$C$98","v":0},{"$f":"'Evolução rebanho'!N121","v":"0"},{"$f":"L44*Pecuária!$C$98","v":0}]
["Garrotes ",{"$f":"'Evolução rebanho'!F94","v":"0"},{"$f":"B45*Pecuária!C99","v":0},{"$f":"'Evolução rebanho'!N94","v":"0"},{"$f":"D45*Pecuária!$C$99","v":0},{"$f":"'Evolução rebanho'!F108","v":"0"},{"$f":"F45*Pecuária!$C$99","v":0},{"$f":"'Evolução rebanho'!N108","v":"0"},{"$f":"H45*Pecuária!$C$99","v":0},{"$f":"'Evolução rebanho'!F122","v":"0"},{"$f":"J45*Pecuária!$C$99","v":0},{"$f":"'Evolução rebanho'!N122","v":"0"},{"$f":"L45*Pecuária!$C$99","v":0}]
["Garrotas ",{"$f":"'Evolução rebanho'!F95","v":"0"},{"$f":"B46*Pecuária!C100","v":0},{"$f":"'Evolução rebanho'!N95","v":"0"},{"$f":"D46*Pecuária!$C$100","v":0},{"$f":"'Evolução rebanho'!F109","v":"0"},{"$f":"F46*Pecuária!$C$100","v":0},{"$f":"'Evolução rebanho'!N109","v":"0"},{"$f":"H46*Pecuária!$C$100","v":0},{"$f":"'Evolução rebanho'!F123","v":"0"},{"$f":"J46*Pecuária!$C$100","v":0},{"$f":"'Evolução rebanho'!N123","v":"0"},{"$f":"L46*Pecuária!$C$100","v":0}]
["Bezerros ",{"$f":"'Evolução rebanho'!F96","v":"0"},{"$f":"B47*Pecuária!C101","v":0},{"$f":"'Evolução rebanho'!N96","v":"0"},{"$f":"D47*Pecuária!$C$101","v":0},{"$f":"'Evolução rebanho'!F110","v":"0"},{"$f":"F47*Pecuária!$C$101","v":0},{"$f":"'Evolução rebanho'!N110","v":"0"},{"$f":"H47*Pecuária!$C$101","v":0},{"$f":"'Evolução rebanho'!F124","v":"0"},{"$f":"J47*Pecuária!$C$101","v":0},{"$f":"'Evolução rebanho'!N124","v":"0"},{"$f":"L47*Pecuária!$C$101","v":0}]
["Bezerras ",{"$f":"'Evolução rebanho'!F97","v":"0"},{"$f":"B48*Pecuária!C102","v":0},{"$f":"'Evolução rebanho'!N97","v":"0"},{"$f":"D48*Pecuária!$C$102","v":0},{"$f":"'Evolução rebanho'!F111","v":"0"},{"$f":"F48*Pecuária!$C$102","v":0},{"$f":"'Evolução rebanho'!N111","v":"0"},{"$f":"H48*Pecuária!$C$102","v":0},{"$f":"'Evolução rebanho'!F125","v":"0"},{"$f":"J48*Pecuária!$C$102","v":0},{"$f":"'Evolução rebanho'!N125","v":"0"},{"$f":"L48*Pecuária!$C$102","v":0}]
["Leite (l)",{"$f":"IF(Pecuária!$D$89=\"Leite\",('Evolução rebanho'!B90+'Evolução rebanho'!C90)*Pecuária!E43*Pecuária!E54*Pecuária!E55*100%,0)","v":0},{"$f":"B49*Pecuária!C103","v":0},{"$f":"IF(Pecuária!$D$89=\"Leite\",('Evolução rebanho'!J90+'Evolução rebanho'!K90)*Pecuária!E43*Pecuária!E54*Pecuária!E55*100%,0)","v":0},{"$f":"D49*Pecuária!$C$103","v":0},{"$f":"IF(Pecuária!$D$89=\"Leite\",('Evolução rebanho'!B104+'Evolução rebanho'!C104)*Pecuária!E43*Pecuária!E54*Pecuária!E55*100%,0)","v":0},{"$f":"F49*Pecuária!$C$103","v":0},{"$f":"IF(Pecuária!$D$89=\"Leite\",('Evolução rebanho'!J104+'Evolução rebanho'!K104)*Pecuária!E43*Pecuária!E54*Pecuária!E55*100%,0)","v":0},{"$f":"H49*Pecuária!$C$103","v":0},{"$f":"IF(Pecuária!$D$89=\"Leite\",('Evolução rebanho'!B118+'Evolução rebanho'!C118)*Pecuária!E43*Pecuária!E54*Pecuária!E55*100%,0)","v":0},{"$f":"J49*Pecuária!$C$103","v":0},{"$f":"IF(Pecuária!$D$89=\"Leite\",('Evolução rebanho'!J118+'Evolução rebanho'!K118)*Pecuária!E43*Pecuária!E54*Pecuária!E55*100%,0)","v":0},{"$f":"L49*Pecuária!$C$103","v":0}]
["Queijo (kg)",{"$f":"IF(Pecuária!$D$89=\"queijo\",IFERROR(('Evolução rebanho'!B90+'Evolução rebanho'!C90)*Pecuária!E43*Pecuária!E54*Pecuária!E55*100%/Pecuária!E56,0),0)","v":0},{"$f":"B50*Pecuária!C104","v":0},{"$f":"IF(Pecuária!$D$89=\"queijo\",IFERROR(('Evolução rebanho'!J90+'Evolução rebanho'!K90)*Pecuária!E43*Pecuária!E54*Pecuária!E55*100%/Pecuária!E56,0),0)","v":0},{"$f":"D50*Pecuária!$C$104","v":0},{"$f":"IF(Pecuária!$D$89=\"queijo\",IFERROR(('Evolução rebanho'!B104+'Evolução rebanho'!C104)*Pecuária!E43*Pecuária!E54*Pecuária!E55*100%/Pecuária!E56,0),0)","v":0},{"$f":"F50*Pecuária!$C$104","v":0},{"$f":"IF(Pecuária!$D$89=\"queijo\",IFERROR(('Evolução rebanho'!J104+'Evolução rebanho'!K104)*Pecuária!E43*Pecuária!E54*Pecuária!E55*100%/Pecuária!E56,0),0)","v":0},{"$f":"H50*Pecuária!$C$104","v":0},{"$f":"IF(Pecuária!$D$89=\"queijo\",IFERROR(('Evolução rebanho'!B118+'Evolução rebanho'!C118)*Pecuária!E43*Pecuária!E54*Pecuária!E55*100%/Pecuária!E56,0),0)","v":0},{"$f":"J50*Pecuária!$C$104","v":0},{"$f":"IF(Pecuária!$D$89=\"queijo\",IFERROR(('Evolução rebanho'!J118+'Evolução rebanho'!K118)*Pecuária!E43*Pecuária!E54*Pecuária!E55*100%/Pecuária!E56,0),0)","v":0},{"$f":"L50*Pecuária!$C$104","v":0}]
["Manteiga (kg)",{"$f":"IF(Pecuária!$D$89=\"manteiga\",IFERROR(('Evolução rebanho'!B90+'Evolução rebanho'!C90)*Pecuária!E43*Pecuária!E54*Pecuária!E55*100%/Pecuária!E57,0),0)","v":0},{"$f":"B51*Pecuária!C105","v":0},{"$f":"IF(Pecuária!$D$89=\"manteiga\",IFERROR(('Evolução rebanho'!J90+'Evolução rebanho'!K90)*Pecuária!E43*Pecuária!E54*Pecuária!E55*100%/Pecuária!E57,0),0)","v":0},{"$f":"D51*Pecuária!$C$105","v":0},{"$f":"IF(Pecuária!$D$89=\"manteiga\",IFERROR(('Evolução rebanho'!B104+'Evolução rebanho'!C104)*Pecuária!E43*Pecuária!E54*Pecuária!E55*100%/Pecuária!E57,0),0)","v":0},{"$f":"F51*Pecuária!$C$105","v":0},{"$f":"IF(Pecuária!$D$89=\"manteiga\",IFERROR(('Evolução rebanho'!J104+'Evolução rebanho'!K104)*Pecuária!E43*Pecuária!E54*Pecuária!E55*100%/Pecuária!E57,0),0)","v":0},{"$f":"H51*Pecuária!$C$105","v":0},{"$f":"IF(Pecuária!$D$89=\"manteiga\",IFERROR(('Evolução rebanho'!B118+'Evolução rebanho'!C118)*Pecuária!E43*Pecuária!E54*Pecuária!E55*100%/Pecuária!E57,0),0)","v":0},{"$f":"J51*Pecuária!$C$105","v":0},{"$f":"IF(Pecuária!$D$89=\"manteiga\",IFERROR(('Evolução rebanho'!J118+'Evolução rebanho'!K118)*Pecuária!E43*Pecuária!E54*Pecuária!E55*100%/Pecuária!E57,0),0)","v":0},{"$f":"L51*Pecuária!$C$105","v":0}]
["Total",{"$f":"SUM(B40:B51)","v":0},0,0,0,0,0,0,0,0,0,0,0]
[]
["Produtos Comercializados","Produção"]
[null,"Ano 7",null,"Ano 8",null,"Ano 9",null,"Ano 10",null,"Ano 11",null,"Ano 12"]
[null,"Qtd","Valor","Qtd","Valor","Qtd","Valor","Qtd","Valor","Qtd","Valor","Qtd","Valor"]
["Touro descartado",{"$f":"'Evolução rebanho'!F131","v":0},{"$f":"B57*Pecuária!$C$94","v":0},{"$f":"'Evolução rebanho'!N131","v":0},{"$f":"D57*Pecuária!$C$94","v":0},{"$f":"'Evolução rebanho'!F145","v":0},{"$f":"F57*Pecuária!$C$94","v":0},{"$f":"'Evolução rebanho'!N145","v":0},{"$f":"H57*Pecuária!$C$94","v":0},{"$f":"'Evolução rebanho'!F159","v":0},{"$f":"J57*Pecuária!$C$94","v":0},{"$f":"'Evolução rebanho'!N159","v":0},{"$f":"L57*Pecuária!$C$94","v":0}]
["Matriz descartada",{"$f":"'Evolução rebanho'!F132","v":0},{"$f":"B58*Pecuária!$C$95","v":0},{"$f":"'Evolução rebanho'!N132","v":0},{"$f":"D58*Pecuária!$C$95","v":0},{"$f":"'Evolução rebanho'!F146","v":0},{"$f":"F58*Pecuária!$C$95","v":0},{"$f":"'Evolução rebanho'!N146","v":0},{"$f":"H58*Pecuária!$C$95","v":0},{"$f":"'Evolução rebanho'!F160","v":0},{"$f":"J58*Pecuária!$C$95","v":0},{"$f":"'Evolução rebanho'!N160","v":0},{"$f":"L58*Pecuária!$C$95","v":0}]
["Boi Gordo p/ abate",{"$f":"'Evolução rebanho'!F133","v":"0"},{"$f":"B59*Pecuária!$C$96","v":0},{"$f":"'Evolução rebanho'!N133","v":"0"},{"$f":"D59*Pecuária!$C$96","v":0},{"$f":"'Evolução rebanho'!F147","v":"0"},{"$f":"F59*Pecuária!$C$96","v":0},{"$f":"'Evolução rebanho'!N147","v":"0"},{"$f":"H59*Pecuária!$C$96","v":0},{"$f":"'Evolução rebanho'!F161","v":"0"},{"$f":"J59*Pecuária!$C$96","v":0},{"$f":"'Evolução rebanho'!N161","v":"0"},{"$f":"L59*Pecuária!$C$96","v":0}]
["Novilho Gordo",{"$f":"'Evolução rebanho'!F134","v":"0"},{"$f":"B60*Pecuária!$C$97","v":0},{"$f":"'Evolução rebanho'!N134","v":"0"},{"$f":"D60*Pecuária!$C$97","v":0},{"$f":"'Evolução rebanho'!F148","v":"0"},{"$f":"F60*Pecuária!$C$97","v":0},{"$f":"'Evolução rebanho'!N148","v":"0"},{"$f":"H60*Pecuária!$C$97","v":0},{"$f":"'Evolução rebanho'!F162","v":"0"},{"$f":"J60*Pecuária!$C$97","v":0},{"$f":"'Evolução rebanho'!N162","v":"0"},{"$f":"L60*Pecuária!$C$97","v":0}]
["Fêmea Excedente",{"$f":"'Evolução rebanho'!F135","v":"0"},{"$f":"B61*Pecuária!$C$98","v":0},{"$f":"'Evolução rebanho'!N135","v":"0"},{"$f":"D61*Pecuária!$C$98","v":0},{"$f":"'Evolução rebanho'!F149","v":"0"},{"$f":"F61*Pecuária!$C$98","v":0},{"$f":"'Evolução rebanho'!N149","v":"0"},{"$f":"H61*Pecuária!$C$98","v":0},{"$f":"'Evolução rebanho'!F163","v":"0"},{"$f":"J61*Pecuária!$C$98","v":0},{"$f":"'Evolução rebanho'!N163","v":"0"},{"$f":"L61*Pecuária!$C$98","v":0}]
["Garrotes ",{"$f":"'Evolução rebanho'!F136","v":"0"},{"$f":"B62*Pecuária!$C$99","v":0},{"$f":"'Evolução rebanho'!N136","v":"0"},{"$f":"D62*Pecuária!$C$99","v":0},{"$f":"'Evolução rebanho'!F150","v":"0"},{"$f":"F62*Pecuária!$C$99","v":0},{"$f":"'Evolução rebanho'!N150","v":"0"},{"$f":"H62*Pecuária!$C$99","v":0},{"$f":"'Evolução rebanho'!F164","v":"0"},{"$f":"J62*Pecuária!$C$99","v":0},{"$f":"'Evolução rebanho'!N164","v":"0"},{"$f":"L62*Pecuária!$C$99","v":0}]
["Garrotas ",{"$f":"'Evolução rebanho'!F137","v":"0"},{"$f":"B63*Pecuária!$C$100","v":0},{"$f":"'Evolução rebanho'!N137","v":"0"},{"$f":"D63*Pecuária!$C$100","v":0},{"$f":"'Evolução rebanho'!F151","v":"0"},{"$f":"F63*Pecuária!$C$100","v":0},{"$f":"'Evolução rebanho'!N151","v":"0"},{"$f":"H63*Pecuária!$C$100","v":0},{"$f":"'Evolução rebanho'!F165","v":"0"},{"$f":"J63*Pecuária!$C$100","v":0},{"$f":"'Evolução rebanho'!N165","v":"0"},{"$f":"L63*Pecuária!$C$100","v":0}]
["Bezerros ",{"$f":"'Evolução rebanho'!F138","v":"0"},{"$f":"B64*Pecuária!$C$101","v":0},{"$f":"'Evolução rebanho'!N138","v":"0"},{"$f":"D64*Pecuária!$C$101","v":0},{"$f":"'Evolução rebanho'!F152","v":"0"},{"$f":"F64*Pecuária!$C$101","v":0},{"$f":"'Evolução rebanho'!N152","v":"0"},{"$f":"H64*Pecuária!$C$101","v":0},{"$f":"'Evolução rebanho'!F166","v":"0"},{"$f":"J64*Pecuária!$C$101","v":0},{"$f":"'Evolução rebanho'!N166","v":"0"},{"$f":"L64*Pecuária!$C$101","v":0}]
["Bezerras ",{"$f":"'Evolução rebanho'!F139","v":"0"},{"$f":"B65*Pecuária!$C$102","v":0},{"$f":"'Evolução rebanho'!N139","v":"0"},{"$f":"D65*Pecuária!$C$102","v":0},{"$f":"'Evolução rebanho'!F153","v":"0"},{"$f":"F65*Pecuária!$C$102","v":0},{"$f":"'Evolução rebanho'!N153","v":"0"},{"$f":"H65*Pecuária!$C$102","v":0},{"$f":"'Evolução rebanho'!F167","v":"0"},{"$f":"J65*Pecuária!$C$102","v":0},{"$f":"'Evolução rebanho'!N167","v":"0"},{"$f":"L65*Pecuária!$C$102","v":0}]
["Leite (l)",{"$f":"IF(Pecuária!$D$89=\"Leite\",('Evolução rebanho'!B132+'Evolução rebanho'!C132)*Pecuária!E43*Pecuária!E54*Pecuária!E55*100%,0)","v":0},{"$f":"B66*Pecuária!$C$103","v":0},{"$f":"IF(Pecuária!$D$89=\"Leite\",('Evolução rebanho'!J132+'Evolução rebanho'!K132)*Pecuária!E43*Pecuária!E54*Pecuária!E55*100%,0)","v":0},{"$f":"D66*Pecuária!$C$103","v":0},{"$f":"IF(Pecuária!$D$89=\"Leite\",('Evolução rebanho'!B146+'Evolução rebanho'!C146)*Pecuária!E43*Pecuária!E54*Pecuária!E55*100%,0)","v":0},{"$f":"F66*Pecuária!$C$103","v":0},{"$f":"IF(Pecuária!$D$89=\"Leite\",('Evolução rebanho'!J146+'Evolução rebanho'!K146)*Pecuária!E43*Pecuária!E54*Pecuária!E55*100%,0)","v":0},{"$f":"H66*Pecuária!$C$103","v":0},{"$f":"IF(Pecuária!$D$89=\"Leite\",('Evolução rebanho'!B160+'Evolução rebanho'!C160)*Pecuária!E43*Pecuária!E54*Pecuária!E55*100%,0)","v":0},{"$f":"J66*Pecuária!$C$103","v":0},{"$f":"IF(Pecuária!$D$89=\"Leite\",('Evolução rebanho'!J160+'Evolução rebanho'!K160)*Pecuária!E43*Pecuária!E54*Pecuária!E55*100%,0)","v":0},{"$f":"L66*Pecuária!$C$103","v":0}]
["Queijo (kg)",{"$f":"IF(Pecuária!$D$89=\"queijo\",IFERROR(('Evolução rebanho'!B132+'Evolução rebanho'!C132)*Pecuária!E43*Pecuária!E54*Pecuária!E55*100%/Pecuária!E56,0),0)","v":0},{"$f":"B67*Pecuária!$C$104","v":0},{"$f":"IF(Pecuária!$D$89=\"queijo\",IFERROR(('Evolução rebanho'!J132+'Evolução rebanho'!K132)*Pecuária!E43*Pecuária!E54*Pecuária!E55*100%/Pecuária!E56,0),0)","v":0},{"$f":"D67*Pecuária!$C$104","v":0},{"$f":"IF(Pecuária!$D$89=\"QUEIJO\",IFERROR(('Evolução rebanho'!B146+'Evolução rebanho'!C146)*Pecuária!E43*Pecuária!E54*Pecuária!E55*100%/Pecuária!E56,0),0)","v":0},{"$f":"F67*Pecuária!$C$104","v":0},{"$f":"IF(Pecuária!$D$89=\"queijo\",IFERROR(('Evolução rebanho'!J146+'Evolução rebanho'!K146)*Pecuária!E43*Pecuária!E54*Pecuária!E55*100%/Pecuária!E56,0),0)","v":0},{"$f":"H67*Pecuária!$C$104","v":0},{"$f":"IF(Pecuária!$D$89=\"queijo\",IFERROR(('Evolução rebanho'!B160+'Evolução rebanho'!C160)*Pecuária!E43*Pecuária!E54*Pecuária!E55*100%/Pecuária!E56,0),0)","v":0},{"$f":"J67*Pecuária!$C$104","v":0},{"$f":"IF(Pecuária!$D$89=\"queijo\",IFERROR(('Evolução rebanho'!J160+'Evolução rebanho'!K160)*Pecuária!E43*Pecuária!E54*Pecuária!E55*100%/Pecuária!E56,0),0)","v":0},{"$f":"L67*Pecuária!$C$104","v":0}]
["Manteiga (kg)",{"$f":"IF(Pecuária!$D$89=\"manteiga\",IFERROR(('Evolução rebanho'!B132+'Evolução rebanho'!C132)*Pecuária!E43*Pecuária!E54*Pecuária!E55*100%/Pecuária!E57,0),0)","v":0},{"$f":"B68*Pecuária!$C$105","v":0},{"$f":"IF(Pecuária!$D$89=\"manteiga\",IFERROR(('Evolução rebanho'!J132+'Evolução rebanho'!K132)*Pecuária!E43*Pecuária!E54*Pecuária!E55*100%/Pecuária!E57,0),0)","v":0},{"$f":"D68*Pecuária!$C$105","v":0},{"$f":"IF(Pecuária!$D$89=\"manteiga\",IFERROR(('Evolução rebanho'!B146+'Evolução rebanho'!C146)*Pecuária!E43*Pecuária!E54*Pecuária!E55*100%/Pecuária!E57,0),0)","v":0},{"$f":"F68*Pecuária!$C$105","v":0},{"$f":"IF(Pecuária!$D$89=\"manteiga\",IFERROR(('Evolução rebanho'!J146+'Evolução rebanho'!K146)*Pecuária!E43*Pecuária!E54*Pecuária!E55*100%/Pecuária!E57,0),0)","v":0},{"$f":"H68*Pecuária!$C$105","v":0},{"$f":"IF(Pecuária!$D$89=\"manteiga\",IFERROR(('Evolução rebanho'!B160+'Evolução rebanho'!C160)*Pecuária!E43*Pecuária!E54*Pecuária!E55*100%/Pecuária!E57,0),0)","v":0},{"$f":"J68*Pecuária!$C$105","v":0},{"$f":"IF(Pecuária!$D$89=\"manteiga\",IFERROR(('Evolução rebanho'!J160+'Evolução rebanho'!K160)*Pecuária!E43*Pecuária!E54*Pecuária!E55*100%/Pecuária!E57,0),0)","v":0},{"$f":"L68*Pecuária!$C$105","v":0}]
["Total",{"$f":"SUM(B57:B68)","v":0},0,0,0,0,0,0,0,0,0,0,0]
[]
["Especificação","Custo Operacional - Despesas não Financiadas (Rebanho A e B)"]
[null,"Ano 1","Ano 2","Ano 3","Ano 4","Ano 5","Ano 6","Ano 7","Ano 8","Ano 9","Ano 10","Ano 11","Ano 12"]
[null,"Valor Total","Valor Total","Valor Total","Valor Total","Valor Total","Valor Total","Valor Total","Valor Total","Valor Total","Valor Total","Valor Total","Valor Total"]
[{"$f":"IF(Pecuária!A111=\"\",\"\",Pecuária!A111)","v":"Sal mineral"},{"$f":"IF(Pecuária!$E$111=1,((Pecuária!C111*365)*Pecuária!D111)*('Evolução rebanho'!$H$14+'Evolução rebanho'!$H$98),0)","v":0},{"$f":"IFERROR(IF(Pecuária!$E$111<=2,((Pecuária!C111*365)*Pecuária!D111)*('Evolução rebanho'!$P$14+'Evolução rebanho'!$P$98),0),\"\")","v":0},{"$f":"IFERROR(IF(Pecuária!$E$111<=3,((Pecuária!C111*365)*Pecuária!D111)*('Evolução rebanho'!$H$28+'Evolução rebanho'!$H$112),0),\"\")","v":0},{"$f":"IFERROR(IF(Pecuária!$E$111<=4,((Pecuária!C111*365)*Pecuária!D111)*('Evolução rebanho'!$P$28+'Evolução rebanho'!$P$112),0),\"\")","v":0},{"$f":"IFERROR(IF(Pecuária!$E$111<=5,((Pecuária!C111*365)*Pecuária!D111)*('Evolução rebanho'!$H$42+'Evolução rebanho'!$H$126),0),\"\")","v":0},{"$f":"IFERROR(IF(Pecuária!$E$111<=6,((Pecuária!C111*365)*Pecuária!D111)*('Evolução rebanho'!$P$42+'Evolução rebanho'!$P$126),0),\"\")","v":0},{"$f":"IFERROR(IF(Pecuária!$E$111<=7,((Pecuária!C111*365)*Pecuária!D111)*('Evolução rebanho'!$H$56+'Evolução rebanho'!$H$140),0),\"\")","v":0},{"$f":"IFERROR(IF(Pecuária!$E$111<=8,((Pecuária!C111*365)*Pecuária!D111)*('Evolução rebanho'!$P$56+'Evolução rebanho'!$P$140),0),\"\")","v":0},{"$f":"IFERROR(IF(Pecuária!$E$111<=9,((Pecuária!C111*365)*Pecuária!D111)*('Evolução rebanho'!$H$70+'Evolução rebanho'!$H$154),0),\"\")","v":0},{"$f":"IFERROR(IF(Pecuária!$E$111<=10,((Pecuária!C111*365)*Pecuária!D111)*('Evolução rebanho'!$P$70+'Evolução rebanho'!$P$154),0),\"\")","v":0},{"$f":"IFERROR(IF(Pecuária!$E$111<=11,((Pecuária!C111*365)*Pecuária!D111)*('Evolução rebanho'!$H$83+'Evolução rebanho'!$H$168),0),\"\")","v":0},{"$f":"IFERROR(IF(Pecuária!$E$111<=12,((Pecuária!C111*365)*Pecuária!D111)*('Evolução rebanho'!$P$83+'Evolução rebanho'!$P$168),0),\"\")","v":0}]
[{"$f":"IF(Pecuária!A112=\"\",\"\",Pecuária!A112)","v":""},{"$f":"IFERROR(IF(Pecuária!$E$111=1,((Pecuária!C112*365)*Pecuária!D112)*('Evolução rebanho'!$H$14+'Evolução rebanho'!$H$98),0),\"\")","v":0},{"$f":"IFERROR(IF(Pecuária!$E$111<=2,((Pecuária!C112*365)*Pecuária!D112)*('Evolução rebanho'!$P$14+'Evolução rebanho'!$P$98),0),\"\")","v":0},{"$f":"IFERROR(IF(Pecuária!$E$111<=3,((Pecuária!C112*365)*Pecuária!D112)*('Evolução rebanho'!$H$28+'Evolução rebanho'!$H$112),0),\"\")","v":0},{"$f":"IFERROR(IF(Pecuária!$E$111<=4,((Pecuária!C112*365)*Pecuária!D112)*('Evolução rebanho'!$P$28+'Evolução rebanho'!$P$112),0),\"\")","v":0},{"$f":"IFERROR(IF(Pecuária!$E$111<=5,((Pecuária!C112*365)*Pecuária!D112)*('Evolução rebanho'!$H$42+'Evolução rebanho'!$H$126),0),\"\")","v":0},{"$f":"IFERROR(IF(Pecuária!$E$111<=6,((Pecuária!C112*365)*Pecuária!D112)*('Evolução rebanho'!$P$42+'Evolução rebanho'!P$126),0),\"\")","v":0},{"$f":"IFERROR(IF(Pecuária!$E$111<=7,((Pecuária!C112*365)*Pecuária!D112)*('Evolução rebanho'!$H$56+'Evolução rebanho'!$H$140),0),\"\")","v":0},{"$f":"IFERROR(IF(Pecuária!$E$111<=8,((Pecuária!C112*365)*Pecuária!D112)*('Evolução rebanho'!$P$56+'Evolução rebanho'!$P$140),0),\"\")","v":0},{"$f":"IFERROR(IF(Pecuária!$E$111<=9,((Pecuária!C112*365)*Pecuária!D112)*('Evolução rebanho'!$H$70+'Evolução rebanho'!$H$154),0),\"\")","v":0},{"$f":"IFERROR(IF(Pecuária!$E$111<=10,((Pecuária!C112*365)*Pecuária!D112)*('Evolução rebanho'!$P$70+'Evolução rebanho'!$P$154),0),\"\")","v":0},{"$f":"IFERROR(IF(Pecuária!$E$111<=11,((Pecuária!C112*365)*Pecuária!D112)*('Evolução rebanho'!$H$83+'Evolução rebanho'!$H$168),0),\"\")","v":0},{"$f":"IFERROR(IF(Pecuária!$E$111<=12,((Pecuária!C112*365)*Pecuária!D112)*('Evolução rebanho'!$P$83+'Evolução rebanho'!$P$168),0),\"\")","v":0}]
[{"$f":"IF(Pecuária!A113=\"\",\"\",Pecuária!A113)","v":""},{"$f":"IFERROR(IF(Pecuária!$E$111=1,((Pecuária!C113*365)*Pecuária!D113)*('Evolução rebanho'!$H$14+'Evolução rebanho'!$H$98),0),\"\")","v":0},{"$f":"IFERROR(IF(Pecuária!$E$111<=2,((Pecuária!C113*365)*Pecuária!D113)*('Evolução rebanho'!$P$14+'Evolução rebanho'!$P$98),0),\"\")","v":0},{"$f":"IFERROR(IF(Pecuária!$E$111<=3,((Pecuária!C113*365)*Pecuária!D113)*('Evolução rebanho'!$H$28+'Evolução rebanho'!$H$112),0),\"\")","v":0},{"$f":"IFERROR(IF(Pecuária!$E$111<=4,((Pecuária!C113*365)*Pecuária!D113)*('Evolução rebanho'!$P$28+'Evolução rebanho'!$P$112),0),\"\")","v":0},{"$f":"IFERROR(IF(Pecuária!$E$111<=5,((Pecuária!C113*365)*Pecuária!D113)*('Evolução rebanho'!$H$42+'Evolução rebanho'!$H$126),0),\"\")","v":0},{"$f":"IFERROR(IF(Pecuária!$E$111<=6,((Pecuária!C113*365)*Pecuária!D113)*('Evolução rebanho'!$P$42+'Evolução rebanho'!$P$126),0),\"\")","v":0},{"$f":"IFERROR(IF(Pecuária!$E$111<=7,((Pecuária!C113*365)*Pecuária!D113)*('Evolução rebanho'!$H$56+'Evolução rebanho'!$H$140),0),\"\")","v":0},{"$f":"IFERROR(IF(Pecuária!$E$111<=8,((Pecuária!C113*365)*Pecuária!D113)*('Evolução rebanho'!$P$56+'Evolução rebanho'!$P$140),0),\"\")","v":0},{"$f":"IFERROR(IF(Pecuária!$E$111<=9,((Pecuária!C113*365)*Pecuária!D113)*('Evolução rebanho'!$H$70+'Evolução rebanho'!$H$154),0),\"\")","v":0},{"$f":"IFERROR(IF(Pecuária!$E$111<=10,((Pecuária!C113*365)*Pecuária!D113)*('Evolução rebanho'!$P$70+'Evolução rebanho'!$P$154),0),\"\")","v":0},{"$f":"IFERROR(IF(Pecuária!$E$111<=11,((Pecuária!C113*365)*Pecuária!D113)*('Evolução rebanho'!$H$83+'Evolução rebanho'!$H$168),0),\"\")","v":0},{"$f":"IFERROR(IF(Pecuária!$E$111<=12,((Pecuária!C113*365)*Pecuária!D113)*('Evolução rebanho'!$P$83+'Evolução rebanho'!$P$168),0),\"\")","v":0}]
[{"$f":"IF(Pecuária!A118=\"\",\"\",Pecuária!A118)","v":"Brucelose"},{"$f":"IFERROR(IF(Pecuária!$E$118=1,(Pecuária!C118*Pecuária!D118)*('Evolução rebanho'!$H$14+'Evolução rebanho'!$H$98),0),\"\")","v":0},{"$f":"IFERROR(IF(Pecuária!$E$118<=2,(Pecuária!C118*Pecuária!D118)*('Evolução rebanho'!$P$14+'Evolução rebanho'!$P$98),0),\"\")","v":0},{"$f":"IFERROR(IF(Pecuária!$E$118<=3,(Pecuária!C118*Pecuária!D118)*('Evolução rebanho'!$H$28+'Evolução rebanho'!$H$112),0),\"\")","v":0},{"$f":"IFERROR(IF(Pecuária!$E$118<=4,(Pecuária!C118*Pecuária!D118)*('Evolução rebanho'!$P$28+'Evolução rebanho'!$P$112),0),\"\")","v":0},{"$f":"IFERROR(IF(Pecuária!$E$118<=5,(Pecuária!C118*Pecuária!D118)*('Evolução rebanho'!$H$42+'Evolução rebanho'!$H$126),0),\"\")","v":0},{"$f":"IFERROR(IF(Pecuária!$E$118<=6,(Pecuária!C118*Pecuária!D118)*('Evolução rebanho'!$P$42+'Evolução rebanho'!$P$126),0),\"\")","v":0},{"$f":"IFERROR(IF(Pecuária!$E$118<=7,(Pecuária!C118*Pecuária!D118)*('Evolução rebanho'!$H$56+'Evolução rebanho'!$H$140),0),\"\")","v":0},{"$f":"IFERROR(IF(Pecuária!$E$118<=8,(Pecuária!C118*Pecuária!D118)*('Evolução rebanho'!$P$56+'Evolução rebanho'!$P$140),0),\"\")","v":0},{"$f":"IFERROR(IF(Pecuária!$E$118<=9,(Pecuária!C118*Pecuária!D118)*('Evolução rebanho'!$H$70+'Evolução rebanho'!$H$154),0),\"\")","v":0},{"$f":"IFERROR(IF(Pecuária!$E$118<=10,(Pecuária!C118*Pecuária!D118)*('Evolução rebanho'!$P$70+'Evolução rebanho'!$P$154),0),\"\")","v":0},{"$f":"IFERROR(IF(Pecuária!$E$118<=11,(Pecuária!C118*Pecuária!D118)*('Evolução rebanho'!$H$83+'Evolução rebanho'!$H$168),0),\"\")","v":0},{"$f":"IFERROR(IF(Pecuária!$E$118<=12,(Pecuária!C118*Pecuária!D118)*('Evolução rebanho'!$P$83+'Evolução rebanho'!$P$168),0),\"\")","v":0}]
[{"$f":"IF(Pecuária!A119=\"\",\"\",Pecuária!A119)","v":"Aftosa"},{"$f":"IFERROR(IF(Pecuária!$E$118=1,(Pecuária!C119*Pecuária!D119)*('Evolução rebanho'!$H$14+'Evolução rebanho'!$H$98),0),\"\")","v":0},{"$f":"IFERROR(IF(Pecuária!$E$118<=2,(Pecuária!C119*Pecuária!D119)*('Evolução rebanho'!$P$14+'Evolução rebanho'!$P$98),0),\"\")","v":0},{"$f":"IFERROR(IF(Pecuária!$E$118<=3,(Pecuária!C119*Pecuária!D119)*('Evolução rebanho'!$H$28+'Evolução rebanho'!$H$112),0),\"\")","v":0},{"$f":"IFERROR(IF(Pecuária!$E$118<=4,(Pecuária!C119*Pecuária!D119)*('Evolução rebanho'!$P$28+'Evolução rebanho'!$P$112),0),\"\")","v":0},{"$f":"IFERROR(IF(Pecuária!$E$118<=5,(Pecuária!C119*Pecuária!D119)*('Evolução rebanho'!$H$42+'Evolução rebanho'!$H$126),0),\"\")","v":0},{"$f":"IFERROR(IF(Pecuária!$E$118<=6,(Pecuária!C119*Pecuária!D119)*('Evolução rebanho'!$P$42+'Evolução rebanho'!$P$126),0),\"\")","v":0},{"$f":"IFERROR(IF(Pecuária!$E$118<=7,(Pecuária!C119*Pecuária!D119)*('Evolução rebanho'!$H$56+'Evolução rebanho'!$H$140),0),\"\")","v":0},{"$f":"IFERROR(IF(Pecuária!$E$118<=8,(Pecuária!C119*Pecuária!D119)*('Evolução rebanho'!$P$56+'Evolução rebanho'!$P$140),0),\"\")","v":0},{"$f":"IFERROR(IF(Pecuária!$E$118<=9,(Pecuária!C119*Pecuária!D119)*('Evolução rebanho'!$H$70+'Evolução rebanho'!$H$154),0),\"\")","v":0},{"$f":"IFERROR(IF(Pecuária!$E$118<=10,(Pecuária!C119*Pecuária!D119)*('Evolução rebanho'!$P$70+'Evolução rebanho'!$P$154),0),\"\")","v":0},{"$f":"IFERROR(IF(Pecuária!$E$118<=11,(Pecuária!C119*Pecuária!D119)*('Evolução rebanho'!$H$83+'Evolução rebanho'!$H$168),0),\"\")","v":0},{"$f":"IFERROR(IF(Pecuária!$E$118<=12,(Pecuária!C119*Pecuária!D119)*('Evolução rebanho'!$P$83+'Evolução rebanho'!$P$168),0),\"\")","v":0}]
[{"$f":"IF(Pecuária!A120=\"\",\"\",Pecuária!A120)","v":"Carbúnculo/Manqueira"},{"$f":"IFERROR(IF(Pecuária!$E$118=1,(Pecuária!C120*Pecuária!D120)*('Evolução rebanho'!$H$14+'Evolução rebanho'!$H$98),0),\"\")","v":0},{"$f":"IFERROR(IF(Pecuária!$E$118<=2,(Pecuária!C120*Pecuária!D120)*('Evolução rebanho'!$P$14+'Evolução rebanho'!$P$98),0),\"\")","v":0},{"$f":"IFERROR(IF(Pecuária!$E$118<=3,(Pecuária!C120*Pecuária!D120)*('Evolução rebanho'!$H$28+'Evolução rebanho'!$H$112),0),\"\")","v":0},{"$f":"IFERROR(IF(Pecuária!$E$118<=4,(Pecuária!C120*Pecuária!D120)*('Evolução rebanho'!$P$28+'Evolução rebanho'!$P$112),0),\"\")","v":0},{"$f":"IFERROR(IF(Pecuária!$E$118<=5,(Pecuária!C120*Pecuária!D120)*('Evolução rebanho'!$H$42+'Evolução rebanho'!$H$126),0),\"\")","v":0},{"$f":"IFERROR(IF(Pecuária!$E$118<=6,(Pecuária!C120*Pecuária!D120)*('Evolução rebanho'!$P$42+'Evolução rebanho'!$P$126),0),\"\")","v":0},{"$f":"IFERROR(IF(Pecuária!$E$118<=7,(Pecuária!C120*Pecuária!D120)*('Evolução rebanho'!$H$56+'Evolução rebanho'!$H$140),0),\"\")","v":0},{"$f":"IFERROR(IF(Pecuária!$E$118<=8,(Pecuária!C120*Pecuária!D120)*('Evolução rebanho'!$P$56+'Evolução rebanho'!$P$140),0),\"\")","v":0},{"$f":"IFERROR(IF(Pecuária!$E$118<=9,(Pecuária!C120*Pecuária!D120)*('Evolução rebanho'!$H$70+'Evolução rebanho'!$H$154),0),\"\")","v":0},{"$f":"IFERROR(IF(Pecuária!$E$118<=10,(Pecuária!C120*Pecuária!D120)*('Evolução rebanho'!$P$70+'Evolução rebanho'!$P$154),0),\"\")","v":0},{"$f":"IFERROR(IF(Pecuária!$E$118<=11,(Pecuária!C120*Pecuária!D120)*('Evolução rebanho'!$H$83+'Evolução rebanho'!$H$168),0),\"\")","v":0},{"$f":"IFERROR(IF(Pecuária!$E$118<=12,(Pecuária!C120*Pecuária!D120)*('Evolução rebanho'!$P$83+'Evolução rebanho'!$P$168),0),\"\")","v":0}]
[{"$f":"IF(Pecuária!A121=\"\",\"\",Pecuária!A121)","v":"Botulismo"},{"$f":"IFERROR(IF(Pecuária!$E$118=1,(Pecuária!C121*Pecuária!D121)*('Evolução rebanho'!$H$14+'Evolução rebanho'!$H$98),0),\"\")","v":0},{"$f":"IFERROR(IF(Pecuária!$E$118<=2,(Pecuária!C121*Pecuária!D121)*('Evolução rebanho'!$P$14+'Evolução rebanho'!$P$98),0),\"\")","v":0},{"$f":"IFERROR(IF(Pecuária!$E$118<=3,(Pecuária!C121*Pecuária!D121)*('Evolução rebanho'!$H$28+'Evolução rebanho'!$H$112),0),\"\")","v":0},{"$f":"IFERROR(IF(Pecuária!$E$118<=4,(Pecuária!C121*Pecuária!D121)*('Evolução rebanho'!$P$28+'Evolução rebanho'!$P$112),0),\"\")","v":0},{"$f":"IFERROR(IF(Pecuária!$E$118<=5,(Pecuária!C121*Pecuária!D121)*('Evolução rebanho'!$H$42+'Evolução rebanho'!$H$126),0),\"\")","v":0},{"$f":"IFERROR(IF(Pecuária!$E$118<=6,(Pecuária!C121*Pecuária!D121)*('Evolução rebanho'!$P$42+'Evolução rebanho'!$P$126),0),\"\")","v":0},{"$f":"IFERROR(IF(Pecuária!$E$118<=7,(Pecuária!C121*Pecuária!D121)*('Evolução rebanho'!$H$56+'Evolução rebanho'!$H$140),0),\"\")","v":0},{"$f":"IFERROR(IF(Pecuária!$E$118<=8,(Pecuária!C121*Pecuária!D121)*('Evolução rebanho'!$P$56+'Evolução rebanho'!$P$140),0),\"\")","v":0},{"$f":"IFERROR(IF(Pecuária!$E$118<=9,(Pecuária!C121*Pecuária!D121)*('Evolução rebanho'!$H$70+'Evolução rebanho'!$H$154),0),\"\")","v":0},{"$f":"IFERROR(IF(Pecuária!$E$118<=10,(Pecuária!C121*Pecuária!D121)*('Evolução rebanho'!$P$70+'Evolução rebanho'!$P$154),0),\"\")","v":0},{"$f":"IFERROR(IF(Pecuária!$E$118<=11,(Pecuária!C121*Pecuária!D121)*('Evolução rebanho'!$H$83+'Evolução rebanho'!$H$168),0),\"\")","v":0},{"$f":"IFERROR(IF(Pecuária!$E$118<=12,(Pecuária!C121*Pecuária!D121)*('Evolução rebanho'!$P$83+'Evolução rebanho'!$P$168),0),\"\")","v":0}]
[{"$f":"IF(Pecuária!A126=\"\",\"\",Pecuária!A126)","v":""},{"$f":"IF(Pecuária!$E$126=1,Pecuária!C126*Pecuária!D126,\"\")","v":0},{"$f":"IF(Pecuária!$E$126<=2,Pecuária!C126*Pecuária!D126,\"\")","v":0},{"$f":"IF(Pecuária!$E$126<=3,Pecuária!C126*Pecuária!D126,\"\")","v":0},{"$f":"IF(Pecuária!$E$126<=4,Pecuária!$C126*Pecuária!$D126,\"\")","v":0},{"$f":"IF(Pecuária!$E$126<=5,Pecuária!$C126*Pecuária!$D126,\"\")","v":0},{"$f":"IF(Pecuária!$E$126<=6,Pecuária!$C126*Pecuária!$D126,\"\")","v":0},{"$f":"IF(Pecuária!$E$126<=7,Pecuária!$C126*Pecuária!$D126,\"\")","v":0},{"$f":"IF(Pecuária!$E$126<=8,Pecuária!$C126*Pecuária!$D126,\"\")","v":0},{"$f":"IF(Pecuária!$E$126<=9,Pecuária!$C126*Pecuária!$D126,\"\")","v":0},{"$f":"IF(Pecuária!$E$126<=10,Pecuária!$C126*Pecuária!$D126,\"\")","v":0},{"$f":"IF(Pecuária!$E$126<=11,Pecuária!$C126*Pecuária!$D126,\"\")","v":0},{"$f":"IF(Pecuária!$E$126<=12,Pecuária!$C126*Pecuária!$D126,\"\")","v":0}]
[{"$f":"IF(Pecuária!A127=\"\",\"\",Pecuária!A127)","v":""},{"$f":"IF(Pecuária!$E$126=1,Pecuária!C127*Pecuária!D127,\"\")","v":0},{"$f":"IF(Pecuária!$E$126<=2,Pecuária!C127*Pecuária!D127,\"\")","v":0},{"$f":"IF(Pecuária!$E$126<=3,Pecuária!C127*Pecuária!D127,\"\")","v":0},{"$f":"IF(Pecuária!$E$126<=4,Pecuária!$C127*Pecuária!$D127,\"\")","v":0},{"$f":"IF(Pecuária!$E$126<=5,Pecuária!$C127*Pecuária!$D127,\"\")","v":0},{"$f":"IF(Pecuária!$E$126<=6,Pecuária!$C127*Pecuária!$D127,\"\")","v":0},{"$f":"IF(Pecuária!$E$126<=7,Pecuária!$C127*Pecuária!$D127,\"\")","v":0},{"$f":"IF(Pecuária!$E$126<=8,Pecuária!$C127*Pecuária!$D127,\"\")","v":0},{"$f":"IF(Pecuária!$E$126<=9,Pecuária!$C127*Pecuária!$D127,\"\")","v":0},{"$f":"IF(Pecuária!$E$126<=10,Pecuária!$C127*Pecuária!$D127,\"\")","v":0},{"$f":"IF(Pecuária!$E$126<=11,Pecuária!$C127*Pecuária!$D127,\"\")","v":0},{"$f":"IF(Pecuária!$E$126<=12,Pecuária!$C127*Pecuária!$D127,\"\")","v":0}]
[{"$f":"IF(Pecuária!A128=\"\",\"\",Pecuária!A128)","v":""},{"$f":"IF(Pecuária!$E$126=1,Pecuária!C128*Pecuária!D128,\"\")","v":0},{"$f":"IF(Pecuária!$E$126<=2,Pecuária!C128*Pecuária!D128,\"\")","v":0},{"$f":"IF(Pecuária!$E$126<=3,Pecuária!C128*Pecuária!D128,\"\")","v":0},{"$f":"IF(Pecuária!$E$126<=4,Pecuária!$C128*Pecuária!$D128,\"\")","v":0},{"$f":"IF(Pecuária!$E$126<=5,Pecuária!$C128*Pecuária!$D128,\"\")","v":0},{"$f":"IF(Pecuária!$E$126<=6,Pecuária!$C128*Pecuária!$D128,\"\")","v":0},{"$f":"IF(Pecuária!$E$126<=7,Pecuária!$C128*Pecuária!$D128,\"\")","v":0},{"$f":"IF(Pecuária!$E$126<=8,Pecuária!$C128*Pecuária!$D128,\"\")","v":0},{"$f":"IF(Pecuária!$E$126<=9,Pecuária!$C128*Pecuária!$D128,\"\")","v":0},{"$f":"IF(Pecuária!$E$126<=10,Pecuária!$C128*Pecuária!$D128,\"\")","v":0},{"$f":"IF(Pecuária!$E$126<=11,Pecuária!$C128*Pecuária!$D128,\"\")","v":0},{"$f":"IF(Pecuária!$E$126<=12,Pecuária!$C128*Pecuária!$D128,\"\")","v":0}]
[{"$f":"IF(Pecuária!A129=\"\",\"\",Pecuária!A129)","v":""},{"$f":"IF(Pecuária!$E$126=1,Pecuária!C129*Pecuária!D129,\"\")","v":0},{"$f":"IF(Pecuária!$E$126<=2,Pecuária!C129*Pecuária!D129,\"\")","v":0},{"$f":"IF(Pecuária!$E$126<=3,Pecuária!C129*Pecuária!D129,\"\")","v":0},{"$f":"IF(Pecuária!$E$126<=4,Pecuária!$C129*Pecuária!$D129,\"\")","v":0},{"$f":"IF(Pecuária!$E$126<=5,Pecuária!$C129*Pecuária!$D129,\"\")","v":0},{"$f":"IF(Pecuária!$E$126<=6,Pecuária!$C129*Pecuária!$D129,\"\")","v":0},{"$f":"IF(Pecuária!$E$126<=7,Pecuária!$C129*Pecuária!$D129,\"\")","v":0},{"$f":"IF(Pecuária!$E$126<=8,Pecuária!$C129*Pecuária!$D129,\"\")","v":0},{"$f":"IF(Pecuária!$E$126<=9,Pecuária!$C129*Pecuária!$D129,\"\")","v":0},{"$f":"IF(Pecuária!$E$126<=10,Pecuária!$C129*Pecuária!$D129,\"\")","v":0},{"$f":"IF(Pecuária!$E$126<=11,Pecuária!$C129*Pecuária!$D129,\"\")","v":0},{"$f":"IF(Pecuária!$E$126<=12,Pecuária!$C129*Pecuária!$D129,\"\")","v":0}]
[{"$f":"IF(Pecuária!A130=\"\",\"\",Pecuária!A130)","v":""},{"$f":"IF(Pecuária!$E$126=1,Pecuária!C130*Pecuária!D130,\"\")","v":0},{"$f":"IF(Pecuária!$E$126<=2,Pecuária!C130*Pecuária!D130,\"\")","v":0},{"$f":"IF(Pecuária!$E$126<=3,Pecuária!C130*Pecuária!D130,\"\")","v":0},{"$f":"IF(Pecuária!$E$126<=4,Pecuária!$C130*Pecuária!$D130,\"\")","v":0},{"$f":"IF(Pecuária!$E$126<=5,Pecuária!$C130*Pecuária!$D130,\"\")","v":0},{"$f":"IF(Pecuária!$E$126<=6,Pecuária!$C130*Pecuária!$D130,\"\")","v":0},{"$f":"IF(Pecuária!$E$126<=7,Pecuária!$C130*Pecuária!$D130,\"\")","v":0},{"$f":"IF(Pecuária!$E$126<=8,Pecuária!$C130*Pecuária!$D130,\"\")","v":0},{"$f":"IF(Pecuária!$E$126<=9,Pecuária!$C130*Pecuária!$D130,\"\")","v":0},{"$f":"IF(Pecuária!$E$126<=10,Pecuária!$C130*Pecuária!$D130,\"\")","v":0},{"$f":"IF(Pecuária!$E$126<=11,Pecuária!$C130*Pecuária!$D130,\"\")","v":0},{"$f":"IF(Pecuária!$E$126<=12,Pecuária!$C130*Pecuária!$D130,\"\")","v":0}]
[{"$f":"IF(Pecuária!A131=\"\",\"\",Pecuária!A131)","v":""},{"$f":"IF(Pecuária!$E$126=1,Pecuária!C131*Pecuária!D131,\"\")","v":0},{"$f":"IF(Pecuária!$E$126<=2,Pecuária!C131*Pecuária!D131,\"\")","v":0},{"$f":"IF(Pecuária!$E$126<=3,Pecuária!C131*Pecuária!D131,\"\")","v":0},{"$f":"IF(Pecuária!$E$126<=4,Pecuária!$C131*Pecuária!$D131,\"\")","v":0},{"$f":"IF(Pecuária!$E$126<=5,Pecuária!$C131*Pecuária!$D131,\"\")","v":0},{"$f":"IF(Pecuária!$E$126<=6,Pecuária!$C131*Pecuária!$D131,\"\")","v":0},{"$f":"IF(Pecuária!$E$126<=7,Pecuária!$C131*Pecuária!$D131,\"\")","v":0},{"$f":"IF(Pecuária!$E$126<=8,Pecuária!$C131*Pecuária!$D131,\"\")","v":0},{"$f":"IF(Pecuária!$E$126<=9,Pecuária!$C131*Pecuária!$D131,\"\")","v":0},{"$f":"IF(Pecuária!$E$126<=10,Pecuária!$C131*Pecuária!$D131,\"\")","v":0},{"$f":"IF(Pecuária!$E$126<=11,Pecuária!$C131*Pecuária!$D131,\"\")","v":0},{"$f":"IF(Pecuária!$E$126<=12,Pecuária!$C131*Pecuária!$D131,\"\")","v":0}]
[{"$f":"IF(Pecuária!A133=\"\",\"\",Pecuária!A133)","v":""},{"$f":"IF(Pecuária!$E$133=1,Pecuária!C133*Pecuária!D133,\"\")","v":0},{"$f":"IF(Pecuária!$E$133<=2,Pecuária!C133*Pecuária!D133,\"\")","v":0},{"$f":"IF(Pecuária!$E$133<=3,Pecuária!C133*Pecuária!D133,\"\")","v":0},{"$f":"IF(Pecuária!$E$133<=4,Pecuária!$C133*Pecuária!$D133,\"\")","v":0},{"$f":"IF(Pecuária!$E$133<=5,Pecuária!$C133*Pecuária!$D133,\"\")","v":0},{"$f":"IF(Pecuária!$E$133<=6,Pecuária!$C133*Pecuária!$D133,\"\")","v":0},{"$f":"IF(Pecuária!$E$133<=7,Pecuária!$C133*Pecuária!$D133,\"\")","v":0},{"$f":"IF(Pecuária!$E$133<=8,Pecuária!$C133*Pecuária!$D133,\"\")","v":0},{"$f":"IF(Pecuária!$E$133<=9,Pecuária!$C133*Pecuária!$D133,\"\")","v":0},{"$f":"IF(Pecuária!$E$133<=10,Pecuária!$C133*Pecuária!$D133,\"\")","v":0},{"$f":"IF(Pecuária!$E$133<=11,Pecuária!$C133*Pecuária!$D133,\"\")","v":0},{"$f":"IF(Pecuária!$E$133<=12,Pecuária!$C133*Pecuária!$D133,\"\")","v":0}]
[{"$f":"IF(Pecuária!A134=\"\",\"\",Pecuária!A134)","v":""},{"$f":"IF(Pecuária!$E$133=1,Pecuária!C134*Pecuária!D134,\"\")","v":0},{"$f":"IF(Pecuária!$E$133<=2,Pecuária!C134*Pecuária!D134,\"\")","v":0},{"$f":"IF(Pecuária!$E$133<=3,Pecuária!C134*Pecuária!D134,\"\")","v":0},{"$f":"IF(Pecuária!$E$133<=4,Pecuária!$C134*Pecuária!$D134,\"\")","v":0},{"$f":"IF(Pecuária!$E$133<=5,Pecuária!$C134*Pecuária!$D134,\"\")","v":0},{"$f":"IF(Pecuária!$E$133<=6,Pecuária!$C134*Pecuária!$D134,\"\")","v":0},{"$f":"IF(Pecuária!$E$133<=7,Pecuária!$C134*Pecuária!$D134,\"\")","v":0},{"$f":"IF(Pecuária!$E$133<=8,Pecuária!$C134*Pecuária!$D134,\"\")","v":0},{"$f":"IF(Pecuária!$E$133<=9,Pecuária!$C134*Pecuária!$D134,\"\")","v":0},{"$f":"IF(Pecuária!$E$133<=10,Pecuária!$C134*Pecuária!$D134,\"\")","v":0},{"$f":"IF(Pecuária!$E$133<=11,Pecuária!$C134*Pecuária!$D134,\"\")","v":0},{"$f":"IF(Pecuária!$E$133<=12,Pecuária!$C134*Pecuária!$D134,\"\")","v":0}]
[{"$f":"IF(Pecuária!A135=\"\",\"\",Pecuária!A135)","v":""},{"$f":"IF(Pecuária!$E$133=1,Pecuária!C135*Pecuária!D135,\"\")","v":0},{"$f":"IF(Pecuária!$E$133<=2,Pecuária!C135*Pecuária!D135,\"\")","v":0},{"$f":"IF(Pecuária!$E$133<=3,Pecuária!C135*Pecuária!D135,\"\")","v":0},{"$f":"IF(Pecuária!$E$133<=4,Pecuária!$C135*Pecuária!$D135,\"\")","v":0},{"$f":"IF(Pecuária!$E$133<=5,Pecuária!$C135*Pecuária!$D135,\"\")","v":0},{"$f":"IF(Pecuária!$E$133<=6,Pecuária!$C135*Pecuária!$D135,\"\")","v":0},{"$f":"IF(Pecuária!$E$133<=7,Pecuária!$C135*Pecuária!$D135,\"\")","v":0},{"$f":"IF(Pecuária!$E$133<=8,Pecuária!$C135*Pecuária!$D135,\"\")","v":0},{"$f":"IF(Pecuária!$E$133<=9,Pecuária!$C135*Pecuária!$D135,\"\")","v":0},{"$f":"IF(Pecuária!$E$133<=10,Pecuária!$C135*Pecuária!$D135,\"\")","v":0},{"$f":"IF(Pecuária!$E$133<=11,Pecuária!$C135*Pecuária!$D135,\"\")","v":0},{"$f":"IF(Pecuária!$E$133<=12,Pecuária!$C135*Pecuária!$D135,\"\")","v":0}]
[{"$f":"IF(Pecuária!A136=\"\",\"\",Pecuária!A136)","v":""},{"$f":"IF(Pecuária!$E$133=1,Pecuária!C136*Pecuária!D136,\"\")","v":0},{"$f":"IF(Pecuária!$E$133<=2,Pecuária!C136*Pecuária!D136,\"\")","v":0},{"$f":"IF(Pecuária!$E$133<=3,Pecuária!C136*Pecuária!D136,\"\")","v":0},{"$f":"IF(Pecuária!$E$133<=4,Pecuária!$C136*Pecuária!$D136,\"\")","v":0},{"$f":"IF(Pecuária!$E$133<=5,Pecuária!$C136*Pecuária!$D136,\"\")","v":0},{"$f":"IF(Pecuária!$E$133<=6,Pecuária!$C136*Pecuária!$D136,\"\")","v":0},{"$f":"IF(Pecuária!$E$133<=7,Pecuária!$C136*Pecuária!$D136,\"\")","v":0},{"$f":"IF(Pecuária!$E$133<=8,Pecuária!$C136*Pecuária!$D136,\"\")","v":0},{"$f":"IF(Pecuária!$E$133<=9,Pecuária!$C136*Pecuária!$D136,\"\")","v":0},{"$f":"IF(Pecuária!$E$133<=10,Pecuária!$C136*Pecuária!$D136,\"\")","v":0},{"$f":"IF(Pecuária!$E$133<=11,Pecuária!$C136*Pecuária!$D136,\"\")","v":0},{"$f":"IF(Pecuária!$E$133<=12,Pecuária!$C136*Pecuária!$D136,\"\")","v":0}]
[{"$f":"IF(Pecuária!A137=\"\",\"\",Pecuária!A137)","v":""},{"$f":"IF(Pecuária!$E$133=1,Pecuária!C137*Pecuária!D137,\"\")","v":0},{"$f":"IF(Pecuária!$E$133<=2,Pecuária!C137*Pecuária!D137,\"\")","v":0},{"$f":"IF(Pecuária!$E$133<=3,Pecuária!C137*Pecuária!D137,\"\")","v":0},{"$f":"IF(Pecuária!$E$133<=4,Pecuária!$C137*Pecuária!$D137,\"\")","v":0},{"$f":"IF(Pecuária!$E$133<=5,Pecuária!$C137*Pecuária!$D137,\"\")","v":0},{"$f":"IF(Pecuária!$E$133<=6,Pecuária!$C137*Pecuária!$D137,\"\")","v":0},{"$f":"IF(Pecuária!$E$133<=7,Pecuária!$C137*Pecuária!$D137,\"\")","v":0},{"$f":"IF(Pecuária!$E$133<=8,Pecuária!$C137*Pecuária!$D137,\"\")","v":0},{"$f":"IF(Pecuária!$E$133<=9,Pecuária!$C137*Pecuária!$D137,\"\")","v":0},{"$f":"IF(Pecuária!$E$133<=10,Pecuária!$C137*Pecuária!$D137,\"\")","v":0},{"$f":"IF(Pecuária!$E$133<=11,Pecuária!$C137*Pecuária!$D137,\"\")","v":0},{"$f":"IF(Pecuária!$E$133<=12,Pecuária!$C137*Pecuária!$D137,\"\")","v":0}]
[{"$f":"IF(Pecuária!A138=\"\",\"\",Pecuária!A138)","v":""},{"$f":"IF(Pecuária!$E$133=1,Pecuária!C138*Pecuária!D138,\"\")","v":0},{"$f":"IF(Pecuária!$E$133<=2,Pecuária!C138*Pecuária!D138,\"\")","v":0},{"$f":"IF(Pecuária!$E$133<=3,Pecuária!C138*Pecuária!D138,\"\")","v":0},{"$f":"IF(Pecuária!$E$133<=4,Pecuária!$C138*Pecuária!$D138,\"\")","v":0},{"$f":"IF(Pecuária!$E$133<=5,Pecuária!$C138*Pecuária!$D138,\"\")","v":0},{"$f":"IF(Pecuária!$E$133<=6,Pecuária!$C138*Pecuária!$D138,\"\")","v":0},{"$f":"IF(Pecuária!$E$133<=7,Pecuária!$C138*Pecuária!$D138,\"\")","v":0},{"$f":"IF(Pecuária!$E$133<=8,Pecuária!$C138*Pecuária!$D138,\"\")","v":0},{"$f":"IF(Pecuária!$E$133<=9,Pecuária!$C138*Pecuária!$D138,\"\")","v":0},{"$f":"IF(Pecuária!$E$133<=10,Pecuária!$C138*Pecuária!$D138,\"\")","v":0},{"$f":"IF(Pecuária!$E$133<=11,Pecuária!$C138*Pecuária!$D138,\"\")","v":0},{"$f":"IF(Pecuária!$E$133<=12,Pecuária!$C138*Pecuária!$D138,\"\")","v":0}]
[{"$f":"IF(Pecuária!A140=\"\",\"\",Pecuária!A140)","v":"Energia elétrica"},{"$f":"IF(Pecuária!$E$140=1,Pecuária!C140*Pecuária!D140,\"\")","v":0},{"$f":"IF(Pecuária!$E$140<=2,Pecuária!C140*Pecuária!D140,\"\")","v":0},{"$f":"IF(Pecuária!$E$140<=3,Pecuária!C140*Pecuária!D140,\"\")","v":0},{"$f":"IF(Pecuária!$E$140<=4,Pecuária!$C140*Pecuária!$D140,\"\")","v":0},{"$f":"IF(Pecuária!$E$140<=5,Pecuária!$C140*Pecuária!$D140,\"\")","v":0},{"$f":"IF(Pecuária!$E$140<=6,Pecuária!$C140*Pecuária!$D140,\"\")","v":0},{"$f":"IF(Pecuária!$E$140<=7,Pecuária!$C140*Pecuária!$D140,\"\")","v":0},{"$f":"IF(Pecuária!$E$140<=8,Pecuária!$C140*Pecuária!$D140,\"\")","v":0},{"$f":"IF(Pecuária!$E$140<=9,Pecuária!$C140*Pecuária!$D140,\"\")","v":0},{"$f":"IF(Pecuária!$E$140<=10,Pecuária!$C140*Pecuária!$D140,\"\")","v":0},{"$f":"IF(Pecuária!$E$140<=11,Pecuária!$C140*Pecuária!$D140,\"\")","v":0},{"$f":"IF(Pecuária!$E$140<=12,Pecuária!$C140*Pecuária!$D140,\"\")","v":0}]
[{"$f":"IF(Pecuária!A141=\"\",\"\",Pecuária!A141)","v":"Combustível"},{"$f":"IF(Pecuária!$E$140=1,Pecuária!C141*Pecuária!D141,\"\")","v":0},{"$f":"IF(Pecuária!$E$140<=2,Pecuária!C141*Pecuária!D141,\"\")","v":0},{"$f":"IF(Pecuária!$E$140<=3,Pecuária!C141*Pecuária!D141,\"\")","v":0},{"$f":"IF(Pecuária!$E$140<=4,Pecuária!$C141*Pecuária!$D141,\"\")","v":0},{"$f":"IF(Pecuária!$E$140<=5,Pecuária!$C141*Pecuária!$D141,\"\")","v":0},{"$f":"IF(Pecuária!$E$140<=6,Pecuária!$C141*Pecuária!$D141,\"\")","v":0},{"$f":"IF(Pecuária!$E$140<=7,Pecuária!$C141*Pecuária!$D141,\"\")","v":0},{"$f":"IF(Pecuária!$E$140<=8,Pecuária!$C141*Pecuária!$D141,\"\")","v":0},{"$f":"IF(Pecuária!$E$140<=9,Pecuária!$C141*Pecuária!$D141,\"\")","v":0},{"$f":"IF(Pecuária!$E$140<=10,Pecuária!$C141*Pecuária!$D141,\"\")","v":0},{"$f":"IF(Pecuária!$E$140<=11,Pecuária!$C141*Pecuária!$D141,\"\")","v":0},{"$f":"IF(Pecuária!$E$140<=12,Pecuária!$C141*Pecuária!$D141,\"\")","v":0}]
[{"$f":"IF(Pecuária!A142=\"\",\"\",Pecuária!A142)","v":"Transporte interno"},{"$f":"IF(Pecuária!$E$140=1,Pecuária!C142*Pecuária!D142,\"\")","v":0},{"$f":"IF(Pecuária!$E$140<=2,Pecuária!C142*Pecuária!D142,\"\")","v":0},{"$f":"IF(Pecuária!$E$140<=3,Pecuária!C142*Pecuária!D142,\"\")","v":0},{"$f":"IF(Pecuária!$E$140<=4,Pecuária!$C142*Pecuária!$D142,\"\")","v":0},{"$f":"IF(Pecuária!$E$140<=5,Pecuária!$C142*Pecuária!$D142,\"\")","v":0},{"$f":"IF(Pecuária!$E$140<=6,Pecuária!$C142*Pecuária!$D142,\"\")","v":0},{"$f":"IF(Pecuária!$E$140<=7,Pecuária!$C142*Pecuária!$D142,\"\")","v":0},{"$f":"IF(Pecuária!$E$140<=8,Pecuária!$C142*Pecuária!$D142,\"\")","v":0},{"$f":"IF(Pecuária!$E$140<=9,Pecuária!$C142*Pecuária!$D142,\"\")","v":0},{"$f":"IF(Pecuária!$E$140<=10,Pecuária!$C142*Pecuária!$D142,\"\")","v":0},{"$f":"IF(Pecuária!$E$140<=11,Pecuária!$C142*Pecuária!$D142,\"\")","v":0},{"$f":"IF(Pecuária!$E$140<=12,Pecuária!$C142*Pecuária!$D142,\"\")","v":0}]
[{"$f":"IF(Pecuária!A143=\"\",\"\",Pecuária!A143)","v":"Outros"},{"$f":"IF(Pecuária!$E$140=1,Pecuária!C143*Pecuária!D143,\"\")","v":0},{"$f":"IF(Pecuária!$E$140<=2,Pecuária!C143*Pecuária!D143,\"\")","v":0},{"$f":"IF(Pecuária!$E$140<=3,Pecuária!C143*Pecuária!D143,\"\")","v":0},{"$f":"IF(Pecuária!$E$140<=4,Pecuária!$C143*Pecuária!$D143,\"\")","v":0},{"$f":"IF(Pecuária!$E$140<=5,Pecuária!$C143*Pecuária!$D143,\"\")","v":0},{"$f":"IF(Pecuária!$E$140<=6,Pecuária!$C143*Pecuária!$D143,\"\")","v":0},{"$f":"IF(Pecuária!$E$140<=7,Pecuária!$C143*Pecuária!$D143,\"\")","v":0},{"$f":"IF(Pecuária!$E$140<=8,Pecuária!$C143*Pecuária!$D143,\"\")","v":0},{"$f":"IF(Pecuária!$E$140<=9,Pecuária!$C143*Pecuária!$D143,\"\")","v":0},{"$f":"IF(Pecuária!$E$140<=10,Pecuária!$C143*Pecuária!$D143,\"\")","v":0},{"$f":"IF(Pecuária!$E$140<=11,Pecuária!$C143*Pecuária!$D143,\"\")","v":0},{"$f":"IF(Pecuária!$E$140<=12,Pecuária!$C143*Pecuária!$D143,\"\")","v":0}]
["Total",{"$f":"SUM(B74:B96)","v":0},{"$f":"SUM(C74:C96)","v":0},0,0,0,0,0,0,0,0,0,{"$f":"SUM(M74:M96)","v":0}]
[]
["Categoria","Aquisição Programada de Animais  (Rebanho A e B)"]
[null,"Ano 1","Ano 2","Ano 3","Ano 4","Ano 5","Ano 6","Ano 7","Ano 8","Ano 9","Ano 10","Ano 11","Ano 12"]
[null,"Valor Total","Valor Total","Valor Total","Valor Total","Valor Total","Valor Total","Valor Total","Valor Total","Valor Total","Valor Total","Valor Total","Valor Total"]
["Reprodutores",{"$f":"(Pecuária!$B$19*Pecuária!C19)+(Pecuária!$B$30+Pecuária!C30)","v":0},{"$f":"(Pecuária!$B$19*Pecuária!D19)+(Pecuária!$B$30+Pecuária!D30)","v":0},{"$f":"(Pecuária!$B$19*Pecuária!$E$19)+(Pecuária!$B$30+Pecuária!$E$30)","v":0},{"$f":"(Pecuária!$B$19*Pecuária!$E$19)+(Pecuária!$B$30+Pecuária!$E$30)","v":0},{"$f":"(Pecuária!$B$19*Pecuária!$E$19)+(Pecuária!$B$30+Pecuária!$E$30)","v":0},{"$f":"(Pecuária!$B$19*Pecuária!$E$19)+(Pecuária!$B$30+Pecuária!$E$30)","v":0},{"$f":"(Pecuária!$B$19*Pecuária!$E$19)+(Pecuária!$B$30+Pecuária!$E$30)","v":0},{"$f":"(Pecuária!$B$19*Pecuária!$E$19)+(Pecuária!$B$30+Pecuária!$E$30)","v":0},{"$f":"(Pecuária!$B$19*Pecuária!$E$19)+(Pecuária!$B$30+Pecuária!$E$30)","v":0},{"$f":"(Pecuária!$B$19*Pecuária!$E$19)+(Pecuária!$B$30+Pecuária!$E$30)","v":0},{"$f":"(Pecuária!$B$19*Pecuária!$E$19)+(Pecuária!$B$30+Pecuária!$E$30)","v":0},{"$f":"(Pecuária!$B$19*Pecuária!$E$19)+(Pecuária!$B$30+Pecuária!$E$30)","v":0}]
["Matrizes",{"$f":"(Pecuária!$B$20*Pecuária!C20)+(Pecuária!$B$31+Pecuária!C31)","v":0},{"$f":"(Pecuária!$B$20*Pecuária!D20)+(Pecuária!$B$31+Pecuária!D31)","v":0},{"$f":"(Pecuária!$B$20*Pecuária!$E$20)+(Pecuária!$B$31+Pecuária!$E$31)","v":0},{"$f":"(Pecuária!$B$20*Pecuária!$E$20)+(Pecuária!$B$31+Pecuária!$E$31)","v":0},{"$f":"(Pecuária!$B$20*Pecuária!$E$20)+(Pecuária!$B$31+Pecuária!$E$31)","v":0},{"$f":"(Pecuária!$B$20*Pecuária!$E$20)+(Pecuária!$B$31+Pecuária!$E$31)","v":0},{"$f":"(Pecuária!$B$20*Pecuária!$E$20)+(Pecuária!$B$31+Pecuária!$E$31)","v":0},{"$f":"(Pecuária!$B$20*Pecuária!$E$20)+(Pecuária!$B$31+Pecuária!$E$31)","v":0},{"$f":"(Pecuária!$B$20*Pecuária!$E$20)+(Pecuária!$B$31+Pecuária!$E$31)","v":0},{"$f":"(Pecuária!$B$20*Pecuária!$E$20)+(Pecuária!$B$31+Pecuária!$E$31)","v":0},{"$f":"(Pecuária!$B$20*Pecuária!$E$20)+(Pecuária!$B$31+Pecuária!$E$31)","v":0},{"$f":"(Pecuária!$B$20*Pecuária!$E$20)+(Pecuária!$B$31+Pecuária!$E$31)","v":0}]
["Bois",{"$f":"(Pecuária!$B$21*Pecuária!C21)+(Pecuária!$B$32+Pecuária!C32)","v":0},{"$f":"(Pecuária!$B$21*Pecuária!D21)+(Pecuária!$B$32+Pecuária!D32)","v":0},{"$f":"(Pecuária!$B$21*Pecuária!$E$21)+(Pecuária!$B$32+Pecuária!$E$32)","v":0},{"$f":"(Pecuária!$B$21*Pecuária!$E$21)+(Pecuária!$B$32+Pecuária!$E$32)","v":0},{"$f":"(Pecuária!$B$21*Pecuária!$E$21)+(Pecuária!$B$32+Pecuária!$E$32)","v":0},{"$f":"(Pecuária!$B$21*Pecuária!$E$21)+(Pecuária!$B$32+Pecuária!$E$32)","v":0},{"$f":"(Pecuária!$B$21*Pecuária!$E$21)+(Pecuária!$B$32+Pecuária!$E$32)","v":0},{"$f":"(Pecuária!$B$21*Pecuária!$E$21)+(Pecuária!$B$32+Pecuária!$E$32)","v":0},{"$f":"(Pecuária!$B$21*Pecuária!$E$21)+(Pecuária!$B$32+Pecuária!$E$32)","v":0},{"$f":"(Pecuária!$B$21*Pecuária!$E$21)+(Pecuária!$B$32+Pecuária!$E$32)","v":0},{"$f":"(Pecuária!$B$21*Pecuária!$E$21)+(Pecuária!$B$32+Pecuária!$E$32)","v":0},{"$f":"(Pecuária!$B$21*Pecuária!$E$21)+(Pecuária!$B$32+Pecuária!$E$32)","v":0}]
["Novilhos",{"$f":"(Pecuária!$B$22*Pecuária!C22)+(Pecuária!$B$33+Pecuária!C33)","v":0},{"$f":"(Pecuária!$B$22*Pecuária!D22)+(Pecuária!$B$33+Pecuária!D33)","v":0},{"$f":"(Pecuária!$B$22*Pecuária!$E$22)+(Pecuária!$B$33+Pecuária!$E$33)","v":0},{"$f":"(Pecuária!$B$22*Pecuária!$E$22)+(Pecuária!$B$33+Pecuária!$E$33)","v":0},{"$f":"(Pecuária!$B$22*Pecuária!$E$22)+(Pecuária!$B$33+Pecuária!$E$33)","v":0},{"$f":"(Pecuária!$B$22*Pecuária!$E$22)+(Pecuária!$B$33+Pecuária!$E$33)","v":0},{"$f":"(Pecuária!$B$22*Pecuária!$E$22)+(Pecuária!$B$33+Pecuária!$E$33)","v":0},{"$f":"(Pecuária!$B$22*Pecuária!$E$22)+(Pecuária!$B$33+Pecuária!$E$33)","v":0},{"$f":"(Pecuária!$B$22*Pecuária!$E$22)+(Pecuária!$B$33+Pecuária!$E$33)","v":0},{"$f":"(Pecuária!$B$22*Pecuária!$E$22)+(Pecuária!$B$33+Pecuária!$E$33)","v":0},{"$f":"(Pecuária!$B$22*Pecuária!$E$22)+(Pecuária!$B$33+Pecuária!$E$33)","v":0},{"$f":"(Pecuária!$B$22*Pecuária!$E$22)+(Pecuária!$B$33+Pecuária!$E$33)","v":0}]
["Novilhas",{"$f":"(Pecuária!$B$23*Pecuária!C23)+(Pecuária!$B$34+Pecuária!C34)","v":0},{"$f":"(Pecuária!$B$23*Pecuária!D23)+(Pecuária!$B$34+Pecuária!D34)","v":0},{"$f":"(Pecuária!$B$23*Pecuária!$E$23)+(Pecuária!$B$34+Pecuária!$E$34)","v":0},{"$f":"(Pecuária!$B$23*Pecuária!$E$23)+(Pecuária!$B$34+Pecuária!$E$34)","v":0},{"$f":"(Pecuária!$B$23*Pecuária!$E$23)+(Pecuária!$B$34+Pecuária!$E$34)","v":0},{"$f":"(Pecuária!$B$23*Pecuária!$E$23)+(Pecuária!$B$34+Pecuária!$E$34)","v":0},{"$f":"(Pecuária!$B$23*Pecuária!$E$23)+(Pecuária!$B$34+Pecuária!$E$34)","v":0},{"$f":"(Pecuária!$B$23*Pecuária!$E$23)+(Pecuária!$B$34+Pecuária!$E$34)","v":0},{"$f":"(Pecuária!$B$23*Pecuária!$E$23)+(Pecuária!$B$34+Pecuária!$E$34)","v":0},{"$f":"(Pecuária!$B$23*Pecuária!$E$23)+(Pecuária!$B$34+Pecuária!$E$34)","v":0},{"$f":"(Pecuária!$B$23*Pecuária!$E$23)+(Pecuária!$B$34+Pecuária!$E$34)","v":0},{"$f":"(Pecuária!$B$23*Pecuária!$E$23)+(Pecuária!$B$34+Pecuária!$E$34)","v":0}]
["Garrotes ",{"$f":"(Pecuária!$B$24*Pecuária!C24)+(Pecuária!$B$35+Pecuária!C35)","v":0},{"$f":"(Pecuária!$B$24*Pecuária!D24)+(Pecuária!$B$35+Pecuária!D35)","v":0},{"$f":"(Pecuária!$B$24*Pecuária!$E$24)+(Pecuária!$B$35+Pecuária!$E$35)","v":0},{"$f":"(Pecuária!$B$24*Pecuária!$E$24)+(Pecuária!$B$35+Pecuária!$E$35)","v":0},{"$f":"(Pecuária!$B$24*Pecuária!$E$24)+(Pecuária!$B$35+Pecuária!$E$35)","v":0},{"$f":"(Pecuária!$B$24*Pecuária!$E$24)+(Pecuária!$B$35+Pecuária!$E$35)","v":0},{"$f":"(Pecuária!$B$24*Pecuária!$E$24)+(Pecuária!$B$35+Pecuária!$E$35)","v":0},{"$f":"(Pecuária!$B$24*Pecuária!$E$24)+(Pecuária!$B$35+Pecuária!$E$35)","v":0},{"$f":"(Pecuária!$B$24*Pecuária!$E$24)+(Pecuária!$B$35+Pecuária!$E$35)","v":0},{"$f":"(Pecuária!$B$24*Pecuária!$E$24)+(Pecuária!$B$35+Pecuária!$E$35)","v":0},{"$f":"(Pecuária!$B$24*Pecuária!$E$24)+(Pecuária!$B$35+Pecuária!$E$35)","v":0},{"$f":"(Pecuária!$B$24*Pecuária!$E$24)+(Pecuária!$B$35+Pecuária!$E$35)","v":0}]
["Garrotas ",{"$f":"(Pecuária!$B$25*Pecuária!C25)+(Pecuária!$B$36+Pecuária!C36)","v":0},{"$f":"(Pecuária!$B$25*Pecuária!D25)+(Pecuária!$B$36+Pecuária!D36)","v":0},{"$f":"(Pecuária!$B$25*Pecuária!$E$25)+(Pecuária!$B$36+Pecuária!$E$36)","v":0},{"$f":"(Pecuária!$B$25*Pecuária!$E$25)+(Pecuária!$B$36+Pecuária!$E$36)","v":0},{"$f":"(Pecuária!$B$25*Pecuária!$E$25)+(Pecuária!$B$36+Pecuária!$E$36)","v":0},{"$f":"(Pecuária!$B$25*Pecuária!$E$25)+(Pecuária!$B$36+Pecuária!$E$36)","v":0},{"$f":"(Pecuária!$B$25*Pecuária!$E$25)+(Pecuária!$B$36+Pecuária!$E$36)","v":0},{"$f":"(Pecuária!$B$25*Pecuária!$E$25)+(Pecuária!$B$36+Pecuária!$E$36)","v":0},{"$f":"(Pecuária!$B$25*Pecuária!$E$25)+(Pecuária!$B$36+Pecuária!$E$36)","v":0},{"$f":"(Pecuária!$B$25*Pecuária!$E$25)+(Pecuária!$B$36+Pecuária!$E$36)","v":0},{"$f":"(Pecuária!$B$25*Pecuária!$E$25)+(Pecuária!$B$36+Pecuária!$E$36)","v":0},{"$f":"(Pecuária!$B$25*Pecuária!$E$25)+(Pecuária!$B$36+Pecuária!$E$36)","v":0}]
["Bezerros ",{"$f":"(Pecuária!$B$26*Pecuária!C26)+(Pecuária!$B$37+Pecuária!C37)","v":0},{"$f":"(Pecuária!$B$26*Pecuária!D26)+(Pecuária!$B$37+Pecuária!D37)","v":0},{"$f":"(Pecuária!$B$26*Pecuária!$E$26)+(Pecuária!$B$37+Pecuária!$E$37)","v":0},{"$f":"(Pecuária!$B$26*Pecuária!$E$26)+(Pecuária!$B$37+Pecuária!$E$37)","v":0},{"$f":"(Pecuária!$B$26*Pecuária!$E$26)+(Pecuária!$B$37+Pecuária!$E$37)","v":0},{"$f":"(Pecuária!$B$26*Pecuária!$E$26)+(Pecuária!$B$37+Pecuária!$E$37)","v":0},{"$f":"(Pecuária!$B$26*Pecuária!$E$26)+(Pecuária!$B$37+Pecuária!$E$37)","v":0},{"$f":"(Pecuária!$B$26*Pecuária!$E$26)+(Pecuária!$B$37+Pecuária!$E$37)","v":0},{"$f":"(Pecuária!$B$26*Pecuária!$E$26)+(Pecuária!$B$37+Pecuária!$E$37)","v":0},{"$f":"(Pecuária!$B$26*Pecuária!$E$26)+(Pecuária!$B$37+Pecuária!$E$37)","v":0},{"$f":"(Pecuária!$B$26*Pecuária!$E$26)+(Pecuária!$B$37+Pecuária!$E$37)","v":0},{"$f":"(Pecuária!$B$26*Pecuária!$E$26)+(Pecuária!$B$37+Pecuária!$E$37)","v":0}]
["Bezerras ",{"$f":"(Pecuária!$B$27*Pecuária!C27)+(Pecuária!$B$38+Pecuária!C38)","v":0},{"$f":"(Pecuária!$B$27*Pecuária!D27)+(Pecuária!$B$38+Pecuária!D38)","v":0},{"$f":"(Pecuária!$B$27*Pecuária!$E$27)+(Pecuária!$B$38+Pecuária!$E$38)","v":0},{"$f":"(Pecuária!$B$27*Pecuária!$E$27)+(Pecuária!$B$38+Pecuária!$E$38)","v":0},{"$f":"(Pecuária!$B$27*Pecuária!$E$27)+(Pecuária!$B$38+Pecuária!$E$38)","v":0},{"$f":"(Pecuária!$B$27*Pecuária!$E$27)+(Pecuária!$B$38+Pecuária!$E$38)","v":0},{"$f":"(Pecuária!$B$27*Pecuária!$E$27)+(Pecuária!$B$38+Pecuária!$E$38)","v":0},{"$f":"(Pecuária!$B$27*Pecuária!$E$27)+(Pecuária!$B$38+Pecuária!$E$38)","v":0},{"$f":"(Pecuária!$B$27*Pecuária!$E$27)+(Pecuária!$B$38+Pecuária!$E$38)","v":0},{"$f":"(Pecuária!$B$27*Pecuária!$E$27)+(Pecuária!$B$38+Pecuária!$E$38)","v":0},{"$f":"(Pecuária!$B$27*Pecuária!$E$27)+(Pecuária!$B$38+Pecuária!$E$38)","v":0},{"$f":"(Pecuária!$B$27*Pecuária!$E$27)+(Pecuária!$B$38+Pecuária!$E$38)","v":0}]
["Total",{"$f":"SUM(B102:B110)","v":0},{"$f":"SUM(C102:C110)","v":0},0,0,0,0,0,0,0,0,0,{"$f":"SUM(M102:M110)","v":0}]
[]
["Resumo Pecuária "]
["Ano",1,2,3,4,5,6,7,8,9,10,11,12]
["Média de animais",{"$f":"'Evolução rebanho'!H14+'Evolução rebanho'!H98","v":0},{"$f":"'Evolução rebanho'!P14+'Evolução rebanho'!P98","v":0},{"$f":"'Evolução rebanho'!H28+'Evolução rebanho'!H112","v":0},{"$f":"'Evolução rebanho'!P28+'Evolução rebanho'!P112","v":0},{"$f":"'Evolução rebanho'!H42+'Evolução rebanho'!H126","v":0},{"$f":"'Evolução rebanho'!P42+'Evolução rebanho'!P126","v":0},{"$f":"'Evolução rebanho'!H140+'Evolução rebanho'!H56","v":0},{"$f":"'Evolução rebanho'!P56+'Evolução rebanho'!P140","v":0},{"$f":"'Evolução rebanho'!H154+'Evolução rebanho'!H70","v":0},{"$f":"'Evolução rebanho'!P70+'Evolução rebanho'!P154","v":0},{"$f":"'Evolução rebanho'!H83+'Evolução rebanho'!H168","v":0},{"$f":"'Evolução rebanho'!P168+'Evolução rebanho'!P83","v":0}]
["Suporte Forrageiro",{"$f":"'Suporte forrageiro'!F38","v":0},{"$f":"'Suporte forrageiro'!F39","v":0},{"$f":"'Suporte forrageiro'!F40","v":0},{"$f":"'Suporte forrageiro'!F41","v":0},{"$f":"'Suporte forrageiro'!F42","v":0},{"$f":"'Suporte forrageiro'!F43","v":0},{"$f":"'Suporte forrageiro'!F44","v":0},{"$f":"'Suporte forrageiro'!F45","v":0},{"$f":"'Suporte forrageiro'!F46","v":0},{"$f":"'Suporte forrageiro'!F47","v":0},{"$f":"'Suporte forrageiro'!F48","v":0},{"$f":"'Suporte forrageiro'!F49","v":0}]
["Receitas",{"$f":"C17+C52","v":0},{"$f":"E52+E17","v":0},{"$f":"G52+G17","v":0},{"$f":"I52+I17","v":0},{"$f":"K52+K17","v":0},{"$f":"M52+M17","v":0},{"$f":"C69+C34","v":0},{"$f":"E69+E34","v":0},{"$f":"G69+G34","v":0},{"$f":"I69+I34","v":0},{"$f":"K69+K34","v":0},{"$f":"M69+M34","v":0}]
["Despesas",{"$f":"B97+B111","v":0},{"$f":"C97+C111","v":0},0,0,0,0,0,0,0,0,0,{"$f":"M97+M111","v":0}]

{"sheet":"Mem despesas fixas","index":23,"n_rows":28,"n_cols":7,"rows_kept":28,"cut":false,"hidden":true,"merged":[[0,0,0,6]]}
["Despesas Fixas"]
["Discriminação","Ano 1","Ano 2","Ano 3","Ano 4","Ano 5","Ano 6"]
[{"$f":"IF('Despesas Fixas'!A5=\"\",\"\",'Despesas Fixas'!A5)","v":""},{"$f":"IF('Despesas Fixas'!$A$5=\"\",\"\",('Despesas Fixas'!$B$5*'Despesas Fixas'!$C$5)*12)","v":""},{"$f":"IF('Despesas Fixas'!$A$5=\"\",\"\",('Despesas Fixas'!$B$5*'Despesas Fixas'!$C$5)*12)","v":""},{"$f":"IF('Despesas Fixas'!$A$5=\"\",\"\",('Despesas Fixas'!$B$5*'Despesas Fixas'!$C$5)*12)","v":""},{"$f":"IF('Despesas Fixas'!$A$5=\"\",\"\",('Despesas Fixas'!$B$5*'Despesas Fixas'!$C$5)*12)","v":""},{"$f":"IF('Despesas Fixas'!$A$5=\"\",\"\",('Despesas Fixas'!$B$5*'Despesas Fixas'!$C$5)*12)","v":""},{"$f":"IF('Despesas Fixas'!$A$5=\"\",\"\",('Despesas Fixas'!$B$5*'Despesas Fixas'!$C$5)*12)","v":""}]
[{"$f":"IF('Despesas Fixas'!A6=\"\",\"\",'Despesas Fixas'!A6)","v":""},{"$f":"IF('Despesas Fixas'!$A$6=\"\",\"\",('Despesas Fixas'!$B$6*'Despesas Fixas'!$C$6)*12)","v":""},{"$f":"IF('Despesas Fixas'!$A$6=\"\",\"\",('Despesas Fixas'!$B$6*'Despesas Fixas'!$C$6)*12)","v":""},{"$f":"IF('Despesas Fixas'!$A$6=\"\",\"\",('Despesas Fixas'!$B$6*'Despesas Fixas'!$C$6)*12)","v":""},{"$f":"IF('Despesas Fixas'!$A$6=\"\",\"\",('Despesas Fixas'!$B$6*'Despesas Fixas'!$C$6)*12)","v":""},{"$f":"IF('Despesas Fixas'!$A$6=\"\",\"\",('Despesas Fixas'!$B$6*'Despesas Fixas'!$C$6)*12)","v":""},{"$f":"IF('Despesas Fixas'!$A$6=\"\",\"\",('Despesas Fixas'!$B$6*'Despesas Fixas'!$C$6)*12)","v":""}]
[{"$f":"IF('Despesas Fixas'!A7=\"\",\"\",'Despesas Fixas'!A7)","v":""},{"$f":"IF('Despesas Fixas'!$A$7=\"\",\"\",('Despesas Fixas'!$B$7*'Despesas Fixas'!$C$7)*12)","v":""},{"$f":"IF('Despesas Fixas'!$A$7=\"\",\"\",('Despesas Fixas'!$B$7*'Despesas Fixas'!$C$7)*12)","v":""},{"$f":"IF('Despesas Fixas'!$A$7=\"\",\"\",('Despesas Fixas'!$B$7*'Despesas Fixas'!$C$7)*12)","v":""},{"$f":"IF('Despesas Fixas'!$A$7=\"\",\"\",('Despesas Fixas'!$B$7*'Despesas Fixas'!$C$7)*12)","v":""},{"$f":"IF('Despesas Fixas'!$A$7=\"\",\"\",('Despesas Fixas'!$B$7*'Despesas Fixas'!$C$7)*12)","v":""},{"$f":"IF('Despesas Fixas'!$A$7=\"\",\"\",('Despesas Fixas'!$B$7*'Despesas Fixas'!$C$7)*12)","v":""}]
[{"$f":"IF('Despesas Fixas'!A8=\"\",\"\",'Despesas Fixas'!A8)","v":""},{"$f":"IF('Despesas Fixas'!$A$8=\"\",\"\",('Despesas Fixas'!$B$8*'Despesas Fixas'!$C$8)*12)","v":""},{"$f":"IF('Despesas Fixas'!$A$8=\"\",\"\",('Despesas Fixas'!$B$8*'Despesas Fixas'!$C$8)*12)","v":""},{"$f":"IF('Despesas Fixas'!$A$8=\"\",\"\",('Despesas Fixas'!$B$8*'Despesas Fixas'!$C$8)*12)","v":""},{"$f":"IF('Despesas Fixas'!$A$8=\"\",\"\",('Despesas Fixas'!$B$8*'Despesas Fixas'!$C$8)*12)","v":""},{"$f":"IF('Despesas Fixas'!$A$8=\"\",\"\",('Despesas Fixas'!$B$8*'Despesas Fixas'!$C$8)*12)","v":""},{"$f":"IF('Despesas Fixas'!$A$8=\"\",\"\",('Despesas Fixas'!$B$8*'Despesas Fixas'!$C$8)*12)","v":""}]
["Encargos Sociais - 80%",{"$f":"(SUM(B3:B6))*80%","v":0},{"$f":"(SUM(C3:C6))*80%","v":0},0,0,0,0]
["Manutenção",{"$f":"SUM('Despesas Fixas'!$E$11:$E$13)","v":0},{"$f":"SUM('Despesas Fixas'!$E$11:$E$13)","v":0},{"$f":"SUM('Despesas Fixas'!$E$11:$E$13)","v":0},{"$f":"SUM('Despesas Fixas'!$E$11:$E$13)","v":0},{"$f":"SUM('Despesas Fixas'!$E$11:$E$13)","v":0},{"$f":"SUM('Despesas Fixas'!$E$11:$E$13)","v":0}]
["Depreciação ",{"$f":"SUM('Despesas Fixas'!$E$16:$E$18)","v":0},{"$f":"SUM('Despesas Fixas'!$E$16:$E$18)","v":0},{"$f":"SUM('Despesas Fixas'!$E$16:$E$18)","v":0},{"$f":"SUM('Despesas Fixas'!$E$16:$E$18)","v":0},{"$f":"SUM('Despesas Fixas'!$E$16:$E$18)","v":0},{"$f":"SUM('Despesas Fixas'!$E$16:$E$18)","v":0}]
["Seguros",{"$f":"SUM('Despesas Fixas'!$E$21:$E$23)","v":0},{"$f":"SUM('Despesas Fixas'!$E$21:$E$23)","v":0},{"$f":"SUM('Despesas Fixas'!$E$21:$E$23)","v":0},{"$f":"SUM('Despesas Fixas'!$E$21:$E$23)","v":0},{"$f":"SUM('Despesas Fixas'!$E$21:$E$23)","v":0},{"$f":"SUM('Despesas Fixas'!$E$21:$E$23)","v":0}]
[{"$f":"IF('Despesas Fixas'!A26=\"\",\"\",'Despesas Fixas'!A26)","v":""},{"$f":"IF('Despesas Fixas'!$A$26=\"\",\"\",'Despesas Fixas'!$D$26*'Despesas Fixas'!$C$26)","v":""},{"$f":"IF('Despesas Fixas'!$A$26=\"\",\"\",'Despesas Fixas'!$D$26*'Despesas Fixas'!$C$26)","v":""},{"$f":"IF('Despesas Fixas'!$A$26=\"\",\"\",'Despesas Fixas'!$D$26*'Despesas Fixas'!$C$26)","v":""},{"$f":"IF('Despesas Fixas'!$A$26=\"\",\"\",'Despesas Fixas'!$D$26*'Despesas Fixas'!$C$26)","v":""},{"$f":"IF('Despesas Fixas'!$A$26=\"\",\"\",'Despesas Fixas'!$D$26*'Despesas Fixas'!$C$26)","v":""},{"$f":"IF('Despesas Fixas'!$A$26=\"\",\"\",'Despesas Fixas'!$D$26*'Despesas Fixas'!$C$26)","v":""}]
[{"$f":"IF('Despesas Fixas'!A27=\"\",\"\",'Despesas Fixas'!A27)","v":""},{"$f":"IF('Despesas Fixas'!$A$27=\"\",\"\",'Despesas Fixas'!$D$27*'Despesas Fixas'!$C$27)","v":""},{"$f":"IF('Despesas Fixas'!$A$27=\"\",\"\",'Despesas Fixas'!$D$27*'Despesas Fixas'!$C$27)","v":""},{"$f":"IF('Despesas Fixas'!$A$27=\"\",\"\",'Despesas Fixas'!$D$27*'Despesas Fixas'!$C$27)","v":""},{"$f":"IF('Despesas Fixas'!$A$27=\"\",\"\",'Despesas Fixas'!$D$27*'Despesas Fixas'!$C$27)","v":""},{"$f":"IF('Despesas Fixas'!$A$27=\"\",\"\",'Despesas Fixas'!$D$27*'Despesas Fixas'!$C$27)","v":""},{"$f":"IF('Despesas Fixas'!$A$27=\"\",\"\",'Despesas Fixas'!$D$27*'Despesas Fixas'!$C$27)","v":""}]
[{"$f":"IF('Despesas Fixas'!A28=\"\",\"\",'Despesas Fixas'!A28)","v":""},{"$f":"IF('Despesas Fixas'!$A$28=\"\",\"\",'Despesas Fixas'!$D$28*'Despesas Fixas'!$C$28)","v":""},{"$f":"IF('Despesas Fixas'!$A$28=\"\",\"\",'Despesas Fixas'!$D$28*'Despesas Fixas'!$C$28)","v":""},{"$f":"IF('Despesas Fixas'!$A$28=\"\",\"\",'Despesas Fixas'!$D$28*'Despesas Fixas'!$C$28)","v":""},{"$f":"IF('Despesas Fixas'!$A$28=\"\",\"\",'Despesas Fixas'!$D$28*'Despesas Fixas'!$C$28)","v":""},{"$f":"IF('Despesas Fixas'!$A$28=\"\",\"\",'Despesas Fixas'!$D$28*'Despesas Fixas'!$C$28)","v":""},{"$f":"IF('Despesas Fixas'!$A$28=\"\",\"\",'Despesas Fixas'!$D$28*'Despesas Fixas'!$C$28)","v":""}]
["Total ",{"$f":"SUM(B3:B13)","v":0},0,0,0,0,0]
[]
["Discriminação","Ano 7","Ano 8","Ano 9","Ano 10","Ano 11","Ano 12"]
[{"$f":"IF('Despesas Fixas'!A5=\"\",\"\",'Despesas Fixas'!A5)","v":""},{"$f":"IF('Despesas Fixas'!$A$5=\"\",\"\",('Despesas Fixas'!$B$5*'Despesas Fixas'!$C$5)*12)","v":""},{"$f":"IF('Despesas Fixas'!$A$5=\"\",\"\",('Despesas Fixas'!$B$5*'Despesas Fixas'!$C$5)*12)","v":""},{"$f":"IF('Despesas Fixas'!$A$5=\"\",\"\",('Despesas Fixas'!$B$5*'Despesas Fixas'!$C$5)*12)","v":""},{"$f":"IF('Despesas Fixas'!$A$5=\"\",\"\",('Despesas Fixas'!$B$5*'Despesas Fixas'!$C$5)*12)","v":""},{"$f":"IF('Despesas Fixas'!$A$5=\"\",\"\",('Despesas Fixas'!$B$5*'Despesas Fixas'!$C$5)*12)","v":""},{"$f":"IF('Despesas Fixas'!$A$5=\"\",\"\",('Despesas Fixas'!$B$5*'Despesas Fixas'!$C$5)*12)","v":""}]
[{"$f":"IF('Despesas Fixas'!A6=\"\",\"\",'Despesas Fixas'!A6)","v":""},{"$f":"IF('Despesas Fixas'!$A$6=\"\",\"\",('Despesas Fixas'!$B$6*'Despesas Fixas'!$C$6)*12)","v":""},{"$f":"IF('Despesas Fixas'!$A$6=\"\",\"\",('Despesas Fixas'!$B$6*'Despesas Fixas'!$C$6)*12)","v":""},{"$f":"IF('Despesas Fixas'!$A$6=\"\",\"\",('Despesas Fixas'!$B$6*'Despesas Fixas'!$C$6)*12)","v":""},{"$f":"IF('Despesas Fixas'!$A$6=\"\",\"\",('Despesas Fixas'!$B$6*'Despesas Fixas'!$C$6)*12)","v":""},{"$f":"IF('Despesas Fixas'!$A$6=\"\",\"\",('Despesas Fixas'!$B$6*'Despesas Fixas'!$C$6)*12)","v":""},{"$f":"IF('Despesas Fixas'!$A$6=\"\",\"\",('Despesas Fixas'!$B$6*'Despesas Fixas'!$C$6)*12)","v":""}]
[{"$f":"IF('Despesas Fixas'!A7=\"\",\"\",'Despesas Fixas'!A7)","v":""},{"$f":"IF('Despesas Fixas'!$A$7=\"\",\"\",('Despesas Fixas'!$B$7*'Despesas Fixas'!$C$7)*12)","v":""},{"$f":"IF('Despesas Fixas'!$A$7=\"\",\"\",('Despesas Fixas'!$B$7*'Despesas Fixas'!$C$7)*12)","v":""},{"$f":"IF('Despesas Fixas'!$A$7=\"\",\"\",('Despesas Fixas'!$B$7*'Despesas Fixas'!$C$7)*12)","v":""},{"$f":"IF('Despesas Fixas'!$A$7=\"\",\"\",('Despesas Fixas'!$B$7*'Despesas Fixas'!$C$7)*12)","v":""},{"$f":"IF('Despesas Fixas'!$A$7=\"\",\"\",('Despesas Fixas'!$B$7*'Despesas Fixas'!$C$7)*12)","v":""},{"$f":"IF('Despesas Fixas'!$A$7=\"\",\"\",('Despesas Fixas'!$B$7*'Despesas Fixas'!$C$7)*12)","v":""}]
[{"$f":"IF('Despesas Fixas'!A8=\"\",\"\",'Despesas Fixas'!A8)","v":""},{"$f":"IF('Despesas Fixas'!$A$8=\"\",\"\",('Despesas Fixas'!$B$8*'Despesas Fixas'!$C$8)*12)","v":""},{"$f":"IF('Despesas Fixas'!$A$8=\"\",\"\",('Despesas Fixas'!$B$8*'Despesas Fixas'!$C$8)*12)","v":""},{"$f":"IF('Despesas Fixas'!$A$8=\"\",\"\",('Despesas Fixas'!$B$8*'Despesas Fixas'!$C$8)*12)","v":""},{"$f":"IF('Despesas Fixas'!$A$8=\"\",\"\",('Despesas Fixas'!$B$8*'Despesas Fixas'!$C$8)*12)","v":""},{"$f":"IF('Despesas Fixas'!$A$8=\"\",\"\",('Despesas Fixas'!$B$8*'Despesas Fixas'!$C$8)*12)","v":""},{"$f":"IF('Despesas Fixas'!$A$8=\"\",\"\",('Despesas Fixas'!$B$8*'Despesas Fixas'!$C$8)*12)","v":""}]
["Encargos Sociais - 80%",{"$f":"(SUM(B17:B20))*80%","v":0},{"$f":"(SUM(C17:C20))*80%","v":0},0,0,0,0]
["Manutenção",{"$f":"SUM('Despesas Fixas'!$E$11:$E$13)","v":0},{"$f":"SUM('Despesas Fixas'!$E$11:$E$13)","v":0},{"$f":"SUM('Despesas Fixas'!$E$11:$E$13)","v":0},{"$f":"SUM('Despesas Fixas'!$E$11:$E$13)","v":0},{"$f":"SUM('Despesas Fixas'!$E$11:$E$13)","v":0},{"$f":"SUM('Despesas Fixas'!$E$11:$E$13)","v":0}]
["Depreciação ",{"$f":"SUM('Despesas Fixas'!$E$16:$E$18)","v":0},{"$f":"SUM('Despesas Fixas'!$E$16:$E$18)","v":0},{"$f":"SUM('Despesas Fixas'!$E$16:$E$18)","v":0},{"$f":"SUM('Despesas Fixas'!$E$16:$E$18)","v":0},{"$f":"SUM('Despesas Fixas'!$E$16:$E$18)","v":0},{"$f":"SUM('Despesas Fixas'!$E$16:$E$18)","v":0}]
["Seguros",{"$f":"SUM('Despesas Fixas'!$E$21:$E$23)","v":0},{"$f":"SUM('Despesas Fixas'!$E$21:$E$23)","v":0},{"$f":"SUM('Despesas Fixas'!$E$21:$E$23)","v":0},{"$f":"SUM('Despesas Fixas'!$E$21:$E$23)","v":0},{"$f":"SUM('Despesas Fixas'!$E$21:$E$23)","v":0},{"$f":"SUM('Despesas Fixas'!$E$21:$E$23)","v":0}]
[{"$f":"IF('Despesas Fixas'!A26=\"\",\"\",'Despesas Fixas'!A26)","v":""},{"$f":"IF('Despesas Fixas'!$A$26=\"\",\"\",'Despesas Fixas'!$D$26*'Despesas Fixas'!$C$26)","v":""},{"$f":"IF('Despesas Fixas'!$A$26=\"\",\"\",'Despesas Fixas'!$D$26*'Despesas Fixas'!$C$26)","v":""},{"$f":"IF('Despesas Fixas'!$A$26=\"\",\"\",'Despesas Fixas'!$D$26*'Despesas Fixas'!$C$26)","v":""},{"$f":"IF('Despesas Fixas'!$A$26=\"\",\"\",'Despesas Fixas'!$D$26*'Despesas Fixas'!$C$26)","v":""},{"$f":"IF('Despesas Fixas'!$A$26=\"\",\"\",'Despesas Fixas'!$D$26*'Despesas Fixas'!$C$26)","v":""},{"$f":"IF('Despesas Fixas'!$A$26=\"\",\"\",'Despesas Fixas'!$D$26*'Despesas Fixas'!$C$26)","v":""}]
[{"$f":"IF('Despesas Fixas'!A27=\"\",\"\",'Despesas Fixas'!A27)","v":""},{"$f":"IF('Despesas Fixas'!$A$27=\"\",\"\",'Despesas Fixas'!$D$27*'Despesas Fixas'!$C$27)","v":""},{"$f":"IF('Despesas Fixas'!$A$27=\"\",\"\",'Despesas Fixas'!$D$27*'Despesas Fixas'!$C$27)","v":""},{"$f":"IF('Despesas Fixas'!$A$27=\"\",\"\",'Despesas Fixas'!$D$27*'Despesas Fixas'!$C$27)","v":""},{"$f":"IF('Despesas Fixas'!$A$27=\"\",\"\",'Despesas Fixas'!$D$27*'Despesas Fixas'!$C$27)","v":""},{"$f":"IF('Despesas Fixas'!$A$27=\"\",\"\",'Despesas Fixas'!$D$27*'Despesas Fixas'!$C$27)","v":""},{"$f":"IF('Despesas Fixas'!$A$27=\"\",\"\",'Despesas Fixas'!$D$27*'Despesas Fixas'!$C$27)","v":""}]
[{"$f":"IF('Despesas Fixas'!A28=\"\",\"\",'Despesas Fixas'!A28)","v":""},{"$f":"IF('Despesas Fixas'!$A$28=\"\",\"\",'Despesas Fixas'!$D$28*'Despesas Fixas'!$C$28)","v":""},{"$f":"IF('Despesas Fixas'!$A$28=\"\",\"\",'Despesas Fixas'!$D$28*'Despesas Fixas'!$C$28)","v":""},{"$f":"IF('Despesas Fixas'!$A$28=\"\",\"\",'Despesas Fixas'!$D$28*'Despesas Fixas'!$C$28)","v":""},{"$f":"IF('Despesas Fixas'!$A$28=\"\",\"\",'Despesas Fixas'!$D$28*'Despesas Fixas'!$C$28)","v":""},{"$f":"IF('Despesas Fixas'!$A$28=\"\",\"\",'Despesas Fixas'!$D$28*'Despesas Fixas'!$C$28)","v":""},{"$f":"IF('Despesas Fixas'!$A$28=\"\",\"\",'Despesas Fixas'!$D$28*'Despesas Fixas'!$C$28)","v":""}]
["Total",{"$f":"SUM(B17:B27)","v":0},0,0,0,0,0]

{"sheet":"Relatório","index":24,"n_rows":105,"n_cols":5,"rows_kept":105,"cut":false,"hidden":true,"merged":[[1,2,1,4],[93,0,93,4],[94,0,101,4],[44,0,44,4],[45,0,52,4],[54,0,54,4],[55,0,62,4],[73,0,73,4],[74,0,91,4],[71,0,71,1],[70,0,70,1],[69,0,69,1],[68,0,68,1],[67,0,67,1],[66,0,66,1],[65,0,65,1],[104,0,123,4],[34,0,34,4],[35,0,42,4],[7,0,7,4],[8,0,12,4],[14,0,14,4],[15,0,22,4],[24,0,24,4],[25,0,32,4],[64,0,64,1],[2,2,2,4],[4,2,4,4],[5,2,5,4],[3,2,3,4],[103,0,103,4]]}
[]
["Data:"]
["Linha:",{"$f":"IF('Dados Cadastrais'!E3=\"\",\"\",'Dados Cadastrais'!E3)","v":""}]
["Proponente:",null,"Raimundo de Almeida Pantoja Neto"]
["Origem do Recurso:"]
["Finalidade:"]
[]
["1 - Introdução"]
["O presente relatório engloba a análise técnica, econômica e financeira do Projeto que foi baseada em dados históricos, econômicos, de mercado e de instituições de pesquisa e suas conclusões são resultantes da análise dos indicadores técnicos, econômicos e financeiros obtidos."]
[]
[]
[]
[]
[]
["2 - Objetivo do financiamento"]
[]
[]
[]
[]
[]
[]
[]
[]
[]
["3- Enquadramento do Proponente"]
[]
[]
[]
[]
[]
[]
[]
[]
[]
["4 - Analise de Garantias"]
[]
[]
[]
[]
[]
[]
[]
[]
[]
["5 - Aspectos técnicos"]
["De acordo com o projeto, a(s) principal(is) atividade(s) desenvolvida(s) pelo pproponente é a (pecuária e/ou agricultura), sendo que a comercialização da produção pecuária consiste principalmente na venda de _______________________."]
[]
[]
[]
[]
[]
[]
[]
[]
["6 - Analise economica e financeira"]
[]
[]
[]
[]
[]
[]
[]
[]
[]
["Indicadores",null,"Resultado","Cenário 1","Cenário 2"]
["Taxa Interna de Retorno (TIR)",null,{"$f":"Análise!E39","v":0},{"$f":"Análise!E66","v":0},{"$f":"Análise!E94","v":0}]
["Valor Presente Líquido (VPL)",null,{"$f":"Análise!E40","v":0},{"$f":"Análise!E67","v":0},{"$f":"Análise!E95","v":0}]
["Payback simples",null,{"$f":"Análise!E41","v":""},{"$f":"Análise!E68","v":""},{"$f":"Análise!E96","v":""}]
["Payback descontado",null,{"$f":"Análise!E42","v":""},{"$f":"Análise!E69","v":""},{"$f":"Análise!E97","v":""}]
["Taxa Minima de Atratividade (TMA)",null,{"$f":"Análise!E43","v":0.13750000000000001},{"$f":"Análise!E70","v":0.13750000000000001},{"$f":"Análise!E98","v":0.13750000000000001}]
["Relação Custo/Beneficio (B/C)",null,{"$f":"Análise!E44","v":0},{"$f":"Análise!E71","v":0},{"$f":"Análise!E99","v":0}]
["Índice de Lucratividade (IL)",null,{"$f":"Análise!E45","v":0},{"$f":"Análise!E72","v":0},{"$f":"Análise!E100","v":0}]
[]
["7 - Recomendações"]
["Considerando a análise técnica, econômica e financeira do projeto, concluímos pela (viabilidade ou indeferimento), ressaltando que o projeto se bem implementado trará benefícios ao produtor, no entanto, recomendamos:\n1. Análise cadastral e de risco cliente e operação, pelo Núcleo de Análise de Crédito Comercial (NUACE);\nFiscalização e acompanhamento da correta aplicação dos recursos pelo BANPARÁ, referente à todas as inversões financeiras previstas no orçamento, bem como, avaliar (o suporte forrageiro, instalações pecuárias, aguadas, manejo produtivo, reprodutivo, sanitário) e acompanhar a situação ambiental do imóvel e das garantias do financiamento;\n2. Ressaltamos a necessidade do acompanhamento do financiamento, por técnico do Banco, visando resguardar a correta aplicação dos (Recursos e/ou Recursos Obrigatórios financiados).\n"]
[]
[]
[]
[]
[]
[]
[]
[]
[]
[]
[]
[]
[]
[]
[]
[]
[]
[]
["8 - Condicionantes"]
["1. Consultar o Sistema de Operações do Crédito Rural e do Proagro (Sicor) na data da contratação da operação, para confirmar se cliente não contratou operação de crédito rural com recursos obrigatórios em outra instituição financeira após a emissão deste relatório de análise;\n"]
[]
[]
[]
[]
[]
[]
[]
[]
["9 - Conclusão"]
["O proponente se enquadra como beneficiário de crédito rural, e a finalidade do crédito e as condições de financiamento estão de acordo com o estabelecido no manual de crédito rural e nos normativos internos do Banco. \nA análise do pleito foi realizada com base na viabilidade técnica, econômica, financeira, cadastral, legal e ambiental do projeto, apresentado pelo proponente, elaborado pela (técnico ou empresa técnica Credenciada), cujo resultado do estudo se encontra demonstrado em planilhas anexas a este relatório, onde fica evidenciado nos quadros de: Suporte forrageiro atual e projetado, Evolução do rebanho, coeficientes Zootécnicos, Produção e vendas, Receitas e Custos, Fluxo de caixa e indicadores financeiros, que o projeto é viável do ponto de vista técnico, econômico e financeiro, ou seja, demonstram que as receitas geradas são suficientes para cobrir as despesas gerais das fazendas e o investimento do projeto, em conformidade com as condições do financiamento, como prazo, carência, Taxa de juros, definidas pelo Banco Central.\nDiante do exposto, concluímos pela viabilidade técnica, econômica e financeira evidenciada nesta análise, nas condições de financiamento adotadas no estudo, manifestamos favoráveis ao financiamento pleiteado, desde que sejam atendidas as recomendações e condicionantes listadas nos tópicos 7 e 8 deste relatório."]